##TITLE=$$ Begin of the data block
##JCAMP-DX=5.00 $$ ACD/SpecManager v 10.08
##SPECTROMETER/DATA SYSTEM=Varian
##DATE=19 Mar 2013 14:15:28
##DATA TYPE=INFRARED SPECTRUM
##DATA CLASS=XYDATA
##ORIGIN=
##OWNER=
##NPOINTS=3735
##FIRSTX=399.26403809
##LASTX=4000.35498047
##MAXX=4000.35498047
##MINX=399.26403809
##MAXY=217.95031738
##MINY=0.00000100
##XFACTOR=1.0000000000
##YFACTOR=0.000001000000000
##FIRSTY=21.85441399
##DELTAX=0.96440572
##XUNITS=1/CM
##YUNITS=TRANSMITTANCE
##XYDATA=(X++(Y..Y))
399.3B1854414Uk1854413%S6K17950316%k17950316Q2094985Q4472534j49068491j7499028
424.3A%VK06863570p1961471%Tj34902099%ZJ9219748O3050156%Yn134277%ZO8227989
459.1A45363617o1816917l5505772m8040927%L0252549j2269577m50582M1495285N5885212
467.7A14912888j1297646o5200775p817949K1046876R0598809J2674362k9407684K2116729
475.5A47625610p392776k8774971n8390274q25203O9966324K255851n356399O822327
483.2A25930489l7315575j5041916J5513390O122360k269371J2647674k010192P955879
490.9A11532738L5542534K8436096j0265259n7475708j6315331L1639466k3434761
497.6I9659775j9653115K4713715R099197q283515r5986j686043J17333N525467o293618
$$ y = [21854414, 21854414, 21854414, 1, 1, 1, 1, 1, 1, 1, 1, 1, 1, 1, 1, 1, 1, 1, 1, 1, 217950317, 217950317, 1, 82094986, 166567520, 17499029, 1, 1, 1, 1, 1, 206863571, 134902100, 134902100, 134902100, 1, 1, 1, 1, 1, 1, 1, 1, 1, 19219749, 82269905, 82269905, 82269905, 82269905, 82269905, 82269905, 82269905, 82269905, 77135628, 77135628, 77135628, 77135628, 77135628, 77135628, 77135628, 77135628, 77135628, 145363617, 83546700, 48040928, 1, 1, 30252550, 17982973, 17532391, 59027676, 114912888, 103615242, 38414467, 30596518, 51643394, 142242203, 154916565, 125508881, 147625610, 140232834, 111457863, 53067589, 52242386, 122208710, 124464561, 119108162, 125930489, 88614914, 73572998, 89086388, 95208748, 92939377, 105587051, 103576859, 111532738, 147075272, 175511368, 165246109, 107770401, 91455070, 123094536, 99659775, 80006660, 104720375, 113819572, 105536057, 105440071, 103754028, 103871361, 109396828, 103103210]
506.3A03103210j1013572L915695J0947708k085892j2480018J4449432J2794098k0497368
514I9133293l045936J0237609O993493L414825K170273n105881o450180J62964j533089
522.7A05977371m543976m905296J921616N55717l105186R47548L863548L977203j227997
531.4A03460548L484925j024315o218758J72981m075416j008331P067039K587013j875877
540.1A02569809N771065L345077o410881q6204j559227l953636j612198j193032K286217
548.7I9156990L961807J907990l707825l537285J079453J053283l979751J46469N786728
557.4A01867859K65274N30113K488716m45389j025825N14854j804794l755363L929084
566.1A02564529J607468k163315J214371j719666k85881m84855q70377K546646J034539
$$ y = [103103210, 92089638, 96005333, 106953041, 104867149, 92387131, 106836563, 119630661, 99133293, 96087357, 106324966, 113318459, 116733284, 118903557, 113797676, 107347496, 107510460, 105977371, 101433395, 96528099, 98449715, 99005432, 95900246, 96847794, 100711342, 104688545, 103460548, 106945473, 105921158, 99702400, 99875381, 95799965, 94791634, 101858673, 104445686, 102569809, 108340874, 111685951, 105275070, 105188866, 103629639, 99676003, 98063805, 96870773, 99156990, 103118797, 105026787, 101318962, 97781677, 98861130, 99914413, 95934662, 96081131, 101867859, 102133133, 102663246, 105151962, 104706573, 103680748, 104195602, 102390808, 98635445, 102564529, 104171997, 102008682, 103223053, 101503387, 101217506, 100732651, 99862274, 102408920, 103443459]
574.8A03443459k843094k263634P51839k81395O08772j326767k520592L055992J197152
583.5I9821732m85115J696556j070649m82833J00593j627685k73461O06522J356643
592.1I9642303L393731K759857j921326l340546k153205m32511K021286j006050r34364
600.8I8029175J03012j531441J967522K322235J344292J191803j604195k476700k131081
609.5I7214622p77702L034493N156433L24730k304177L31498R2529J91513J012062
618.2A04276001j247635p58720J882660o40862k787064k521659j132195K315277K958321
626.9A02344124J364364p48153k892945k384658K477722J455673k696136Q49433Q74939
635.5A00644363K003533R78363l702927j121483m50615J656891Q32779k882210J85379
$$ y = [103443459, 100600365, 98336731, 99088570, 98807175, 99415947, 98089180, 95568588, 98624580, 99821732, 99336617, 101033173, 99962524, 99479691, 99580284, 97952599, 97679138, 98285660, 99642303, 103036034, 105795891, 103874565, 100534019, 98380814, 97948303, 99969589, 98963539, 98029175, 98132187, 96600746, 98568268, 100890503, 102234795, 103426598, 101822403, 99345703, 97214622, 96436920, 99471413, 104627846, 104952576, 102648399, 102979897, 103072426, 103263939, 104276001, 103028366, 102269646, 104152306, 103511444, 100724380, 98202721, 97070526, 99385803, 102344124, 103708488, 102960335, 100067390, 97682732, 100160454, 101616127, 98919991, 99769424, 100644363, 102647896, 103626259, 99923332, 98801849, 98351234, 100008125, 100840904, 97958694, 98144073]
644.2I8144073l55850j874389J925178L924370J245369L36624J19980k51305L00293
652.9A03514343k090263l37471Q67493k111039N34455J633407k047714j407188o6864
661.6I8489159k3125K70447j115998q3381j06865j591843N853096l742599m595536
670.3I3353355J244576L307793r79104k427169j555130m03344J676491J03295p96662
678.9I3524101q55400r77379j142875j509346J340126J545540o10230j491974m21737
687.6H9400826J284225N46852l14903j593102r26971O57440o7451j021531k80944R00177
697.3H8584618L56971l34419l97072L0808j100746j349839j97113o22398O0120k48131
706.9H4782799k14920Q21205R28680L3890k347244k090401K84874J093170j778007
$$ y = [98144073, 97788223, 95913834, 97839012, 101763382, 103008751, 103345375, 103465355, 103214050, 103514343, 101424080, 101086609, 101954102, 99843063, 100377518, 102010925, 99963211, 98556023, 98489159, 98466034, 98736481, 97620483, 97537102, 97430237, 95838394, 101691490, 97948891, 93353355, 94597931, 97905724, 96926620, 94499451, 92944321, 92540977, 94217468, 94320763, 93524101, 92668701, 91691322, 90548447, 89039101, 90379227, 91924767, 91314537, 89822563, 89400826, 90685051, 91231903, 90917000, 89323898, 88396927, 89054367, 88986916, 87965385, 87684441, 88584618, 88941589, 88607170, 88210098, 88240906, 87140160, 85790321, 85593208, 84970810, 85030930, 84782799, 84567879, 85389084, 86317764, 86351654, 84004410, 81914009, 82198883, 83292053, 81514046]
715.6H1514046k130768N4481o58279R6558j03249m96101j129692k995446N32868K616127
725.2G7300545R41810J106346O96167K21512l72825m63723J847611L256020K898429
733.9H7431892L84118j672028j023590P54082K867286J559296j13541P61803M38599
742.6I1387917J74972M69933J114143N93201m40804o80626K59468K616021J406189
751.3I6900414M44053M53797j466271m72587o8200k12333R41658m26300l20588J850335
760.9I7623978L82843n33036l9634j583039M83277K077141m99482q72749M46548J379601
770.6I8865448O25603r46526k95204J514305J613556N81024P8072n19051l69720j10283
780.2A01037224j74462j83059m38912l97773o86150k08923J900245J849121j319107
$$ y = [81514046, 79383278, 79437759, 78779480, 78876038, 78772789, 78276688, 77146996, 74151550, 74684418, 77300545, 78242355, 79348701, 80044868, 80266380, 79893555, 79429832, 81277443, 84533463, 87431892, 87816010, 86143982, 85120392, 85874474, 88741760, 90301056, 90187515, 90949318, 91387917, 91562889, 92032822, 93146965, 93740166, 93299362, 92618736, 92878204, 95494225, 96900414, 97344467, 97798264, 96331993, 95859406, 95791206, 95578873, 96520531, 96094231, 95773643, 97623978, 98006821, 97473785, 97434151, 95851112, 96334389, 98411530, 97912048, 97039299, 97485847, 98865448, 99491051, 98544525, 98249321, 99763626, 101377182, 101958206, 102036278, 101517227, 101147507, 101037224, 100862762, 100679703, 100240791, 99843018, 99156868, 98947945, 100848190, 102697311, 101378204]
788.9A01378204q13194J269882k6756J02486j41945n28466K158768J437638j617051
797.6A03219566j161865M31893K4833n54481K45544L24135M28009m22539j749450R24469
807.2A01710114K271270q78944j049561J063782K2217m33930K07016j293754l30048
815.9A01288162M93912l21617J014412Q94256m48249j400559p25113P0183m91921l84521
825.5I9988945R9525J985886K35214k271255m59076P49550J384742J6945r02923p45888
835.2A00081665j630989j025055J3001J086998O25869l53805k91535N34996Q08800
843.9I9849945j026840j418114m77608P3662j77383n59075J97930J733261J182701
852.5I9378479j277855o94260q7974K3102M36195J22589Q90381k05368j341743l19321
$$ y = [101378204, 100565010, 101834892, 101808136, 101910622, 101768677, 101240211, 103398979, 104836617, 103219566, 102057701, 102489594, 102514427, 101959946, 102205490, 102529625, 102957634, 102535095, 100785645, 101710114, 103981384, 103102440, 102052879, 103116661, 103138878, 102704948, 102911964, 101618210, 101288162, 101782074, 101460457, 102474869, 103369125, 102920876, 101520317, 100795204, 100865387, 100373466, 99988945, 100088470, 102074356, 102309570, 100038315, 99579239, 100328789, 101713531, 101730476, 100827553, 100081665, 98450676, 97425621, 97438622, 98525620, 99151489, 98797684, 98506149, 99041145, 99849945, 98823105, 97404991, 96927383, 97001045, 96823662, 96264587, 96462517, 98195778, 99378479, 98100624, 97406364, 97318390, 97341492, 97777687, 97900276, 98790657, 98585289, 97243546, 96924225]
862.2I6924225N16189M82232J94732j2588k3224M31679n30602q59527N04516Q30650
871.8I8458282L23563K95220J03111k98157L27690K1675m36638o5010k98484J0910
881.5I8442162J003509M12033j178772p12234k97684Q48152J654755K99362M98848
890.2A00970131o51650j351837m7119L50777M02382k79351j33483L65646n17410j200608
899.8I7907478N51758J279579k16499o67015j165474j007629l70873N84038O73843
908.5I7569206j1085k9877k57645m6447j400315j129677N07966J010734J181702j034523
918.1I6360039o12458P22260j78833k33109j22055o34040J59271K006286j06956r94354
927.8I6366051Q18321K29095n03975p38578R49096J119500r01513p28195k35214Q1779
$$ y = [96924225, 97440414, 97922646, 98117378, 98104790, 98081566, 98513245, 97982643, 97123116, 97627632, 98458282, 98781845, 99077065, 99180176, 98882019, 99209709, 99231384, 98794746, 98729736, 98431252, 98442162, 99445671, 99857704, 98678932, 97966698, 97669014, 98517166, 100171921, 100471283, 100970131, 100318481, 98966644, 98919525, 99270302, 99672684, 99393333, 99259850, 99625496, 99108086, 97907478, 98459236, 99738815, 99522316, 98855301, 97689827, 96682198, 96311325, 96895363, 97569206, 97558121, 97528244, 97270599, 97224152, 95823837, 94694160, 95202126, 96212860, 97394562, 96360039, 95747581, 96469841, 96291008, 96057899, 95935844, 95301804, 95461075, 97467361, 97360405, 96366051, 97184372, 97413467, 96909492, 96170914, 97120010, 98239510, 97337997, 96609802, 96374588, 96456367]
937.4I6456367K77482J45393m39369P2258J070625J10863r51493m23294K76101p83814
947.1I5811119m29047L65731k85553M80552l334q19465R0072J46424l65738n61913
956.7I4428848K41471J178131k9732j064148J44310J23352q79845m61143k79869K21618
966.3I3622993L95310k54608r2690n05241K78061P29446r20547K46391P16393q18390
976I3397118r30077n94986O82343K88391p82524J85508J10138q56666n7701N50277
985.6I1991821n13481O3461m5730m25156J321480O01051p35740l90145K24671K44041
995.3I2336273n14679j30234N28710O2523m96765K81433N09895l56461k58995N80l8353
1005.9I1923927l60496m92417l97995o97052r9792Q13309j09787q82798o51306q92593
$$ y = [96456367, 96733849, 96879242, 96439873, 96512131, 97582756, 97693619, 96742126, 96318832, 96594933, 95811119, 95382072, 95747803, 95462250, 95942802, 95939468, 95120003, 95210075, 95356499, 94990761, 94428848, 94670319, 95848450, 95818718, 94754570, 94898880, 95022232, 94142387, 93681244, 93401375, 93622993, 94018303, 93763695, 93671005, 93165764, 93443825, 94173271, 93252724, 93499115, 94215508, 93397118, 92467041, 91872055, 92554398, 92842789, 92060265, 92245773, 92355911, 91499245, 91441544, 91991821, 91478340, 91541801, 91496071, 91070915, 92392395, 92993446, 92257706, 91867561, 92092232, 92336273, 91821594, 91691360, 92220070, 92282593, 91785828, 92067261, 92577156, 92220695, 91961700, 91962280, 91923927, 91563431, 91071014, 90673019, 89975967, 89876175, 90689484, 90579697, 89696899, 89045593, 88153000]
1015.5H8153000n62790p99171n33982M50714n84388r70391L1243p470j130073j063553
1025.2H2983139k94006k80320p78869q30368j14556q68530q26233o15051k84653Q42568
1034.8G8933121m10599k95319M58023L69210o87264p43873J017715l86406q9302Q92792
1044.5G9058098k37694l19122l53569J88453j87698l74695M29810N26054K39189r445
1054.1G8959381N19379P16438N5130K42516R42215m53171r65523N02426J28205k7024
1063.7H0619972O64772M39072Q57521J349533L17444n06127o11518j00792j40915n73250
1073.4H2315712L77556l2135l58994l29673j386048q24509l23303j87927m86153j175827
1083G7588699r01374n60288o76666n75928j58066o18072p99675j459877j250084R9457
$$ y = [88153000, 87590210, 86791039, 86257057, 86707771, 86123383, 85152992, 85184235, 85176765, 84046692, 82983139, 82689133, 82408813, 81629944, 80799576, 80685020, 79816490, 78990257, 78375206, 78090553, 78933121, 78522522, 78227203, 78685226, 79054436, 78367172, 77623299, 78641014, 78254608, 78165306, 79058098, 78820404, 78501282, 78147713, 78336166, 78148468, 77773773, 78203583, 78729637, 78968826, 78959381, 79478760, 80195198, 80250328, 80492844, 81435059, 80981888, 80016365, 80518791, 80646996, 80619972, 81284744, 81723816, 82581337, 83930870, 84248314, 83742187, 83130669, 83029877, 82888962, 82315712, 82693268, 82661133, 82302139, 81972466, 80586418, 79761909, 79438606, 79250679, 78764526, 77588699, 76687325, 76127037, 75450371, 74874443, 74716377, 74098305, 73298630, 71838753, 70588669, 70688126]
1092.7G0688126m9462n27733j019317p6355L8444m37523M3473M58847J349991N49133
1102.3G1017624M09141J19118m48601L71048L19207O59027J068344O33850m96391p63031
1112G2889336k29340n0812l39981r11651j77285J67626k0561j64025m60258l38105
1121.6G0364944M31214R50996M43749O75644O52977R48623L85536j005035j115715
1130.3G2732933j035294k92717p94921j034134q40531r70024p60086j577591p53052
1139F4674583o21681q67943m38423o74488o38447n96542M06643J3527p59709j022377
1148.6E9475143o57066o44531j658386m62773n26981j151920j019890o56815l42773
1157.3E2354008r93691r09546j223705k60666J7407m85482q0234K6890K51255p30095
$$ y = [70688126, 70638664, 70110931, 69091614, 69015259, 69053703, 68616180, 68659653, 69118500, 70468491, 71017624, 71426765, 71545883, 71097282, 71468330, 71787537, 72446564, 73514908, 74148758, 73652367, 72889336, 72659996, 72609184, 72269203, 71357552, 71180267, 71347893, 71327332, 71163307, 70703049, 70364944, 70796158, 71747154, 72190903, 72866547, 73519524, 74468147, 74853683, 73848648, 72732933, 71697639, 71404922, 70610001, 69575867, 68735336, 67765312, 67005226, 65427635, 64674583, 64052902, 63184959, 62746536, 62072048, 61433601, 60837059, 61243702, 61257229, 60497520, 59475143, 58818077, 58173546, 56515160, 56052387, 55525406, 54373486, 53353596, 52696781, 52354008, 51360317, 50450771, 49227066, 48966400, 48983807, 48498325, 48418091, 48444981, 48696236, 47966141]
1166.9D7966141n57293k03396R9964O05785J8155n6027K25449P02274J53252o1230
1176.6D8893074l9066K93453N06924M1191R59221O62391P7664n4375N20954J580280
1186.2E3441711Q31276L56942O05911N88566L97369Q21003O80931O11073J034038Q24990
1195.9F0193810Q25653J88171N48969P70424N91843J022701L79196M04656L44696N577
1205.5F5275696L44002P24449O19804M49455M28780j16821k3171O0959K24564L25988
1215.1F8313705K50016M07921p4265Q6411J43676j20575l4385R0316k33017p54379
1224.8F8075424l94836q2222K07695j89965m88876k70584l70758j49086l14407k51000
1234.4F5771385l13164K3102J64360n00824m21623k57263J37260j04202R7206N97832
$$ y = [47966141, 47408848, 47205452, 47305416, 47911201, 47929356, 47873329, 48098778, 48801052, 48954304, 48893074, 48854008, 49147461, 49654385, 49695576, 50654797, 51317188, 51394852, 51340477, 51861431, 53441711, 54272987, 54629929, 55235840, 55824406, 56221775, 57042778, 57723709, 58334782, 59368820, 60193810, 61019463, 61207634, 61756603, 62527027, 63118870, 64141571, 64520767, 64925423, 65270119, 65275696, 65619698, 66344147, 66963951, 67413406, 67842186, 67725365, 67702194, 67763153, 67987717, 68313705, 68563721, 68971642, 68897377, 68983788, 69127464, 69006889, 68972504, 69062820, 68829803, 68075424, 67680588, 67598366, 67806061, 67616096, 67127220, 66856636, 66485878, 66336792, 66022385, 65771385, 65458221, 65481323, 65645683, 65144859, 64723236, 64465973, 64603233, 64499031, 64596237, 65194069]
1244.1F5194069J26266J07331L10043M21425L80592P85195O09016M90425O30264Q5610
1253.7F9140236J27281L11020N31692J88012L18206O22040K09633J23604k74094P7790
1263.4G1375420J65207K13111P64725K10007p7896K32559K82677J14685M8286l79372
1273G2949409l0670L68103J10222M41162j32812j85349L60634M69200N92652N04150
1282.7G5446701Q70247P56157O35048P93861O30600L19214J39267O0257M2770K32132
1292.3G9926254L8765r3300p4585l5675k15522m55552l25775m1435N95367L52173n2490
1302.9G9618225l8483K36031M76936N0026M72031L38585K0012K04330p5378J1398K82768
1313.5H1596481L33298k61528l28720k68333k90062K99049L72559L36509O9550J31965
$$ y = [65194069, 65320335, 65427666, 65737709, 66159134, 66539726, 67324921, 67933937, 68424362, 69054626, 69140236, 69267517, 69578537, 70110229, 70298241, 70616447, 71238487, 71448120, 71571724, 71297630, 71375420, 71540627, 71753738, 72518463, 72728470, 72650574, 72883133, 73165810, 73280495, 73328781, 72949409, 72918739, 73286842, 73397064, 73838226, 73705414, 73520065, 73880699, 74349899, 74942551, 75446701, 76316948, 77073105, 77708153, 78502014, 79132614, 79451828, 79591095, 79651352, 79694122, 79926254, 79965019, 79871719, 79797134, 79761459, 79545937, 79090385, 78764610, 78723175, 79318542, 79670715, 79618225, 79579742, 79815773, 80292709, 80342735, 80814766, 81153351, 81173363, 81377693, 81302315, 81313713, 81596481, 81929779, 81668251, 81339531, 81071198, 80781136, 81080185, 81452744, 81789253, 81858803, 81990768]
1323.2H1990768M26789N47256M20410J71486N24933N44357K65015r1301J4153J74041
1332.8H4987907j03172k05208l08250j33843M959K80198j61843r41597n25039l74619
1342.4H2519493j00517k98355n88890l17650J938J24038j55235r9251k6153J72882
1352.1H1232300J65741L02971M59999O3392q3519m0168Q4571l07373L6919r1171q72971
1362.7H0950691n35171j162941j024193m68369n39268q83019q16253k52472k50710
1371.4G5018295k16881n81085k47345l52897j041519l14248R8671J012146J776261
1380.1G5151398J997932J717148J272110P48962R94522J136506P32811J017242j89461
1388.7H4579170K49466O23161k02095j77200k083M70284K17010j50467j61972p698
$$ y = [81990768, 82417557, 82964813, 83385223, 83556709, 84081642, 84625999, 84891014, 84799713, 84813866, 84987907, 84884735, 84679527, 84371277, 84237434, 84242393, 84522591, 84360748, 83419151, 82894112, 82519493, 82418976, 82120621, 81531731, 81214081, 81216019, 81340057, 81184822, 81085571, 81059418, 81232300, 81398041, 81701012, 82161011, 82224403, 82140884, 82100716, 82185287, 81877914, 81914833, 81823662, 80950691, 80415520, 79252579, 78228386, 77760017, 77220749, 76337730, 75521477, 75269005, 75018295, 74801414, 74220329, 73972984, 73620087, 72578568, 72264320, 72362991, 73375137, 75151398, 77149330, 78866478, 80138588, 80887550, 81882072, 83018578, 83751389, 84768631, 84579170, 84828636, 85451797, 85249702, 85072502, 85070419, 85540703, 85757713, 85607246, 85445274, 85437576]
1398.4H5437576K44759P4539N98785O57860N47852O73035R80537N39062K68677P3784
1408I0096466l06564j52817o54617p89353r25812j055435r57847q90251l46489m1398
1417.7H3975883J98403L88557P2502K26098J78993K24876J97388R6252j11450m52865
1427.3H4994637p65366o16989q34885p55226l36639j035035o00250m10194q87589j119758
1437G7632706r89250n20745p22435o2347k93297q10623n39604o17669n29060p01713
1446.6G1845963J79649k52983p88918q06770j333748j324776j702293q29353j559567
1455.3F3427204j525009q28720q19561O18862j028156L1757n28469L55492M18213q80833
1464.9E9240780r3037n51639K122383L109615N494118N383888N783066Q579590J808693
$$ y = [85437576, 85682335, 85756874, 86355659, 87013519, 87561371, 88234406, 89214943, 89754005, 90022682, 90096466, 89789902, 89637085, 88982468, 88193115, 87267303, 86211868, 85254021, 84363770, 84017281, 83975883, 84174286, 84562843, 84635345, 84861443, 85040436, 85265312, 85462700, 85558952, 85447502, 84994637, 84229271, 83612282, 82777397, 82022171, 81685532, 80650497, 80050247, 79640053, 78752464, 77632706, 76643456, 76122711, 75400276, 75337929, 75044632, 74234009, 73694405, 73076736, 72547676, 71845963, 72025612, 71772629, 70983711, 70176941, 68843193, 67518417, 65816124, 64986771, 63427204, 61902195, 61073475, 60253914, 60872776, 59844620, 59876377, 59347908, 59703400, 60121613, 59240780, 59147743, 58596104, 60718487, 63828102, 69322220, 74706108, 80489174, 89068764, 90877457]
1473.6I0877457J160782M84817J807014O96923M73678J143639N28358J288392M15618
1482.3I8876678P72210P84057N11498Q20945N04570O10009o0746J420540J59127m76975
1491.9A03921913k6932k01736M48921M79714J087097m17893k93014q820k23343K74948
1501.6A05040855L4745P0717p2876N14839M35150P44995N44945q66371J67862n01267
1511.2A06113594J42456L26401l23959j09261L26561J556518p44216k35535N63850
1519.9A07616409J753273k81295k803818R9792M37302Q06358q7471j97441J98921q8943
1529.5A07453087k52731k51450N48111L72124K94571k39602p3616L93631k46345l49060
1539.2A07648720j30211Q90716L73749l75702l62915n92636J80458j17874j00052k3834
$$ y = [90877457, 92038239, 92523056, 94330070, 95026993, 95500671, 96644310, 97172668, 98461060, 98876678, 99648888, 100432945, 100944443, 101765388, 102269958, 102879967, 102819221, 104239761, 104398888, 103921913, 103894981, 103693245, 104142166, 104621880, 105708977, 105291084, 104998070, 104989250, 104765907, 105040855, 105075600, 105146317, 105073441, 105588280, 106023430, 106768425, 107313370, 106446999, 106614861, 106113594, 106256050, 106582451, 106258492, 106149231, 106475792, 108032310, 107288094, 107052559, 107616409, 109369682, 109088387, 106284569, 106384361, 106821663, 107628021, 107540550, 107343109, 107542030, 107453087, 107200356, 106948906, 107497017, 107869141, 108163712, 107924110, 107850494, 108244125, 107997780, 107648720, 107518509, 108409225, 108782974, 108407272, 108044357, 107451721, 107632179, 107514305, 107414253, 107390419]
1548.8A07390419K46719K7825j45294K87384j65436o5994L57856N99175J673164J593697
1558.5A11799515m768219o84983R82087j8113P4364j25336K32842L14156k49329J64261
1568.1A07721245J59004K47635m44969l32024K8313J7944L18581L97255M16977l99636
1577.7A08130325m69604m36051k16400J92269L66020j7212m36302J84631K38838q5731
1587.4A07450783j73302j65901J03546o2004o1287j23398l8948K17186L84972r7336
1597A07434311l69415Q2122k90443p1365J78825J99844j5258l68798P3639N1346K64664
1607.6A07169472J22635m3770l13713k23397J13175k61521J07712O3805M41933l25020
1617.3A06851311p84584J03752j62781M3198P156O39702N4565r33838j03271J24718
$$ y = [107390419, 107637138, 107664963, 107519669, 107807053, 107641617, 107575623, 107933479, 108532654, 110205818, 111799515, 107031296, 106346313, 107328400, 107310287, 107384651, 107259315, 107492157, 107806313, 107556984, 107721245, 107880249, 108127884, 107682915, 107350891, 107379204, 107397148, 107715729, 108112984, 108529961, 108130325, 107660721, 107224670, 107008270, 107200539, 107566559, 107549347, 107113045, 107297676, 107536514, 107450783, 107277481, 107111580, 107215126, 107153122, 107091835, 106968437, 106929489, 107146675, 107531647, 107434311, 107064896, 107147018, 106856575, 106785210, 106964035, 107163879, 107148621, 106779823, 106853462, 106904808, 107169472, 107292107, 107248337, 106934624, 106711227, 106824402, 106562881, 106670593, 106734398, 107176331, 106851311, 106066727, 106170479, 106007698, 106050896, 106058052, 106697754, 106752319, 105818481, 105715210, 105839928]
1626.9A05839928O35101l91304l62610j53046k22541k7176K2461O96602l01506J0498
1636.6A05746407L3195o18324m01253o57280k56073j94153j31027l02544O935L17956
1646.2A03543839n10033L03360r15528m42306J45302R14207K823029l375115n36979
1654.9A01949776n28138n7525J6525K96784L26347J49757M22783M72717M70719k89604
1664.5A03230141k77764k53456j51603M94728O18255K19147L2349o27785o79001J46919
1674.2A02751930l7582o26450J53603k65587j83922j14570m2107m41429o52428L7560
1683.8A00579018R32411o57868q51585j33202m83291n91950n66696j091797o26365
1692.5I6508675n24163k93014l81104o92062j049957q73162o46782l034271R7252m8691
$$ y = [105839928, 106475029, 106083725, 105721115, 105568069, 105345528, 105318352, 105340813, 106037415, 105735909, 105746407, 105779602, 105161278, 104760025, 104102745, 103846672, 103652519, 103521492, 103218948, 103225883, 103543839, 103033806, 103337166, 102421638, 101979332, 102124634, 103038841, 105861870, 102486755, 101949776, 101421638, 101364113, 101380638, 101677422, 102003769, 102153526, 102576309, 103049026, 103519745, 103230141, 102952377, 102698921, 102547318, 103042046, 103660301, 103879448, 103911797, 103284012, 102605011, 102751930, 102714348, 102087898, 102241501, 101975914, 101791992, 101677422, 101635315, 101193886, 100541458, 100579018, 101511429, 100853561, 100001976, 99868774, 99385483, 98793533, 98226837, 97135040, 96508675, 95984512, 95691498, 95310394, 94618332, 93568375, 92695213, 92048431, 89014160, 89111412, 89062721]
1702.1H9062721q85925j587303j429581r03229j613685j086449j191017j252182j587097
1710.8G7526253j635086j188317j124305j114731j794327j703201k413834k098007
1718.5F4454445J06529p56794q86669r56081j570679j695706j438907j440434j724174
1727.2E4091530j813122j742039k869381k782451j769783j516346l232067n586350
1734.9C2779991j350630j559806j167393j356095j179840j430130p46639K16768l18618
1743.6B3887608Q55247J60198P28504Q00421J701613K742792J111179L332422K629269
1752.3C7949253L442680L806527L955146M644696N577118M653801L240310M201058
1760G1470589L650009M836136K960418J644623K337731J664054J778992J545006J914932
$$ y = [89062721, 88176796, 86589493, 85159912, 84256683, 82642998, 81556549, 80365532, 79113350, 77526253, 75891167, 74702850, 73578545, 72463814, 70669487, 68966286, 66552452, 64454445, 64560974, 63804180, 62917511, 61961430, 60390751, 58695045, 57256138, 55815704, 54091530, 52278408, 50536369, 47666988, 44884537, 43114754, 41598408, 38366341, 32779991, 31429361, 29869555, 28702162, 27346067, 26166227, 24736097, 23989458, 24206226, 23887608, 24742855, 24903053, 25631557, 26431978, 28133591, 30876383, 31987562, 35319984, 37949253, 41391933, 45198460, 49153606, 53798302, 59375420, 64029221, 67269531, 71470589, 75120598, 79956734, 82917152, 84561775, 86899506, 88563560, 90342552, 91887558, 93802490]
1768.7I3802490P32651M54605J508858J522705N10231j04569O71868L79860K06054
1777.4I9684753K98485L58574P94220J09917J58233K50481L52730M40338K72125k3750
1787A02696106l4248M44892K36336M24973J81129K31446J26190j95824N26459L28720
1796.7A04966179J13281J52863N7449J2932N3062L41439n4093k7450K21931J17188
1806.3A05954781j30326R125J10443J25519M47861k9183l8429l3966r6527J91475J34231
1816.9A06645004J92978L8384k12799j06629K7497P7987L16727L62541o1035m2900
1826.5A07237755K36435L15346J00143p1320j51001k15461l4325R8160N9021k7359
1836.2A07547394J01028J05866j35010k68433P5692M61654K70897N33463j89652o77917
$$ y = [93802490, 94535141, 94989746, 96498604, 98021309, 98531540, 98426971, 99098839, 99478699, 99684753, 99983238, 100341812, 101136032, 101245949, 101404182, 101654663, 102007393, 102447731, 102719856, 102696106, 102661858, 103106750, 103343086, 103768059, 103949188, 104180634, 104306824, 104111000, 104637459, 104966179, 105079460, 105232323, 105289772, 105302704, 105355766, 105697205, 105643112, 105615662, 105837593, 105954781, 105824455, 105833580, 105944023, 106069542, 106517403, 106488220, 106449791, 106415825, 106319298, 106510773, 106645004, 106837982, 106876366, 106663567, 106556938, 106584435, 106662422, 106979149, 107341690, 107280655, 107237755, 107474190, 107789536, 107889679, 107818359, 107667358, 107451897, 107417572, 107515732, 107574753, 107547394, 107648422, 107754288, 107619278, 107350845, 107426537, 107888191, 108159088, 108692551, 108502899, 107824982]
1845.8A07824982J93428L28109k23464k08344J97243J72615j17951j83105K5055j8974
1855.5A07989594j68229J76148K14142J32446R9380j89193o2378J46156j52641j16890
1865.1A08068535L12523J60827J05095J63063j50077j29906k50527j46789O9847M9789
1874.8A08252380q9904n8487N8281k289j42967j47347K30362K70088j5198j06033q0749
1885.4A08168137m9897J1147J40869M4739L1181q9615l0029J27968K0065K36939n5954
1896A08555550k84531L5477P8270o6613j48193k2118M9790J83197J23260o7260J6670
1906.6A08453499J07864J17279m4189p5051j40876q6998J50993J50192J05736K6131
1916.2A08764580O4651j1253k64114n5428J65459J09222N34j10527k46109j60873m1428
$$ y = [107824982, 108018410, 108346519, 108123055, 107914711, 108111954, 108284569, 108166618, 107983513, 108008568, 107989594, 107821365, 107997513, 108211655, 108344101, 108443481, 108254288, 108191910, 108338066, 108185425, 108068535, 108381058, 108541885, 108646980, 108810043, 108659966, 108530060, 108279533, 108132744, 108202591, 108252380, 108162476, 108103989, 108162270, 108159981, 108017014, 107869667, 108100029, 108370117, 108354919, 108248886, 108168137, 108118240, 108129387, 108270256, 108314995, 108346176, 108256561, 108226532, 108354500, 108374565, 108611504, 108555550, 108271019, 108306496, 108384766, 108318153, 108169960, 108147842, 108197632, 108380829, 108504089, 108436829, 108453499, 108561363, 108678642, 108634453, 108559402, 108418526, 108331528, 108482521, 108632713, 108738449, 108764580, 108829231, 108817978, 108553864, 108498436, 108663895, 108773117, 108773651, 108663124, 108417015, 108256142, 108214714]
1926.8A08214714M6143Q4236J06827j6968k44621Q9538L03124q1078k30743J76590
1936.5A08447762J27632k58217L6453Q1619J3588J56189j9630J5953O8970j11649j89522
1947.1A08369148P1633J34155o3782n8441j427M891k6932m7981P7652J50345J8814
1957.7A08628075J22123J1094k86782l2684O6192K3285Q6960q2222p5454J60659q1779
1968.3A08539467k12967j6899l2150K67219K86415k23549k42881J49169K23183o5491
1978A08671516n7380J0490J89972Q1734o9618J49818k12250k72209l0319O0417N6068
1988.6A08578239l4462O2485p6111n7907j19484L7621K06436m791N7159p1716n119
1999.2A08572350r949j83823n5328N3688L7285n6893J75171Q2237j80069n6167J16005
$$ y = [108214714, 108260857, 108345093, 108451920, 108434952, 108190331, 108279869, 108582993, 108501915, 108271172, 108447762, 108575394, 108317177, 108353630, 108435249, 108448837, 108605026, 108585396, 108601349, 108670319, 108558670, 108369148, 108440781, 108574936, 108511154, 108452713, 108451286, 108456177, 108429245, 108381264, 108458916, 108609261, 108628075, 108750198, 108761292, 108474510, 108441826, 108508018, 108531303, 108618263, 108536041, 108460587, 108621246, 108539467, 108326500, 108309601, 108277451, 108544670, 108831085, 108607536, 108364655, 108513824, 108737007, 108671516, 108614136, 108624626, 108814598, 108896332, 108826714, 108976532, 108764282, 108492073, 108461754, 108522171, 108578239, 108543777, 108606262, 108530151, 108472244, 108352760, 108390381, 108596817, 108592026, 108649185, 108577469, 108572350, 108562401, 108378578, 108323250, 108376938, 108414223, 108357330, 108532501, 108614738, 108434669, 108378502, 108494507]
2009.8A08494507O5216j09139K3804Q4435N0315j33468p0427J54068O6093n294k77504
2020.4A08342606q7563k1835j39374J64749P5394n5634Q7807M9309j68228J00204l0533
2031A08316902k85881K19620O0463j79550L120J45584N0690j02623J33819J80329L2951
2041.6A08575424j01250J9425j32065j99768J02303r1019O424J66908O7345j10718
2051.2A08303009m8958K84874l2646j38237R338P8164K23876n8128j87401m4380Q3801
2061.9A08473312J25924m9294J14174J53480j98791L7590n6961j96159K69310L0807
2071.5A08703392j12495O5216k0027p4143n2277N8121M9332K24884J55060o5239j54930
2082.1A08776894k46437N149l4782K4811J22368k11434l471K65953Q0780J34933K01493
$$ y = [108494507, 108559723, 108450584, 108474388, 108558823, 108609138, 108475670, 108405243, 108559311, 108625404, 108620110, 108342606, 108255043, 108233208, 108093834, 108258583, 108333977, 108278343, 108366150, 108415459, 108247231, 108347435, 108316902, 108031021, 108250641, 108311104, 108131554, 108134674, 108280258, 108330948, 108228325, 108362144, 108542473, 108575424, 108474174, 108493599, 108361534, 108161766, 108264069, 108173050, 108179474, 108346382, 108413727, 108303009, 108254051, 108538925, 108506279, 108368042, 108377380, 108455544, 108679420, 108621292, 108433891, 108389511, 108473312, 108599236, 108549942, 108664116, 108817596, 108618805, 108656395, 108599434, 108403275, 108672585, 108703392, 108590897, 108656113, 108636086, 108561943, 108509666, 108567787, 108617119, 108842003, 108997063, 108931824, 108776894, 108530457, 108535606, 108500824, 108525635, 108648003, 108436569, 108433098, 108699051, 108779831, 108914764, 109116257]
2092.7A09116257j17714l00850j08017O2271j50810j05561J47088K0530K34162K32284
2102.4A09029640j70425J861K20894j678k55257k11586L7781J64352j1223K7855J57242
2113A08989456l3012j64185l6369J64749N5420L5538R0240J4443j11046j27205J79520
2123.6A09057549J17866J13831L0784k21443j13281r1370J00197P5272J1886J9554
2133.2A09100845l5019l0952k85339q0574Q6212R0149J80236P6355P0359k3476P3059
2143.8A09221855J29234j47087l12759O0783K08069k38601k17637J15J43646k9495
2153.5A08818123k04048J35048L89740J63642l42445j21254M3923r1431J38367M226
2163.1A08933891r4169O7436J64116m9332j63765K3056N1254J73279M0955l3524M2183
$$ y = [109116257, 108998543, 108697693, 108589676, 108651947, 108501137, 108395576, 108542664, 108563194, 108797356, 109029640, 108859215, 108861076, 109081970, 109080292, 108825035, 108613449, 108651230, 108815582, 108804359, 108832214, 108989456, 108956444, 108792259, 108755890, 108920639, 108976059, 109011597, 109101837, 109116280, 109005234, 108878029, 109057549, 109175415, 109289246, 109320030, 109098587, 108985306, 108893936, 108994133, 109069405, 109081291, 109100845, 109065826, 109034874, 108749535, 108668961, 108755173, 108845322, 109025558, 109101913, 109172272, 109148796, 109221855, 109351089, 109204002, 108891243, 108952026, 109160095, 108921494, 108703857, 108703972, 108847618, 108818123, 108614075, 108749123, 109138863, 109302505, 108960060, 108838806, 108882729, 108791298, 108929665, 108933891, 108839722, 108907158, 109071274, 109021942, 108858177, 108881233, 108932487, 109105766, 109146721, 109113197, 109155380]
2173.7A09155380j99920k67426k34413j679L56392K66381l1052m5525Q5129j15806
2183.4A08967461k85408J9569K27196J4610j54846R7038J44302j76406K5871K07222
2193A09086609J06354J32751j13304k52296j0605K08641R0698j6411M791n5633n547
2203.6A09176048o6169R2277J88538j00678j15814n2544r0500j34292j7502J00731
2213.3A08980095P7133M5357K525J43219J80367l5454j54213q9729k5162r903k08191
2223.9A08906044j09962L96682J53672p1862J3924j92688o7230J05850J7769n4009
2233.5A09098190N2368l4812j67557L1341K35825K27661j05308j21834o3317j25335
2243.2A09027222N7434j3756j09741j33789M4067K89612K7359k26395r8579K9831K4597
$$ y = [109155380, 108955460, 108688034, 108453621, 108451942, 108808334, 109074715, 109043663, 108998138, 109083267, 108967461, 108682053, 108701622, 108928818, 108943428, 108788582, 108885620, 109029922, 108853516, 108879387, 109086609, 109192963, 109325714, 109212410, 108960114, 108949509, 109158150, 109248848, 109232437, 109237228, 109181595, 109176048, 109109879, 109202156, 109390694, 109290016, 109174202, 109121658, 109031158, 108896866, 108879364, 108980095, 109057228, 109102585, 109105110, 109248329, 109428696, 109393242, 109239029, 109149300, 109124138, 109114235, 108906044, 108796082, 109192764, 109346436, 109274574, 109288498, 109095810, 109028580, 109134430, 109152199, 109098190, 109150558, 109115746, 108948189, 108979530, 109215355, 109443016, 109337708, 109215874, 109152557, 109027222, 109084656, 109070900, 108961159, 108827370, 108871437, 109161049, 109188408, 108962013, 108863434, 108893265, 108917862]
2253.8A08917862P5600L746k3919j6639Q049J68083r6642j60316K24602J59240j24664
2264.4A09135002j37298K0919J03112r4307j53954J04820J9722L7506J48903j50139
2274A09034286o3461J06255j53404k05796J30944J52374j23612j01410k3017J21894
2283.7A08875053J16723k10610j48048Q0337L8216O2767R6962J16112M2472k00332
2293.3A08869652j37680n2353o9908M9682l5751j16127M364J19408P5058q553o3919
2303.9A08633873N3329J61225j74652k88201l0212J28159J17286P2411K9213j92559
2313.5A08509872j54937Q6929j06636l55301J33255K70767j93649J94267K79366j39099
2323.2A08524834k1088o805m50707k64030J60324k11441M8591M28841R7916l81043
$$ y = [108917862, 108993462, 108997208, 108973289, 108956650, 108964699, 109132782, 109036140, 108875824, 109100426, 109259666, 109135002, 108997704, 109018623, 109121735, 109027428, 108873474, 108978294, 108998016, 109035522, 109184425, 109034286, 108970825, 109077080, 108923676, 108717880, 108848824, 109001198, 108877586, 108776176, 108753159, 108875053, 108991776, 108781166, 108633118, 108713455, 108751671, 108814438, 108911400, 109027512, 109069984, 108869652, 108731972, 108679619, 108609711, 108659393, 108623642, 108507515, 108511879, 108631287, 108706345, 108697792, 108633873, 108687202, 108848427, 108673775, 108385574, 108355362, 108483521, 108600807, 108673218, 108702431, 108509872, 108354935, 108441864, 108335228, 107979927, 108113182, 108383949, 108190300, 108384567, 108663933, 108524834, 108503746, 108496941, 108046234, 107782204, 107942528, 107731087, 107779678, 108208519, 108306435, 107925392]
2332.8A07925392l19000K4223n0750J65237L5675L4157L8269j2818N8999l42377N5023
2343.4A07612030L69225K73887o6086Q2421J99218k18505m4976Q0902k29423m28520
2353.1A07630173J37634L01758m33876J28334K74978K10404r499J30005j49032p60918
2362.7A07459961J55235K29973O30219P1716o85501o55274m8645R58367j50978j16066
2372.4A07849007P51297J84753j50658K23710K12928k41913o935k128o3340M8638K3598
2383A08828957K47215J91955O5659j3802p7957o3019n8044O851J32736J57029j25817
2393.6A09291763j14120j0674K8092J1398J3702K34909J0399r3238j31821j51940P8362
2404.2A09166832j7204L7048R0485p6683j00678J04927J09116k8420N3475o4041r3392
$$ y = [107925392, 107606392, 107630615, 107579865, 107745102, 107780777, 107814934, 107853203, 107840385, 107899384, 107557007, 107612030, 107981255, 108255142, 108189056, 108271477, 108470695, 108252190, 108207214, 108288116, 108058693, 107630173, 107767807, 108069565, 107635689, 107764023, 108039001, 108249405, 108239906, 108369911, 108220879, 107459961, 107615196, 107845169, 108475388, 108547104, 107861603, 107206329, 107157684, 108116051, 107965073, 107849007, 108600304, 108785057, 108634399, 108858109, 109071037, 108829124, 108822189, 108820061, 108756721, 108805359, 108828957, 109076172, 109268127, 109333786, 109319984, 109242027, 109179008, 109120964, 109127815, 109260551, 109417580, 109291763, 109177643, 109166969, 109195061, 109206459, 109220161, 109455070, 109465469, 109372231, 109240410, 109088470, 109166832, 109149628, 109186676, 109277161, 109200478, 109099800, 109204727, 109313843, 109285423, 109338898, 109274857, 109181465]
2414.8A09181465K419Q1062L3508j48399m1695P9399J13411O7528o7451r6588N8967
2425.4A09263626J0613j78879m2793m3801k2705J87630J68907K6817j19751q7791J22238
2436A09284111J72371N1933r6405l7849L7422k10541L777J51329p1900O0143q858P2083
2447.6A09407616k6200j28730O6627r2384O3240m4853j56846N7068P4410m029j08398
2458.2A09107521J18202j14547j36963J25198p9864N8135R4048M1313P241m3404R5390
2468.8A09272270J54556p1678k87635o180J04980n2170j47323m7432K0729q8463L1906
2479.4A08883560K11090K04499k35520j30112K18392q057n1574j49231N9639J58538
2489.1A09161224j701K5291j08573K4642r5291k65297p6271N6412J24329N0644Q773
$$ y = [109181465, 109183884, 109264946, 109298454, 109150055, 109108360, 109187759, 109301170, 109368698, 109301247, 109204659, 109263626, 109274239, 109095360, 109052567, 109008766, 108986061, 109173691, 109342598, 109369415, 109249664, 109161873, 109284111, 109456482, 109508415, 109412010, 109374161, 109411583, 109201042, 109204819, 109356148, 109284248, 109344391, 109335533, 109407616, 109381416, 109252686, 109319313, 109226929, 109290169, 109245316, 109088470, 109145538, 109219948, 109215919, 109107521, 109225723, 109111176, 108974213, 109099411, 109019547, 109077682, 109171730, 109213043, 109220284, 109176880, 109272270, 109426826, 109355148, 109067513, 109061333, 109166313, 109114143, 108966820, 108919388, 108940117, 108851654, 108883560, 109094650, 109299149, 109063629, 108933517, 109151909, 109143852, 109092278, 108943047, 109002686, 109161224, 109159523, 109184814, 109076241, 109100883, 109005592, 108740295, 108664024, 108720436, 108844765, 108895409, 108904182]
2499.7A08904182L3410Q8867j45020j15539J80465j53907j71730O7390m7852J00541
2509.3A08740807J38275l6560O2332k7298k32712k05467j3848K23755L8758m3251J49986
2519.9A08794777j14441l04893N9585L40279R3795k13890j06895J74339J0918l55904
2529.6A08377670j92207J64749J58455M4945J06376j2992j81946o4942Q5167K9335
2539.2A08514610j27708k617J90804L2531k51434r6672J45325O2530n9776j85074l975
2549.8A08218544J31287M4960j12183j78818J44287Q0445m6624j2718n7831M6235L8696
2560.4A08296280R0439O1699j06385j80282Q4259J32072k66662k08702L6903J20171
2570.1A08059792n50J0544k8046j09626O8657j24962k7611J41663J87652J54640k76283
$$ y = [108904182, 108937592, 109026459, 108881439, 108765900, 108946365, 108792458, 108620728, 108688118, 108640266, 108740807, 108879082, 108842522, 108904854, 108877556, 108644844, 108439377, 108425529, 108649284, 108688042, 108644791, 108794777, 108680336, 108375443, 108435028, 108775307, 108869102, 108655212, 108548317, 108722656, 108733574, 108377670, 108185463, 108350212, 108508667, 108553612, 108659988, 108646996, 108465050, 108400108, 108485275, 108514610, 108386902, 108384285, 108575089, 108607620, 108356186, 108259514, 108404839, 108467369, 108407593, 108222519, 108218544, 108349831, 108394791, 108282608, 108103790, 108248077, 108328522, 108281898, 108269180, 108211349, 108257584, 108296280, 108386719, 108448418, 108342033, 108161751, 108246010, 108378082, 108111420, 107902718, 107939621, 108059792, 108059242, 108069786, 108041740, 107932114, 108000771, 107875809, 107848198, 107989861, 108177513, 108332153, 108055870]
2580.7A08055870r1751P1434r6603q2192k7191j0437p7072o9290j48636J6502J81198
2591.3A07721832P0320n9326j10740k1256j30768N7213K66617J3679k08671l06687
2600.9A07292213J03066L54027j17234j71226Q1573l654l4157l0273p6989q1459q544
2611.5A07307343o4827j51261J18622N4398r8610K6603N8937K9473j82556j19767j8577
2622.1A06959778M3098O9504j60461j41549j61750L8452J15410k06047p4959K9861
2631.8A06511337L5309M9248j58806n0179J56922j1795o8916l4272M3167N257k11891
2642.4A06265381M3159Q6289o6635j44471j31538L13736M3640m17389j45271K09610
2652A06056511J30997j95687j38496R7191J24084j64108q1146m4350k50366J09886
$$ y = [108055870, 107964119, 108035553, 107938950, 107856758, 107829567, 107819130, 107742058, 107672768, 107524132, 107540634, 107721832, 107792152, 107732826, 107622086, 107600830, 107470062, 107527275, 107793892, 107807571, 107598900, 107292213, 107395279, 107749306, 107632072, 107460846, 107542419, 107538765, 107504608, 107474335, 107397346, 107315887, 107307343, 107242516, 107091255, 107209877, 107264275, 107165665, 107192268, 107251205, 107280678, 107098122, 106978355, 106959778, 107002876, 107072380, 106911919, 106770370, 106608620, 106647072, 106762482, 106556435, 106481476, 106511337, 106546646, 106595894, 106437088, 106386909, 106543831, 106532036, 106463120, 106428848, 106472015, 106477272, 106265381, 106308540, 106394829, 106328194, 106183723, 106052185, 106365921, 106409561, 105992172, 105846901, 106056511, 106187508, 105991821, 105853325, 105950516, 106074600, 105910492, 105829346, 105784996, 105534630, 105644516]
2661.7A05644516Q1833l0663M8958j38748k13028j66077M4297J56318J38665k6474
2671.3A05539597j08910l517m7142r8747j02334N2506M4678l5477J43875J96549J8028
2681.9A05599106j15135l2914p5515j69594O0860L03154J39526M7623J09840o8131
2691.6A05798820j20582m8332J40297K9602n0293K88925m4342j64345J83731j068j74370
2702.2A05838043r5756O3919Q3915K9213J08551L8712j11168j05835k09938l38028
2711.8A05301628j28990J54922K04148Q5991l4600o3980J9753o1112j76994m2587l6965
2722.4A05221214j44012j13396J20644J70830j10238j93847K205K7313k76535r0225
2732.1A04613953L49212K68860l0403j80916o2301n265P9239N6809l9086R9549J23992
$$ y = [105644516, 105726349, 105695686, 105744644, 105605896, 105392868, 105226791, 105271088, 105427406, 105566071, 105539597, 105430687, 105427170, 105380028, 105281281, 105178947, 105231453, 105276131, 105240654, 105384529, 105581078, 105599106, 105483971, 105451057, 105375542, 105205948, 105266808, 105569962, 105709488, 105757111, 105866951, 105798820, 105678238, 105629906, 105770203, 105799805, 105749512, 106038437, 105994095, 105829750, 106013481, 106012413, 105838043, 105742287, 105806206, 105890121, 105919334, 106027885, 106066597, 105955429, 105849594, 105639656, 105301628, 105172638, 105327560, 105531708, 105617699, 105583099, 105519119, 105538872, 105477760, 105300766, 105258179, 105221214, 105077202, 104963806, 105084450, 105255280, 105145042, 104951195, 104953400, 104980713, 104704178, 104613953, 104963165, 105232025, 105201622, 105020706, 104958405, 104953140, 105032379, 105089188, 105050102, 105149651, 105273643]
2742.7A05273643J52855M8638q6655r9968k02659j11145J92550K51160j26167l26882
2752.3A04965370j58523L9421O8626N9654k6062j40434P3029k5391j03996J15280J0872
2762.9A04877846J9760R5360q1208l04245k31231j1589J2252q7173k0935Q9470j70151
2773.5A04188156k50099j08612j9631p7262l12043j61842Q8936j21971m57741j40595
2783.2A02627296J30364j7647K7588k30835l53828k34970j80977j03600k49771k05231
2792.8A01208389j32515j81808r8763r8243j52916r9152j86859k54379k21253l80836
2802.5I9401665k11724j85165l91853k32003l18481m30237l98361m26598l78341m02825
2812.1I6026077o02546o84617l90838k78984m98055o46026o28250n47684o25382p49343
$$ y = [105273643, 105426498, 105475136, 105388481, 105288513, 105085854, 104974709, 105167259, 105418419, 105292252, 104965370, 104806847, 104846268, 104914894, 104974548, 104948486, 104808052, 104881081, 104855690, 104751694, 104866974, 104877846, 104897606, 104992966, 104911758, 104607513, 104376282, 104364693, 104376945, 104289772, 104268837, 104358307, 104188156, 103938057, 103829445, 103809814, 103732552, 103420509, 103258667, 103347603, 103225632, 102767891, 102627296, 102757660, 102740013, 102767601, 102536766, 102182938, 101947968, 101766991, 101663391, 101413620, 101208389, 101075874, 100894066, 100795303, 100697060, 100544144, 100444992, 100258133, 100003754, 99782501, 99401665, 99189941, 99004776, 98612923, 98380920, 98062439, 97632202, 97233841, 96807243, 96428902, 96026077, 95423531, 94738914, 94348076, 94069092, 93571037, 92925011, 92296761, 91749077, 91123695, 90374352]
2821.8I0374352p02256p30957r61365j073379j184761j234856j071510j026108j105141
2830.4H1284019j238891j408013j545692j622658j558944j526864j756431k019295
2838.2F8607231k157844k367730k691150l022961l236740l455868l512081l308605
2845.9D4854252l281536l192902k764232k546235k288599j722086j338647r13596m51133
2854.6B6355286N8258N92743Q33097J261700J766470J907722K110592K140957K139133
2863.2C9165958K280556J981911J624542J344658J116474O18076R6184K97783P18269
2871.9D9244411R26854R07707J181892J318257J082100J099056P94304L52611J46538
2880.6E7053730J11290m9000m08825n34298o34357o94023q37078j008728r41632r41295
$$ y = [90374352, 89672096, 88941139, 87979774, 86906395, 85721634, 84486778, 83415268, 82389160, 81284019, 80045128, 78637115, 77091423, 75468765, 73909821, 72382957, 70626526, 68607231, 66449387, 64081657, 61390507, 58367546, 55130806, 51674938, 48162857, 44854252, 41572716, 38379814, 35615582, 33069347, 30780748, 29058662, 27720015, 26806419, 26355286, 26413544, 27006287, 27839384, 29101084, 30867554, 32775276, 34885868, 37026825, 39165958, 41446514, 43428425, 45052967, 46397625, 47514099, 48132175, 48228359, 48526142, 49244411, 50171265, 51078972, 52260864, 53579121, 54661221, 55760277, 56554581, 56907192, 57053730, 57165020, 57116020, 56707195, 56172897, 55538540, 54844517, 54007439, 52998711, 52057079, 51115784]
2890.2E1115784q88214r47922j202355j136871r07486r21902r64927r38088j111423
2898.9D2096596j131882r43863j062145j155838j067627j036789q98537j072075j357593
2907.6C2370247j122912r35018r50050j165461j395681j289988j225048j234592j188002
2916.3B1863495r82453r66472j023733r24160r24567n81594m06157m06663j75420m0488
2925.9A5431788o0890k2123L53332L28964K82247N53057O71942P23385P23644R54111
2935.6A9939457J061745J165001J246891J202671J400573J445113J329439J264381
2943.3C0055271J241388J223410J225582Q90183M10377K98634K61158K02331k2052
2952C5786282j47397j24229l6854K63279M31771N34111N90786Q03516J100132J324612
$$ y = [51115784, 50227570, 49279648, 48077293, 46940422, 46032936, 45111034, 44146107, 43208019, 42096596, 40964714, 40020851, 38958706, 37802868, 36735241, 35698452, 34799915, 33727840, 32370247, 31247335, 30312317, 29362267, 28196806, 26801125, 25511137, 24286089, 23051497, 21863495, 20881042, 19914570, 18890837, 17966677, 17042110, 16460516, 16054359, 15647696, 15472276, 15431788, 15370898, 15348775, 15702107, 16031071, 16313318, 16866375, 17538317, 18261702, 18985346, 19939457, 21001202, 22166203, 23413094, 24615765, 26016338, 27461451, 28790890, 30055271, 31296659, 32520069, 33745651, 34635834, 35046211, 35344845, 35606003, 35808334, 35786282, 35638885, 35514656, 35477802, 35741081, 36172852, 36706963, 37297749, 38101265, 39201397, 40526009]
2961.6D0526009J557724J597969J701900J966377K191853K189507K231964K147533
2969.3E6110836J888371J872047J993687J905815J391475J328598J480248J075890
2977F9046967J042617J366036J206543J016495R81948R18053R33838P46994P98424
2985.7G8057915Q84475O52466N33554L36037M30771K77237k14340l11951m37729m67773
2995.3G9740662n59151q24638j088036j238182j252739j452690j423668j294716j246078
3004F9360764j125069r97162n57671k00203O5499N01968R44527J343460J604057J835442
3013.7G2775612K089180K208099K104500K096031K230545K320282K013619J480598
3021.4H9318466J570290J730934J193207Q64029R19197P90748O82839M72793N60822
$$ y = [40526009, 42083733, 43681702, 45383602, 47349979, 49541832, 51731339, 53963303, 56110836, 57999207, 59871254, 61864941, 63770756, 65162231, 66490829, 67971077, 69046967, 70089584, 71455620, 72662163, 73678658, 74660606, 75578659, 76512497, 77259491, 78057915, 78942390, 79594856, 80128410, 80464447, 80895218, 81172455, 80958115, 80646164, 80208435, 79740662, 79181511, 78356873, 77268837, 76030655, 74777916, 73325226, 71901558, 70606842, 69360764, 68235695, 67238533, 66680862, 66480659, 66546158, 67048126, 67992653, 69336113, 70940170, 72775612, 74864792, 77072891, 79177391, 81273422, 83503967, 85824249, 87837868, 89318466, 90888756, 92619690, 93812897, 94676926, 95596123, 96386871, 97069710, 97542503, 98103325]
3030.1I8103325P08946L65158M08486M36309J80153K33300M52735M42788J40747J80000
3039.7A01651947L13034J29425J72211J99684M7630J35002J18874r0286n0125K41958
3049.4A02869354L03047N211k5070J30173J39976J21048k4482j23276m5754k3651L3776
3060A03360352J73896M2107m7684O2035P6813N5938q8829j7532K01736K59011R2964
3070.6A04170807p6630K04148J94854n0178k0447Q8692J69227R0470Q2954R9587J37275
3081.2A05090759l5515q4671K84020J78184q1642j46446k1225J36383r8671j21132
3090.8A05100044J06293J31607J15036J39893Q6135K1500j01562j85845J66977L89259
3100.5A05969337o3751k81875M3205O5102j51429j79977J8257J95168m7730j90086
$$ y = [98103325, 98812271, 99177429, 99585915, 100022224, 100202377, 100435677, 100888412, 101331200, 101471947, 101651947, 101964981, 102094406, 102266617, 102466301, 102513931, 102648933, 102767807, 102677521, 102627396, 102869354, 103172401, 103177612, 103152542, 103282715, 103422691, 103543739, 103519257, 103395981, 103350227, 103326576, 103360352, 103534248, 103576355, 103528671, 103590706, 103667519, 103723457, 103634628, 103617096, 103818832, 104077843, 104170807, 104094177, 104298325, 104493179, 104443001, 104422554, 104511246, 104680473, 104770943, 104853897, 104953484, 105090759, 105055244, 104970573, 105254593, 105432777, 105351135, 105204689, 105183464, 105319847, 105221176, 105100044, 105206337, 105337944, 105452980, 105592873, 105679008, 105700508, 105598946, 105413101, 105580078, 105969337, 105905586, 105623711, 105666916, 105732018, 105580589, 105400612, 105418869, 105614037, 105566307, 105376221]
3110.1A05376221R1049L32794J27258j54571q3634O6895L47801J57303l84872l55446
3119.8A05520798j87767N8738J63804o6727M5006Q0940K4254K4406l8421R1094k00683
3130.4A05515442l47290r1767j02951J70647K84508J75659q8562l20351p3600P4920
3140A05196655K35588J969r5818J30600q1688p8087j20834j05820K0058J30760L4775
3150.6A05268158j87218J25099J49895L7346j98944k80571j6953m2907Q1329j39114
3160.3A04796120k2126J68320j82297r4543p9643J47148J48742l37142k56829L9116
3169.9A04326866J44539J16158N11m8905P8286j41350j90010K21679J32088j55861
3179.5A04484001l86474k62490J86630J78505J435m8355q5045n9883o0349j8188J92718
$$ y = [105376221, 105467270, 105800064, 105927322, 105772751, 105689117, 105756012, 106103813, 106261116, 105876244, 105520798, 105333031, 105391769, 105555573, 105488846, 105533852, 105614792, 105639046, 105663452, 105625031, 105716125, 105515442, 105168152, 105076385, 104973434, 105144081, 105428589, 105604248, 105515686, 105195335, 105121735, 105196655, 105432243, 105434212, 105338394, 105468994, 105387306, 105309219, 105188385, 105082565, 105102623, 105233383, 105268158, 105080940, 105206039, 105355934, 105393280, 105194336, 104913765, 104896812, 104853905, 104935234, 104796120, 104773994, 104942314, 104760017, 104665474, 104585831, 104732979, 104881721, 104544579, 104287750, 104326866, 104471405, 104587563, 104588074, 104539169, 104617455, 104476105, 104286095, 104507774, 104639862, 104484001, 104097527, 103835037, 104021667, 104200172, 104201607, 104153252, 104068207, 104008324, 103947975, 103929787, 104122505]
3190.1A04122505J09268j93702j86386P9094O9595l74924l30681P8133P8949l3768
3199.8A03418083l6308j5717P8934M0581J3176J64207n9295j14296j09711j73668J61331
3210.4A03367317m898l4950K7778j17393N1682o5186j30508j48079l2967L8216r5932
3221A02855080J12800k1644j33225J47682Q3420j48422j01349j55716q0643J60523
3230.7A02718506r5513n7594J9577L1105O5094l36723j50322p1022m1016K16034j69967
3241.3A02128159o1333R9602j01235q194j52694j62247J16165J77879p820j70418n7739
3251.9A01800125M1138K7603j24702k57699L4012k212k70050m1825o7733j64704Q4168
3262.5A01058121J74309R6939j34896k58667n4954J5800k9899Q4327M7638J1696J21529
$$ y = [104122505, 104231773, 104038071, 103851685, 103930779, 104000374, 103625450, 103294769, 103372902, 103451851, 103418083, 103381775, 103366058, 103444992, 103485573, 103498749, 103662956, 103603661, 103489365, 103379654, 103205986, 103367317, 103362419, 103327469, 103355247, 103237854, 103289536, 103224350, 103093842, 102945763, 102912796, 102951012, 102855080, 102967880, 102946236, 102813011, 102960693, 103044113, 102895691, 102794342, 102638626, 102557983, 102718506, 102622993, 102565399, 102584976, 102616081, 102681175, 102344452, 102194130, 102123108, 102082092, 102298126, 102128159, 102066826, 102166428, 102065193, 102056999, 101904305, 101742058, 101858223, 102036102, 102028282, 101857864, 101800125, 101841263, 101868866, 101744164, 101486465, 101520477, 101518265, 101248215, 101206390, 101138657, 100973953, 101058121, 101232430, 101329369, 101194473, 100935806, 100880852, 100896652, 100866753, 100951080, 100998718, 101010414, 101131943]
3273.1A01131943j79543l40317J8235Q0795l6690j44447k18239Q1955J11000j66313
3282.7A00338379j06239O8145M2939o3271m0062p5424j55731j60332j9569J60141O7604
3293.3A00056580l2326k45880k52495J13655J01654j21506q4732N4146m2725K8092
3303I9574463J45622J618j50986k45987M0604j26336k00409K73949o5132j49979J32927
3313.6I9230354p1769j92894j30021n7373k426l0716k07252N4069K77451K151k441
3324.2I8869133L9963m0612j56608j87767r1263J549R0751m1244m0970L8048q1772
3334.8I8399208p2082o1837j64695J670J96083j24778k21443Q6891j9646q2260P9452
3345.4I8016563j7433o0646Q0269l6735k06513N844N9250o7772p4882k42302j16349
$$ y = [101131943, 100952400, 100612083, 100630318, 100711113, 100674423, 100529976, 100311737, 100393692, 100504692, 100338379, 100232140, 100300285, 100343224, 100279953, 100239891, 100164467, 100008736, 99848404, 99828835, 99988976, 100056580, 100024254, 99778374, 99525879, 99639534, 99741188, 99619682, 99534950, 99589096, 99546371, 99574463, 99720085, 99721703, 99570717, 99324730, 99365334, 99238998, 99038589, 99312538, 99247406, 99097427, 99230354, 99158585, 98965691, 98835670, 98778297, 98775871, 98745155, 98537903, 98591972, 98869423, 98871574, 98869133, 98909096, 98868484, 98711876, 98524109, 98432846, 98434395, 98525146, 98483902, 98442932, 98480980, 98399208, 98327126, 98265289, 98100594, 98102264, 98298347, 98173569, 97952126, 98039017, 98019371, 97937111, 98016563, 97999130, 97938484, 98018753, 97982018, 97775505, 97781349, 97840599, 97772827, 97697945, 97455643, 97339294]
3356I7339294P2022Q2046J35476j35796j7326M0825l68966j45156J26792J53481R5039
3366.6I7377731j10611j55235r0538R2606J07566j59416k34985k7084P7537l9047j95519
3377.2I6643005j31446L5964k9922n3726L2127J47080o1707j62125J33935k83509l29857
3387.8I5939819J42655J81160K71072Q7731j328k4406j58921j23321k98821j30157
3397.5I5885483J91665J09070j4717r643o3332j88675m5540L365J31820K81220j33629
3408.1I6147087l99200l08968m8393K15309N7106j41769j55068K8000K63115N1643
3417.7I5708862j49398m777j1749q0147k9335l0906K2392P7873r323K7680o6079k90229
3429.3I5164864J54754L85658p6309j05880M2625m5685k85606k07970J47171M5311
$$ y = [97339294, 97411316, 97493362, 97628838, 97493042, 97475716, 97516541, 97147575, 97002419, 97129211, 97282692, 97377731, 97267120, 97111885, 97021347, 97113953, 97221519, 97062103, 96827118, 96800034, 96877571, 96838524, 96643005, 96511559, 96547523, 96517601, 96463875, 96496002, 96643082, 96581375, 96419250, 96553185, 96269676, 95939819, 96082474, 96263634, 96534706, 96622437, 96621109, 96596703, 96437782, 96314461, 96015640, 95885483, 96077148, 96186218, 96171501, 96161858, 96098526, 95909851, 95864311, 95867676, 95999496, 96280716, 96147087, 95747887, 95438919, 95390526, 95605835, 95662941, 95521172, 95366104, 95394104, 95657219, 95708862, 95559464, 95554687, 95542938, 95462791, 95433456, 95402550, 95424942, 95502815, 95493492, 95521172, 95455093, 95164864, 95319618, 95705276, 95628967, 95523087, 95565712, 95520027, 95234421, 95026451, 95173622, 95218933]
3439I5218933q3809n7106J26244J62674k83417k62772l8864N615J5313J11656K06070
3449.6I5120537r2941j58417p7759r3918l2432M631K77122j5427l33290Q5038N9921
3460.2I4743065j67580m5433K55470K88491k66274m22325P7660K89535N6114p5149
3469.8I4733574J01997J92284q667j58165j14021R8213M5685j34842J69937L81172
3479.5I5307167J32965j13510m0199J73637J67442r948o3958J68374N6808l19313k56607
3490.1I5202858L2593J52237J52069L13293O1882m8240K27706o9297m3015J56388K1972
3500.7I6160446J13762K78091K6520k89108O3179J1223k00577K29370K16660L4408
3510.3I6643974M9118q6959Q2870J71936R3056r1423k24587J14807J84182p0755K2499
$$ y = [95218933, 95135124, 95078018, 95204262, 95366936, 95083519, 94820747, 94781883, 94787498, 94802811, 94914467, 95120537, 95027596, 94869179, 94791420, 94697502, 94665070, 94669701, 94946823, 94931396, 94598106, 94683144, 94743065, 94575485, 94530052, 94785522, 95074013, 94807739, 94385414, 94463074, 94752609, 94808723, 94733574, 94835571, 95027855, 95019188, 94861023, 94747002, 94845215, 94890900, 94756058, 94925995, 95307167, 95440132, 95326622, 95286423, 95460060, 95627502, 95617554, 95553596, 95721970, 95778778, 95459465, 95202858, 95235451, 95387688, 95539757, 95853050, 95914932, 95866692, 96094398, 96025101, 95982086, 96138474, 96160446, 96274208, 96552299, 96578819, 96289711, 96352890, 96364113, 96163536, 96392906, 96609566, 96643974, 96693092, 96606133, 96689003, 96860939, 96953995, 96862572, 96637985, 96752792, 96936974, 96866219, 96888718]
3520.9I6888718J22619J92955J88385j12816R4452L99720M4006l7972p888K6504J25672
3531.5I7924355j57708Q652J08643P3555M03373J43692n3962N0079k0035j6708J83357
3542.1I8647293L17421J15883J84196K52640P8476M8912n058J42273K79198J33369
3551.8A00194603L1471J23535q2527n9212K68502K22297K12502J60332J13647L79234
3561.4A01564384K15004p385L9215J63307P21093O21063l41812q7776J88201o6688
3571.1A03008606m2244J14143K36260J43318n2071O1684J73851O1043R9205K67494
3580.7A04071289M2397K25753O11107K70256R9739K36679R3766P461j34384r7664M6402
3591.3A05472801J58684K50488K59957J77177O1241l4431J72836J73111r3002j11710
$$ y = [96888718, 97011337, 97204292, 97392677, 97279861, 97374313, 97774033, 97818039, 97780067, 97772179, 97798683, 97924355, 97766647, 97775299, 97883942, 97957497, 98360870, 98504562, 98450600, 98500679, 98480644, 98463936, 98647293, 98964714, 99080597, 99264793, 99517433, 99595909, 99644821, 99639763, 99782036, 100061234, 100194603, 100226074, 100349609, 100267082, 100207870, 100476372, 100698669, 100911171, 101071503, 101185150, 101564384, 101779388, 101772003, 101811218, 101974525, 102695618, 103316681, 102974869, 102887093, 103075294, 103008606, 102966362, 103080505, 103316765, 103460083, 103408012, 103469696, 103643547, 103704590, 103803795, 104071289, 104113686, 104339439, 104950546, 105220802, 105320541, 105557220, 105650986, 105658447, 105524063, 105426399, 105472801, 105631485, 105881973, 106141930, 106319107, 106380348, 106345917, 106518753, 106691864, 106598862, 106487152]
3601A06487152j03004P9284J55823M8134Q278J89094M22219K6779J81801J15692j7380
3611.6A07593872L11180k975o005q4007j97006K12112K82303J93070M99565k6848m48677
3622.2A08326584k45369o3904J02341L24264K83074M62723M83032r61609l16010O2844
3631.8A08457970J31729L33885O660l39691L7087L2417j11519J69731R2934M3495L2005
3642.4A08886703k3513Q0291K38213P17705P31537p20887J8021P00264k46651p77710
3652.1A09603973n16822j95748l0777J93390J33896j28357L03543R2056k28462K08451
3661.7A09435143J57432j68587k85888k50435J23375K54623N24346J204353M55124
3670.4A11449486q23097p91642l57551L86665J274696K20421q22731l87512p5561j72104
$$ y = [106487152, 106384148, 106463432, 106619255, 106667389, 106675667, 106864761, 107286980, 107313759, 107495560, 107611252, 107593872, 107905052, 107902077, 107896072, 107812065, 107615059, 107827171, 108109474, 108302544, 108802109, 108775261, 108326584, 108081215, 108017311, 108119652, 108443916, 108726990, 109189713, 109672745, 108711136, 108395126, 108457970, 108589699, 108923584, 108930244, 108590553, 108627640, 108660057, 108548538, 108718269, 108811203, 108854698, 108886703, 108863190, 108943481, 109181694, 109899399, 110630936, 109910049, 109928070, 110628334, 110381683, 109603973, 109087151, 108891403, 108860626, 109054016, 109187912, 109059555, 109363098, 109455154, 109226692, 109435143, 109592575, 109423988, 109138100, 108887665, 109011040, 109265663, 109790009, 110994362, 111449486, 110626389, 109834747, 109477196, 109863861, 111138557, 111358978, 110536247, 110148735, 110073174, 109901070]
3680A09901070m6967J02562Q8646j70158j83190J26007J50688O23566M50203p73849
3689.7A10268578n1033j71982k61574j0147Q4587K59247J50703l28399k43355J04728
3699.3A09801353Q4885J17867M53300J82388k35244o8879Q4847j87721j94306J31623
3709A10170113M10301q927j45568p5440P40n3329p4555l3813p6470J13663J8913q1276
3720.5A10164352L73650M81407j58874k91977k87712Q2313J05675l72635J4626N04798
3730.2A10615623O67397N72723q71360j90300J87774n86372R2483R9381J14418J55571
3739.8A10857338R3910j18133k02401K58568R64989j189293k79556M80987m127k26601
3749.5A10635681Q07060K06314N5718m38911n13855l30887N8784m539q6777M05113
$$ y = [109901070, 109854103, 109956665, 110045311, 109875153, 109691963, 109817970, 109968658, 110592224, 111042427, 110268578, 110217545, 110045563, 109783989, 109773842, 109858429, 110117676, 110268379, 109939980, 109696625, 109801353, 109886238, 110004105, 110457405, 110639793, 110404549, 110335670, 110420517, 110232796, 110038490, 110170113, 110580414, 110571487, 110425919, 110350479, 110351219, 110297890, 110223335, 110189522, 110113052, 110226715, 110245628, 110164352, 110538002, 111019409, 110860535, 110568558, 110280846, 110363159, 110468834, 110096199, 110110825, 110615623, 111283020, 111855743, 110984383, 110794083, 110981857, 110395485, 110487968, 110587349, 110701767, 110857338, 110951248, 110833115, 110630714, 110889282, 111854271, 110664978, 110385422, 110866409, 110862282, 110635681, 111442741, 111649055, 111704773, 111265862, 110752007, 110421120, 110479904, 110475365, 110388588, 110793701]
3759.1A10793701K41150m60838l15079j86485m4831L67279L20633l46840K5574L10593
3768.8A10704857L12858l00506m91173j35155J81694J37864j40069J7151M4594M2351
3778.4A10374466J34041j33873n623k1469J5343J68579L1219r5459j00021k46651k35001
3789A09885551k7236K08686L70865o6009k42935l7507J00991M41871J55342Q8974Q4565
3799.6A10963158O52038J208374j510002r44771k48207K65190L04230l55354l8307
3808.3A10296349J02424o9588q1436K50672k13379m03588K59934N90378M32365j74469
3817.9A10989662N676J09269m27559o06430p1160J83861K12311J29852J68915O0974
3827.6A10755371k51205k32682Q4511J66504J19248O4155L80074M10858n41390k99720
$$ y = [110793701, 111034851, 110574013, 110258934, 110072449, 110027618, 110394897, 110715530, 110368690, 110394264, 110704857, 111017715, 110717209, 110226036, 110090881, 110272575, 110410439, 110270370, 110287521, 110332115, 110374466, 110508507, 110374634, 110369011, 110347542, 110362885, 110531464, 110562683, 110467224, 110367203, 110120552, 109885551, 109858315, 110067001, 110437866, 110371857, 110128922, 110091415, 110192406, 110634277, 110789619, 110878593, 110963158, 111615196, 112823570, 111313568, 110368797, 110120590, 110385780, 110690010, 110334656, 110296349, 110398773, 110329185, 110247749, 110498421, 110285042, 109881454, 110141388, 110731766, 111164131, 110989662, 110995338, 111104607, 110677048, 110070618, 109999458, 110183319, 110395630, 110525482, 110694397, 110755371, 110504166, 110271484, 110355995, 110522499, 110641747, 110705902, 111085976, 111496834, 110955444, 110655724]
3837.2A10655724M89837K12921l10722m88617j00243R2644L1082k67181j37779R0522
3846.9A10268188q1260j16989J88209J26747L60390R26468K05521m41437o59531l13255
3856.5A10463051l03436j7418M3365r7557J95580L95149j1192Q1962M79797n24543
3866.2A10704758o46431M0573L70048P67113J8272n72456j96434j37161k12906J31691
3875.8A10267067m9660l7254J92642K40189N46646k27326m95597q4435J9318K78885
3885.4A10650475L82820k86370l49205l29666P71M70474K4094j79734J46080l08586
3895.1A10221153m48898J59431M45092L98147n3726k59712l7552J22810J50444o3362
3904.7A10633827k52525r7313j96068k02034J01402M2824r6115J43562L75275K7123
$$ y = [110655724, 111145561, 111358482, 111047760, 110559143, 110458900, 110551544, 110582626, 110315445, 110177666, 110268188, 110186928, 110069939, 110258148, 110384895, 110745285, 111671753, 111877274, 111435837, 110776306, 110463051, 110159615, 110142197, 110185562, 110088005, 110283585, 110678734, 110667542, 110749504, 111229301, 110704758, 110058327, 110098900, 110468948, 111236061, 111254333, 110681877, 110485443, 110348282, 110135376, 110267067, 110217407, 110180153, 110372795, 110612984, 111159630, 110932304, 110436707, 110352272, 110371590, 110650475, 111033295, 110746925, 110397720, 110068054, 110068825, 110539299, 110563393, 110383659, 110529739, 110221153, 109772255, 109931686, 110376778, 110774925, 110721199, 110461487, 110423935, 110546745, 110697189, 110633827, 110381302, 110283989, 110087921, 109885887, 109987289, 110030113, 109933998, 110077560, 110452835, 110479958]
3914.4A10479958l21373J77452L04344l58704m89692p4913L66325j13197m8935L27705
3924A10248970J70197o1661r1294l29116l54317J23360K59887K34932j8219J6098J50864
3934.6A10349701m86809m20418J31440J38298N9211j5350q0368N31784M94484n15465
3944.3A10186508l83629j42830L43232J58065m35936J37429O3026l03787r5161J73736
3953.9A09700653K0889K49138L34831k33810j00639l14308r5482K15095k30980o897
3963.6A09538490o9824K9907J56578p6522k8054L0594Q6403n9387j46652j9577J29974
3974.2A09571930M3243J07582R8908k78717j96221K3835K12089N0423j91940K9426
3983.8A09470558m684o9245J55396K29355J21017l1364l29071o1394L00362J49993
$$ y = [110479958, 110158585, 110336037, 110640381, 110281677, 109791985, 109717072, 110083397, 109970200, 109921265, 110248970, 110419167, 110357506, 110266212, 109937096, 109582779, 109706139, 109966026, 110200958, 110182739, 110198837, 110349701, 109862892, 109442474, 109573914, 109712212, 109771423, 109756073, 109675705, 110207489, 110701973, 110186508, 109802879, 109660049, 110003281, 110161346, 109725410, 109862839, 109925865, 109622078, 109526917, 109700653, 109721542, 109970680, 110305511, 110071701, 109971062, 109656754, 109561272, 109776367, 109545387, 109538490, 109468666, 109498573, 109655151, 109578629, 109550575, 109581169, 109667572, 109608185, 109461533, 109441956, 109571930, 109615173, 109722755, 109821663, 109542946, 109346725, 109370560, 109582649, 109633072, 109441132, 109470558, 109465874, 109396629, 109552025, 109781380, 109902397, 109871033, 109541962, 109480568, 109780930, 109930923]
3993.5A09930923q2519k78595n4749j19903K0004K25067n2574
4000.2A09587654
$$ y = [109930923, 109848404, 109569809, 109515060, 109395157, 109415161, 109640228, 109587654]
##END=$$ End of the data block
