##TITLE=$$ Begin of the data block
##JCAMP-DX=5.00 $$ ACD/SpecManager v 10.08
##SPECTROMETER/DATA SYSTEM=Varian
##DATE=19 Mar 2013 14:02:20
##DATA TYPE=INFRARED SPECTRUM
##DATA CLASS=XYDATA
##ORIGIN=
##OWNER=
##NPOINTS=3735
##FIRSTX=399.26403809
##LASTX=4000.35498047
##MAXX=4000.35498047
##MINX=399.26403809
##MAXY=360.36087036
##MINY=0.00000100
##XFACTOR=1.0000000000
##YFACTOR=0.000001000000000
##FIRSTY=0.00000100
##DELTAX=0.96440572
##XUNITS=1/CM
##YUNITS=TRANSMITTANCE
##XYDATA=(X++(Y..Y))
399.3 1 1 1 360360870 360360870 360360870 360360870 360360870 360360870 360360870 360360870 360360870 313188416 123912216 75799477 75799477 75799477 75799477 75799477 75799477 93250328 93250328 56242859 66844269
421.4 66844269 192363800 93347282 59977730 11266750 1 1 1 1 1 1 1 1 1 1 1 112077698 117784882
437.8 117784882 26411829 26411829 26411829 56980354 66293671 66293671 66293671 66293671 66293671 66293671 66293671 66293671 195412796 195412796 195412796 195412796 195412796 195412796 195412796 195412796 195412796 167530289 258077393 345506958
461 345506958 165232346 56310299 18148090 25572920 57945984 75423828 89246429 140165588
468.7 140165588 67712303 83909775 153628632 213424286 182811646 91416389 72455856
475.5 72455856 80542549 108343330 94564880 83343353 141582169 137741547 118349602 95506805
483.2 95506805 67932060 58939949 66361305 88115776 86629074 95430710 104981506 104537964
490.9 104537964 128321808 150321655 138264481 95812630 95495956 128235870 110922600 94638588
498.6 94638588 100907928 108701569 113030357 116131149 109587036 105410957 106796768 110084587 118538094
507.3 118538094 111252205 104508636 102150070 90197876 99433281 110586044 96736488 96571785
515 96571785 107909813 112511650 107906265 105755371 102562347 99753571 98163589 95666695 96730576
523.7 96730576 94620094 95007156 95022972 94400574 99526955 102172539 103161949 99919930 99316879
532.4 99316879 100843788 94116531 89377335 89136513 95033188 105550316 106262871 99275169 99059357
541 99059357 103725250 104869705 103883987 98599472 96964432 98913116 97074944 98173157 101416298
549.7 101416298 104275581 100590454 93324669 95550934 100651825 99167564 97208046 96705254 96449982
558.4 96449982 99233879 102506554 101741028 104164711 107177834 100825439 95222939 95835609 96531136
567.1 96531136 97184731 96947479 97068863 98149261 97543060 99151360 100749069 99060204 96559608
575.8 96559608 94174438 94822731 96259277 97497421 97366325 94473228 94760193 94686180 94219032
584.4 94219032 95589172 94702576 95098099 94483192 92289566 91663040 91665718 94465324 98073463 100196228
594.1 100196228 100565033 100245293 97154373 94326004 95743576 96253052 97713852 97112694 94556366
602.8 94556366 94471550 95239937 99016624 100801056 99312614 96779938 94570114 95084007 97328331
611.4 97328331 101671288 101334785 98191177 98767746 99769585 100374786 100685242 99763092 98359978
620.1 98359978 99374832 100272461 99207870 97563866 95837593 96272552 97684608 99918800 100804214
628.8 100804214 98575432 97109352 98068581 98272346 97793274 99592163 99350700 99373344 100332352
637.5 100332352 99270271 99389641 98557816 98270699 97441673 95922493 98539948 99984055 97556412
646.2 97556412 96912865 99539955 101795929 102687492 101337326 100442940 100809364 97461990 97269424
654.8 97269424 99400375 98004082 98171486 99254799 99181747 97901375 95101501 94558006 96077408
663.5 96077408 95792938 95986839 97358376 98156044 98502464 95040268 92888329 94265533 97313141
672.2 97313141 95357780 92002754 92419472 93861237 94959038 93079964 90207825 89148727 88662262
680.9 88662262 88840721 89044525 90376808 90484596 88287704 87860214 88674835 88196266 87068207
689.6 87068207 87579994 88162605 88305183 88768387 87740517 86844963 86696167 86279633 86417603 86125969
699.2 86125969 85845726 86021645 85012352 84218185 83622192 82879829 83357338 83590202 83513092 83406921
708.8 83406921 82815887 82356804 81792099 80917801 80628235 80243378 78567940 78082092 77892578 76733047
718.5 76733047 76578178 75662399 74093918 73179131 72197990 72214088 73668617 75008842 76002922 76738945
728.1 76738945 77516975 79001892 79033867 78471352 79913895 82179741 83192978 83593025 84514946
736.8 84514946 85184227 86258842 87464943 88126740 88934914 89373688 89144089 89195427 90704597 91715538
746.5 91715538 90855087 89910240 91087639 94022324 95631561 96223557 95888481 95384605 96153992
755.1 96153992 95789978 95297150 95724930 94715744 94341820 96506058 97835495 97860786 97294357 95742607
764.8 95742607 95844635 96931877 96939598 96556541 96269829 96480415 96934448 95702919 94434456 96404381
774.4 96404381 97905556 97833519 98147354 98044998 98000412 97354744 97035080 96649910 96780960 98244850
784.1 98244850 97903526 97539185 98781265 99947556 99426735 99350166 101162933 100674423 99177261
792.7 99177261 98388878 98209808 99931892 101188446 100958794 100191872 99952446 100496368 100210762 99939339
802.4 99939339 100777260 101503487 100699219 99125931 99790535 101406548 100828468 100982765 102127724
811.1 102127724 101751190 101257423 100468010 99500961 99472519 99158989 98881630 99704666 100697899 100271568
820.7 100271568 99084724 99380966 99998413 100149391 100933411 101275879 100568985 99017929 98103218
829.4 98103218 97844810 97280685 98396774 99715324 98440018 97247711 97445923 96616882 96182724
838.1 96182724 97298897 97307816 96734749 96631096 97246277 97261826 96117332 96255936 96398560 95419426
847.7 95419426 94894966 94794418 94436226 95368294 96228523 94412544 93089066 93156792 94192589 95396637
857.4 95396637 96046165 96973793 95802559 94261520 94850716 95533806 95614532 95801277 96608528 97184830
867 97184830 96430626 95583603 95949501 96141556 95941826 95961624 96456284 97365166 97272995 97263992 97230576
877.6 97230576 96772438 97242996 97719383 98193611 98524315 98015816 98194611 98888046 98264565 97671600
887.3 97671600 97980408 98156036 98022552 97386200 97432434 98181839 98153915 97594818 97326469 97420547
896.9 97420547 97682434 97625603 96756058 96765938 97577812 97967110 97818367 96794624 95791389 94943817
906.5 94943817 94901314 95240936 95247459 95008408 94302582 94334763 93851784 92825432 92289207 92733894
916.2 92733894 94375923 94504097 93658806 93362282 93371292 93713455 93909996 93382225 93296661 94049156
925.8 94049156 93649353 93842461 95140274 95769768 95380829 94329948 94714935 95049660 94079987 93561813
935.5 93561813 93728241 94097717 94110008 93853439 93562729 93904274 94394272 94069023 93435516 93415047
945.1 93415047 93649796 92888451 92441399 92514351 92497086 93148087 93432472 93102737 93409286 93937210
954.8 93937210 93615395 93049164 93351067 94293594 94107048 93228691 93536278 93758049 93364754 93198097
964.4 93198097 93081360 92826538 92523064 92595886 92564178 92307709 92748711 93141342 92583321 92584099 92500908
975 92500908 91275856 90871002 91132690 91243065 91108391 90770256 90778046 90199654 88830193 88279060
984.7 88279060 88490494 88362534 88697815 89041267 88909233 89096954 88976768 88677681 88784569 89585205
994.3 89585205 90024300 89651520 89693733 89976906 89979530 89831604 90199211 90252426 90029060 90089279 89516998
1004.9 89516998 89335747 89391479 88960419 87989395 86835960 87049019 87609695 87154549 86810699 86684074
1014.6 86684074 85533485 84289139 83511795 82796722 82710899 82472214 81706223 81024147 80334595 79205193
1024.2 79205193 78253448 77642563 76800438 76044289 75425087 74836685 73300858 71996849 71824638
1032.9 71824638 71507187 71258820 71116714 71620247 72203499 72572655 72494591 72291527 72931839 73164658
1042.5 73164658 73584167 73860947 73753853 74229965 74600571 74740135 74884125 75074844 75382454 76425568
1052.2 76425568 76924011 77062897 77585396 77318298 77316521 77691345 78464233 78879028 78492363 78633110
1061.8 78633110 78813507 79313911 80185654 80983040 81232704 80968719 81435616 81685448 81220535 81878006
1071.5 81878006 82473824 81533669 81497322 82240318 81996140 81038635 79829887 78749908 78107193 78148834
1081.1 78148834 77401009 76113182 75712288 75128006 73914986 73102928 73133385 73017883 72798012 71645630
1090.7 71645630 70172546 69804054 69087952 68505966 68152077 67842255 67838974 67768669 67722878 68509781
1100.4 68509781 69585426 69478706 70140396 70677162 70720436 71524849 71357864 71027138 71181770 71134636
1110 71134636 70805389 70524002 70184311 69790031 69498711 68926308 68823013 68822273 68802826 68785042 69008804
1120.6 69008804 69444542 69173325 69665939 71207611 72333435 72545105 72942841 73256912 73005051
1129.3 73005051 72586884 71850845 71821861 71594002 70813332 70049950 69335243 68857903 67704964 66767815
1139 66767815 66204002 65974594 65681396 64924294 64380699 63666313 62920097 62032784 61742119 61305962
1148.6 61305962 60816971 60278099 58337795 57006565 55956726 54954166 54103672 53246593 52600780
1157.3 52600780 51263367 50020779 49085312 48986900 48391605 47392792 47151077 46918327 46896317 46314056
1166.9 46314056 46173950 46353287 46523212 46342659 45398083 45259193 45264313 45159584 44967972 44772697
1176.6 44772697 44323277 44046474 44304306 44390514 44872089 44976860 45151978 45389198 45803978 46663078
1186.2 46663078 47046291 47675243 48413414 49115562 49584156 50151978 50547188 50835747 51735500 52690170
1195.9 52690170 53670074 54022491 54757042 55633350 56002365 56706566 57406853 58387383 59026066 59406353
1205.5 59406353 59800938 60208954 60534672 60799030 61494884 61943020 62627529 63033043 63032677 63094894
1215.1 63094894 63079620 63411743 63333538 63468319 63959354 64128586 64204933 64170189 63862740 63607090
1224.8 63607090 63750175 63625542 63695568 63615616 63009132 62347561 61778393 61881569 61811302 61461205
1234.4 61461205 61220287 61079666 60671741 60145306 59913666 59535896 59479275 59270573 59236145 59321640
1244.1 59321640 59283596 59560329 59623981 59946564 60097908 60524734 61167873 61793476 62637962 62997505
1253.7 62997505 63547783 64069977 64502892 64711830 64923744 65228737 65376564 65955338 66123528 66302467
1263.4 66302467 66366600 66513100 67087059 67138107 67318329 67478065 67588760 67611404 67740250 68125298
1273 68125298 68193848 68279488 68357040 68434181 68278641 68305092 68748558 69381714 70102928 70504158 70938240
1283.6 70938240 71469093 72210205 73044136 73799408 74127213 74067291 74023293 73931442 74234703 74438675
1293.3 74438675 74408661 74397530 74187386 73769714 73118484 72755669 72606056 72632187 72636589 72600838 72937820
1303.9 72937820 73558525 74206894 74452324 74851212 75195099 75435555 75764122 75920532 76233200 76496765
1313.5 76496765 76491791 76232048 76329292 76391800 76251190 76542725 76714592 76836006 76818710 77146240 77825981
1324.1 77825981 78468987 79068840 79294739 79789017 80414360 80759804 80825386 80742493 80799683 80879578
1333.8 80879578 80856949 80759781 80724037 80480087 80114693 79477913 78765259 78642715 78560135 78450409
1343.4 78450409 77990334 77351494 77026527 76956642 76915558 76676399 76545174 76619202 77101784 77522087
1353.1 77522087 78017479 78730141 79215752 79657104 79900574 80134354 79899406 79473892 79078865 78231255
1362.7 78231255 76876457 75300049 73900406 72359909 70841331 69547783 68516708 67773102 67053841
1371.4 67053841 66529602 65925835 65870308 65738190 65238190 65269913 65762497 67408806 69081932 70735893
1381 70735893 72644516 74494736 75847244 76943466 77885818 78460075 79049095 78726593 78781891 78927742
1390.7 78927742 78700943 78661255 78464516 78863953 79438278 79526291 79517159 79930946 80821594 81083908
1400.3 81083908 81633316 82278885 83185158 83938011 84667442 85246689 85352951 85575539 85477119 85265251
1409.9 85265251 84829147 84160530 83400650 82772499 81831032 80568718 79819115 79208069 79188904 79908867
1419.6 79908867 79770149 79813370 79990509 80401978 80886299 81067207 80959145 80759491 80369659 79573868
1429.2 79573868 78517715 78014771 77695625 76678360 76028358 75427002 74563278 73760490 72860954
1437.9 72860954 72431938 71697563 71256897 70398323 69480003 69016014 68086525 67550507 66936142 67014023
1447.6 67014023 66909111 66183952 65506500 64308403 63105301 61257618 60158653 58765629 57875317
1456.2 57875317 57583096 55828022 56487747 55663944 55422783 54375828 53991978 53930508 53321533 53961662
1465.9 53961662 53306175 55238880 58078110 62998844 67944923 72604263 80134270 83176964 85659332
1474.6 85659332 86504181 88472122 89619759 90139465 91432274 92237885 93662132 94414474 95830574
1483.2 95830574 97017899 97610115 98484634 99029289 100086922 100156075 101024048 101097740 101369675 101827370
1492.9 101827370 101525711 101966667 102325104 102993637 102911575 102839539 103147285 102944687 102712730 102454750
1502.5 102454750 102893059 103073593 103182709 102959732 103870430 104643997 103913925 104198685 103848885 103943031
1512.2 103943031 104490555 104517372 104647514 104993752 105890488 104717781 104702141 105021301 106021500 106441055
1521.8 106441055 105125381 105372505 105113579 105153717 105281250 105080925 105062401 105360657 105446274 104996048
1531.5 104996048 105115234 104847435 105223282 105600395 105728600 106094452 106113510 107908348 106999931 106389435
1541.1 106389435 106890457 106138290 105732224 105424980 105611145 105405663 105392570 105582436 105838333 105805069
1550.7 105805069 105695671 106072968 106120743 105802383 105912132 106327858 106515968 106398766 105917870 104517456
1560.4 104517456 105543846 105936104 106054108 105581078 105373863 105800781 105732735 105779007 105826790 106324837
1570 106324837 106107323 105855896 105763229 105714806 105943451 106149811 106460281 106091805 106026794 105910591
1579.7 105910591 105754425 105903763 105991821 105834709 105362068 105562866 105978310 106056244 105890984 105653908
1589.3 105653908 105817032 105747925 105683205 105521461 105410477 105463638 105596474 105730446 105480988 105500992
1599 105500992 105357315 105286201 105406891 105231323 105002945 105060394 105404594 105379448 105366325 105357315 105527504
1609.6 105527504 105422966 105054016 104882950 104530083 104794121 104817802 104431763 104216187 104167168 104449524
1619.2 104449524 104239883 104217087 104182610 104345016 104502274 103746353 103395424 103455643 104128540 103980331
1628.9 103980331 103701752 103656219 103546494 103465691 103376778 103636627 103052246 103034492 102888870 102752625
1638.5 102752625 102633102 102058899 101592323 101090057 101068863 101007896 100708954 99924866 99476517 99987862
1648.1 99987862 99382790 99162857 99104744 99455521 100411659 98647552 98794220 98441017 98459732 98482895
1657.8 98482895 98767097 99068520 99211380 99488190 99560081 99791069 99702454 99604698 99394371 99396370 99503578
1668.4 99503578 99076088 99623413 99757256 99535019 99201248 99169441 98782303 97892738 97932968 97690361
1678 97690361 97667374 97430664 97136955 96777618 96245224 96275002 95183220 94659439 93974464 93485352
1687.7 93485352 92815384 92169556 91375313 90015594 89027313 88040672 87187439 86119072 84732124
1696.4 84732124 83539711 82392288 81855888 80735252 77923210 76784691 75741058 74149452 72023033
1705 72023033 70438828 68479439 66633896 65135765 63608887 61897434 60241577 58974430 57795467
1713.7 57795467 56417183 55281002 54113777 53282166 52668312 51882359 50978096 50146149 49608765
1722.4 49608765 48884354 48179928 47064564 45763691 44273228 42626118 41151024 38611546 36195610
1731.1 36195610 34089272 32455566 30956333 27235601 25970243 24266031 23580290 22744154 22725439
1739.8 22725439 22828709 22174774 22668806 23375532 25282804 26100351 27974426 29752008 32234882
1748.4 32234882 36109051 37547264 42499577 46659161 49771652 53349140 56946785 60814793
1756.2 60814793 65448563 69689804 72527908 75656036 77861679 81493767 84249336 85340454
1763.9 85340454 87104042 88511703 89952675 90880035 92393684 93275841 93645836 94708481 95547897
1772.5 95547897 96257500 96468086 97061951 97424301 97904160 98425316 98676674 99122597 99149666 99624924
1782.2 99624924 99988228 100257034 100449860 100715950 101042450 101136673 101518341 101683624 102094841 102170609
1791.8 102170609 102316093 102769402 102531540 102653214 102948311 103483727 103593758 103353210 103374420 103272438
1801.5 103272438 103690315 103989624 104134911 104315102 104452858 104488449 104547424 104549789 104325844 104762749
1811.1 104762749 104975433 104971207 105080605 105095253 105263687 105225395 105239067 105312706 105337662 105356461 105206215
1821.7 105206215 105040489 105191040 105587166 105619743 105493790 105610069 105832115 105739090 105499329 105787003
1831.4 105787003 105972717 106046516 106153381 106300919 106206291 106105362 106230080 106311104 106227890 106035133
1841 106035133 106143623 106426987 106823036 106827942 106634903 106878807 106983368 106736732 106508186 106600105
1850.7 106600105 106862526 106875290 106776741 106785378 106644218 106426582 106613693 106838158 106968086 106934326
1860.3 106934326 106707916 106815842 106985512 106916031 106801453 106913391 106996773 106905182 106940872 106826241
1869.9 106826241 106739838 106652084 106668610 106871941 106965416 106904320 106737175 106630836 106658340 106653343 106640327
1880.6 106640327 106760101 106839699 106834328 106775665 106693993 106755066 106840485 106875359 106843452 106849678 106849442 106965508
1892.1 106965508 107208954 107192963 107208076 107191734 107078911 107204674 107326859 107165230 106890709 106822113
1901.8 106822113 106919144 107198441 107446068 107416512 107288170 107134224 107130722 107223442 107203560 107023445 106981033
1912.4 106981033 107216385 107392090 107402725 107407921 107464249 107243950 107049606 107234566 107445770 107465492
1922 107465492 107407089 107438828 107341293 107198898 107189560 107273407 107342300 107337517 107239128 107114174 107242325 107328720
1933.6 107328720 107208298 107123962 107188919 107331764 107197151 106985924 106952888 107117836 107270073 107186821
1943.2 107186821 107281189 107377991 107350922 107396889 107483650 107499252 107363213 107130669 107056618 107178680 107251366
1953.8 107251366 107215836 107076973 107110466 107314323 107324600 107194962 107103844 107146873 107188202 107168365 107241188
1964.5 107241188 107391220 107487762 107538147 107394249 107147316 107141792 107116531 107132553 107351181 107477798 107528992
1975.1 107528992 107507599 107411499 107229706 107126801 107223129 107385506 107473030 107610344 107723900 107500908
1984.7 107500908 107457115 107565826 107631081 107591492 107252632 107117714 106946060 106870377 107103447 107244423
1994.3 107244423 107387581 107383369 107339249 107337837 107418427 107379051 107118690 107021286 107146103 107330048 107284447
2005 107284447 107261177 107306183 107218353 107243553 107251518 107234558 107286919 107330185 107330788 107205421 107023293 106968819
2016.5 106968819 107074448 107286179 107324974 107064056 106932640 106842415 106756310 106877289 106990471 107044434
2026.2 107044434 107107506 107088181 106912773 106825729 106702164 106600807 106715843 106744171 106693451 106539055
2035.8 106539055 106673653 107045280 107080666 107007095 107030830 107127304 107089272 107079048 107047989 106960060 107035439
2046.4 107035439 107031837 107080269 107074821 107041748 107137390 107161163 107167397 107111801 107130188 107194778 107279251 107394470
2058 107394470 107283051 107054482 106914818 107011871 107216881 107249992 107233871 107205231 107166512 107369980 107408340
2068.6 107408340 107187103 107308441 107453270 107451004 107480766 107396736 107356773 107435608 107483398 107543083 107629082
2079.2 107629082 107578552 107419853 107152382 107036781 107109383 106993599 107159271 107555779 107520699 107407982
2088.9 107407982 107470573 107453659 107513336 107574150 107468475 107414429 107384682 107485687 107567719 107484200 107408531
2099.5 107408531 107293068 107453415 107819778 107949257 107901848 107931656 107963570 107885147 107687607 107459793
2109.1 107459793 107551842 107664162 107817451 108019936 107962120 107930367 107781113 107718758 107778381 107735184 107702881
2119.7 107702881 107691444 107804573 107886856 108044769 108098602 107972595 107928261 107843376 107722717 107670563 107793404
2130.3 107793404 107780106 107862885 108090500 108004196 107710396 107333794 107418846 107704865 107885399 108130371
2140 108130371 108011063 107857513 107971748 108016006 107946152 107843262 107657730 107794052 108009102 107838654
2149.6 107838654 107833206 107733498 107572311 107547523 107346642 107424522 107854874 108142250 108017021 107848633
2159.3 107848633 107800446 107758522 107808365 107848846 107853653 107774544 107836380 107909645 107718971 107578430 107696579
2169.9 107696579 107909630 107877838 107909721 108016357 107824028 107652069 107593735 107527519 107513954 107459755 107364021
2180.5 107364021 107584167 107949066 107966209 107784798 107759186 107970940 107926254 107569016 107506035 107606842
2190.1 107606842 107612434 107808487 108117714 108184998 108103241 107949890 107821732 107972862 108062912 107942223
2199.8 107942223 107962006 108031471 108093109 107990913 107778572 107899475 108020630 108036285 108110703 108079681 107904968
2210.4 107904968 107777718 107946823 108009659 107919922 107750099 107578033 107879799 108177643 108147827 107950569
2220 107950569 107764603 107860313 108007568 107898041 107800636 107931313 107806717 107771614 108077538 108096870 107911171
2230.6 107911171 107725502 107617622 107681938 107874741 107914650 107803551 107732887 107746361 107940926 107990250
2240.3 107990250 107957626 107833328 107629585 107693207 107799179 107776672 107608025 107747696 108016792 107826546
2249.9 107826546 107657516 107730042 107856003 107941002 107997597 107953926 107948410 107976021 107869904 107870445 107740669
2260.5 107740669 107615959 107717712 107836182 107965515 107869576 107726227 107795326 107823067 107775909 107855400
2270.2 107855400 107908890 107921341 107958588 107867523 107847542 107810089 107782364 107881279 107897873 107935493 107882607
2280.8 107882607 107692818 107596886 107653397 107750977 107688782 107475327 107361099 107413559 107528122 107676041
2290.4 107676041 107771210 107812668 107707741 107560211 107552559 107535248 107613533 107492943 107296776 107590096 107861267
2301 107861267 107894295 107915131 107812294 107843002 108068092 107939056 107680107 107882568 108028442 107948280 108048294
2311.6 108048294 108182899 108314537 108270798 108071060 108024483 108145096 108604889 108798401 108573601 108704948
2321.3 108704948 108639488 108671448 109272041 109400459 109031403 108857300 108689018 108275414 108167496 108539108
2330.9 108539108 109071838 108978088 108209526 108108360 108517220 108586891 108714622 109133217 109022751 108944824
2340.6 108944824 108980675 108295815 108479805 109161972 109177803 108992783 108550819 108190811 108127968 108287437
2350.2 108287437 108521210 108842834 109030289 108848763 109013084 109442032 109893799 110347878 110261124 109504875
2359.8 109504875 109677971 110127907 109962875 110034149 109513756 109772728 110220016 109745186 109218987 108655846
2369.5 108655846 108769325 108708778 108576294 108858215 108634560 108259972 108120232 108047882 107957138 107892700
2379.1 107892700 107760406 107604225 107426277 107259422 107370621 107479736 107647858 107889175 107676682 107355782
2388.8 107355782 107329803 107332085 107467697 107657814 107560593 107470581 107428604 107450073 107456390 107410744 107619072
2399.4 107619072 107533852 107321709 107403572 107400185 107292671 107197830 107404327 107550888 107366615 107373604 107543358
2410 107543358 107637947 107591545 107480759 107454674 107535271 107618073 107669487 107646400 107483543 107407982 107498596
2420.6 107498596 107616501 107592094 107449684 107401711 107485489 107585297 107481140 107333771 107333427 107392899 107606621
2431.2 107606621 107768501 107705032 107547577 107320038 107376320 107790047 107983360 107819183 107700394 107718529
2440.8 107718529 107667358 107620590 107555939 107494141 107529106 107570839 107691887 107690552 107587975 107563515 107540497
2451.5 107540497 107523064 107423309 107346085 107382515 107615425 107643883 107424713 107462975 107346008 107333511 107410553
2462.1 107410553 107207626 107329163 107570366 107537895 107402687 107489960 107633316 107581642 107555290 107336792
2471.7 107336792 107069206 107056206 107097839 107219063 107421982 107378899 107192772 107129936 107137276 107276726 107381790
2482.3 107381790 107508171 107611687 107516281 107462021 107333519 107281342 107321159 107337860 107386612 107326683 107358749
2492.9 107358749 107129372 106676437 106713562 106945267 106992867 106969948 107018677 107175613 107269028 107136726
2502.6 107136726 106984261 107035423 107073875 107078072 107056480 106903320 106950600 107097252 107103775 107158203 107047676
2513.2 107047676 106759926 106587341 106647652 106835754 106856300 106757996 106665161 106582916 106551346 106699684 106841454
2523.8 106841454 106728691 106653389 106650063 106655685 106502548 106186951 106200974 106418106 106524200 106493355 106478218
2534.4 106478218 106562157 106461166 106345207 106569878 106702591 106449585 106313065 106445175 106467514 106241974
2544 106241974 106156570 106370651 106501076 106351105 106068054 106018097 106203415 106320107 106211632 106165230
2553.7 106165230 106367882 106367943 106276176 106235352 106215164 106298424 106303703 106313988 106287369 106122612 105902161 105964409
2565.2 105964409 106130791 105947144 105910507 106007469 105949615 105978157 106043526 105989021 105910187 105822174 105763435
2575.9 105763435 105826393 105788895 105866974 105971985 105853981 105890617 105934418 105845657 105754623 105663872 105446564
2586.5 105446564 105378685 105580872 105558754 105496796 105527275 105614021 105618378 105416748 105302361 105183342 105155273
2597.1 105155273 105257454 105360741 105372818 105299858 105524826 105748550 105574982 105389084 105336212 105155479
2606.7 105155479 104983391 104910774 104904770 105126358 105358803 105281105 104994873 104901917 104884735 104770248 104735291
2617.3 104735291 104764748 104895142 104902718 104786598 104737938 104770134 104787903 104655235 104576355 104477745 104484840
2627.9 104484840 104542145 104382156 104347862 104457558 104563354 104429192 104260361 104401436 104429008 104339577
2637.6 104339577 104340691 104336479 104270836 104120232 103995010 104078064 104234955 104087891 103778656 103774513 104053596
2648.2 104053596 104105988 103834938 103755157 103846550 103711784 103569786 103583504 103630531 103656372 103551079 103512268
2658.8 103512268 103425598 103289413 103448479 103438057 103173470 102996674 102965866 103106018 103116096 102953255
2668.4 102953255 102818542 102798553 102838173 102813156 102861832 102912880 102813927 102740234 102817696 102968811 102965263
2679 102965263 102915115 103099236 103288818 103241974 103075897 102964455 102829842 102811989 102972801 102925346 103089516
2689.6 103089516 103538589 103628952 103402756 103198509 103250549 103261612 103282166 103473122 103400848 103267189
2699.3 103267189 103373001 103543007 103507294 103324738 103342094 103529907 103562523 103427567 103320625 103292885
2708.9 103292885 103378075 103257713 103019745 103023048 103101616 103161774 103097519 103052574 103047325 103027634 103079620
2719.5 103079620 102976883 102841797 102848160 102862122 102740883 102665184 102747513 102744827 102466904 102087288 102089592
2730.2 102089592 102181290 102149719 102275414 102469345 102528618 102357803 102316711 102456917 102566025 102493698
2739.8 102493698 102351089 102552528 102775497 102771362 102679222 102615372 102615540 102565086 102451065 102429298 102660713
2750.4 102660713 102684845 102358017 102238396 102434143 102523796 102417656 102321686 102234924 102328094 102314690 102210655
2761 102210655 102418854 102455116 102274414 102190201 102093231 101917107 101816818 101853340 101863022 101727715 101576591
2771.6 101576591 101669464 101710434 101544830 101291618 100974487 100801468 100693924 100672134 100794785 100802414
2781.3 100802414 100473099 100047722 99815918 99728447 99730133 99518097 99224754 99022537 98810822 98736282
2790.9 98736282 98615654 98483078 98265678 97944611 97837067 97721581 97580185 97493752 97268753 96846977
2800.5 96846977 96433434 96281242 96148643 95774513 95359924 95037064 94689095 94401161 94115852 93560547
2810.2 93560547 92924461 92410362 91999786 91623489 91148895 90668823 90222076 89609627 88937912 88375687
2819.8 88375687 87572060 86670212 86116638 85444267 84442413 83329521 82133781 81155067 80349426
2828.5 80349426 79186005 77669411 76300476 75053192 73631119 72146896 70728455 69190880
2836.2 69190880 67323944 65182297 62941238 60726063 58244354 55253902 51897694 48340843
2843.9 48340843 44853729 41508514 38283985 35223423 32548595 30152155 27998028 26418287
2851.7 26418287 25295609 24615274 24203753 24126831 24344248 24807182 25824425 27108681 28616140
2860.3 28616140 30193684 31786945 33718193 35746628 37536861 38996315 40143608 41055870 41755760
2869 41755760 42188580 42501614 42961117 43585541 44372711 45550026 47001987 48198849 49211609
2877.7 49211609 50148479 50750084 51056080 51312073 51452312 51189701 50635708 49953228 49426434 48982082
2887.3 48982082 48094318 47109226 46190403 45269527 44339676 43237656 42273262 41298489 40223724
2896 40223724 39222668 38191830 37177925 36202114 35324100 34452705 33429443 32409672 31523556
2904.7 31523556 30663836 29806618 28850117 27913307 27234201 26359806 25217726 24190998 23287504
2913.4 23287504 22498602 21797871 20941374 20023779 19377438 18854990 18416096 18062140 17758427 17315382
2923 17315382 16824392 16806747 16940584 17122801 17329786 17208830 17142866 17424189 17765009 18010319
2932.7 18010319 18309320 18725863 19395658 20207750 21037708 21999662 22855700 23653711 24631184 25630768
2942.3 25630768 26574974 27511587 28401485 29240028 29861452 30361458 30923634 31212824 31234253 31084078
2952 31084078 30943813 31093168 31194618 31278534 31552444 31913141 32364037 33000538 33831013 34780975
2961.6 34780975 35932949 37183434 38540878 40214035 42135242 44113426 46073841 48020012
2969.3 48020012 49891735 51665581 53328537 54726849 55887287 56997803 58157413 59298496
2977 59298496 60288998 61201080 62061504 62962025 63805073 64564751 65478737 66460869 67548775 68551476
2986.7 68551476 69495270 70300446 70763229 71433830 71977928 72213318 72390282 72349510 72278244 72029495
2996.3 72029495 71401901 70551483 69783798 68938293 67741356 66453918 65162201 63955189 62912151
3005 62912151 62078045 61415520 60897404 60774765 61073940 61920162 63148552 64452316 66000473 67961769
3014.6 67961769 70316307 72634422 74707863 76791100 79057274 81108093 82786545 84556168
3022.4 84556168 86323891 87730232 88903336 90094780 91125481 91890739 92573196 93372978 94241730
3031 94241730 94817230 95106834 95427734 95872459 96401596 96973770 97295723 97431641 97642570 97924660
3040.7 97924660 98183876 98235191 98413620 98639305 98798309 99139343 99266449 99156769 99132980 99397720
3050.3 99397720 99674957 99758369 99896797 99906403 99819260 99818352 99924957 99994164 99895386 99893272 99922287 99818832
3061.9 99818832 99882896 100060982 100080406 100119728 100072891 100107704 100511711 100777664 100777039 100761292 100932030
3072.5 100932030 101146408 101193108 101233467 101252975 101310677 101421532 101500404 101629829 101871315 101900223 101796997
3083.1 101796997 102084373 102301727 102289543 102202354 102007523 102103195 102175331 102041023 102058159 102210281
3092.7 102210281 102381493 102449371 102524612 102646965 102568237 102386002 102544502 102898720 102931396 102844017
3102.4 102844017 102759140 102669334 102700195 102559082 102404228 102526588 102604027 102584366 102659836 102725525 102730133
3113 102730133 102736961 102647141 102705124 102980385 103021454 102888123 102781708 102733589 102773857 102796860 102712845
3123.6 102712845 102606865 102491142 102468521 102656029 102736641 102823410 102888062 102790390 102737564 102586037 102727135
3134.2 102727135 102978310 102869537 102598251 102292091 102379227 102724037 102881432 102781113 102648544 102590942
3143.9 102590942 102496521 102518784 102555550 102626266 102596352 102460983 102398483 102441811 102633591 102611717 102580894
3154.5 102580894 102521545 102389709 102267036 102174629 102488983 102503197 102340599 102394325 102430748 102615723
3164.1 102615723 102495598 102250725 102050064 101851715 101931145 101984314 101923210 101925865 102018196 102053680 102046059
3174.7 102046059 101998405 101997139 102158928 102207695 102054222 101723808 101576942 101734177 101739616 101699005 101694801
3185.3 101694801 101495255 101272072 101279900 101560081 101857056 101825134 101603149 101474884 101538116 101486519
3195 101486519 101173340 100958061 100920616 101176239 101383118 101293617 101234688 101186577 101055031 100905830 101090057
3205.6 101090057 101335426 101417542 101416489 101195648 101238525 101216743 100949005 100947510 101074722 101165550 101124779
3216.2 101124779 100960365 100747322 100691185 100722183 100780113 100907478 100742615 100581322 100725464 100806168
3225.8 100806168 100773201 100812660 100719917 100678925 100678917 100322258 100208046 100352028 100463211 100518883 100295471
3236.4 100295471 100250214 100338600 100292336 100205452 100018456 99921234 100046379 100121986 99988518 99776306 99657928
3247 99657928 99825714 99899689 99735634 99678459 99650299 99684677 99753578 99771484 99725876 99588303 99246323
3257.7 99246323 98922859 99021828 99147606 99112396 99126343 99223984 99288597 99187759 99095680 99051155 99003853
3268.3 99003853 99001038 99140175 99172539 99021889 98907104 98657990 98475655 98453316 98391556 98319756 98264969
3278.9 98264969 98229614 98268646 98263252 98041054 97984901 98014809 97992851 98120110 98052094 97977287 97993988
3289.5 97993988 97861908 97818123 97777298 97633514 97545929 97439987 97313255 97281227 97286934 97244652 97136856
3300.1 97136856 97072060 97108208 97206497 97224121 97146507 97160599 97105362 96997108 96837059 96745789 96954643
3310.7 96954643 97054222 97100540 97069618 96704552 96517998 96642593 96634789 96561028 96453285 96064323 95942886
3321.3 95942886 96116165 96082947 96048676 96123474 96197411 96141586 96076485 96003311 95933228 95947853 95880669
3331.9 95880669 95775024 95600662 95578545 95650711 95544960 95409805 95290367 95309410 95287315 95235252 95405121
3342.5 95405121 95527100 95438652 95307068 95081985 94873276 94992149 95063713 95133240 95161629 94809456
3352.2 94809456 94657875 94646255 94528778 94473824 94470184 94534554 94471260 94275688 94288750 94438560 94311661
3362.8 94311661 94240028 94272530 94140526 94136497 94080124 93921921 93804047 93843803 94027191 93851494 93542923
3373.4 93542923 93544930 93521675 93379402 93355545 93308296 93255981 93164696 93033020 93141441 93311020 93287193
3384 93287193 93064278 93024803 92936417 92636703 92816422 93100342 93077934 92825066 92612885 92681961 92573944
3394.6 92573944 92381355 92240379 92289146 92556885 92625038 92373833 92010956 91908195 91920715 91933571
3404.2 91933571 91919624 91989326 92216454 91985649 91590988 91620865 91737183 91680092 91649979 91570679 91316727
3414.8 91316727 91220589 91253227 91329277 91253746 91039230 91114372 91294624 91392174 91337379 91303757 91279114
3425.5 91279114 91045815 90911896 90831436 90822906 90922913 90955994 90909119 90746460 90815948 91046082 90831734
3436.1 90831734 90318359 90126320 90368561 90592133 90484566 90333344 90345444 90246902 90172020 90246391
3445.7 90246391 90303963 90219490 90032204 90024101 89944336 89859009 90030304 90002899 89845543 89856873 89958778
3456.3 89958778 89898003 89733932 89766212 89715141 89564224 89507919 89735977 90064072 89881630 89692169
3466 89692169 89796700 89954773 90113304 89956207 89855423 90010406 89947754 89702881 89813583 90367630
3475.6 90367630 90541801 90394737 90483574 90482628 90307671 90397141 90530380 90564613 90815025 90892059 90791328
3486.2 90791328 90776344 90692726 90679070 90636391 90639633 90689690 90730461 90903885 90996391 91106354 91144646
3496.8 91144646 91074188 91210426 91391006 91290123 91119736 91470222 91796349 91749886 91864143 91828522
3506.5 91828522 91660507 91579376 91753586 92053528 91944817 91848022 91971237 92116196 92261086 92280891
3516.1 92280891 92360947 92499756 92490448 92327423 92321976 92610611 92561424 92507545 92813934 92930733 93167633
3526.7 93167633 93347130 93309341 93208252 93216019 93601509 93780815 93853462 93961639 93911911 94036903 94208672
3537.3 94208672 94406212 94491371 94376579 94628937 95076439 95229950 95206551 95215454 95416351 95803574
3547 95803574 96087341 96105026 96129433 96398987 96446617 96416992 96859093 96954765 97068733 97528473 97692993
3557.6 97692993 97803444 97907761 97985397 98347260 98518272 98449684 98623268 98828758 99312599 100119095
3567.2 100119095 99949509 99836258 100116226 100095108 100187424 100524261 100772491 100716248 100553337 100749908
3576.9 100749908 101076942 101236809 101493568 101654305 101556892 101777168 102211716 102410721 102466293 102464981
3586.5 102464981 102835426 103208458 103172523 103101547 103042053 103121414 103357094 103718330 103947807 103839394
3596.1 103839394 103827415 103936211 104099487 104236160 104216095 104285378 104359238 104333397 104612045 104927269
3605.8 104927269 104892258 104996086 105048904 105064217 105326378 105216637 104957870 104989090 104905167 105015701
3615.4 105015701 105426804 105724319 105711197 105731232 106048462 106257133 106148041 105959755 105907082 106021782
3625.1 106021782 106448112 106948509 107395615 107000687 105778488 106420586 106711388 106675179 106686676 106605827
3634.7 106605827 106771454 106862000 106864037 106939278 106922981 106971832 106957611 106971550 107155754 107212173 107144905
3645.3 107144905 107292175 107559219 107206253 107296394 107613144 107354042 107117981 107052856 107186012 107332924
3655 107332924 107285164 107160164 107308418 107478119 107518929 107504059 107542458 107602127 107525307 107409286 107353439
3665.6 107353439 107536674 107748253 107671982 107860077 107892349 108029015 108169624 107792564 107735001 108170563
3675.2 108170563 107518242 107634460 108057686 108266235 107973953 107827171 108010651 108114029 108004517 108066772
3684.9 108066772 108242424 108364662 108720520 108626472 107915611 107552254 107772018 108216141 108275696 108359962
3694.5 108359962 108596794 108696243 108291481 108083420 108129799 107929169 108000916 108576401 108883087 108775688
3704.1 108775688 108527985 108308174 108233757 108382065 108465065 108883224 109026237 108318085 108228745 108604378
3713.8 108604378 108474556 108328468 108611641 108914452 108785454 108349167 108396187 108761528 108769638 108618423
3723.4 108618423 108578796 108432945 108345245 108320564 108304459 108453293 108940613 109197098 108780571 108598801
3733.1 108598801 108700546 107929276 107435226 108223030 108413658 108689514 109113800 109090393 108907249 108922203
3742.7 108922203 109011986 108732826 108449028 108658974 108811981 108558960 108115021 108772400 109022507 108911331
3752.4 108911331 108794647 108603821 108463051 108271347 108356445 108663940 108672691 108624756 108589897 108478676
3762 108478676 108485161 108488823 108541878 108880463 108895142 108707375 108695465 108328712 108058830 108452469 108520996
3772.6 108520996 108629257 108795685 108593880 108476089 108476036 108446381 108264381 108273926 108620087 108768242 108842613
3783.2 108842613 108719109 108405930 108446434 108493988 108382240 108266479 108456459 108747612 108742752 108679520
3792.9 108679520 108510712 108236671 108210854 108262177 108347404 108630760 108686981 108745781 109166618 108936394
3802.5 108936394 108767822 108739273 108794563 108735039 108154167 108219559 108550667 108546227 108380997 108420349 108258629
3813.1 108258629 108254242 108713661 108680573 108523117 108762047 108949509 109129112 108803177 108256889 108304459
3822.8 108304459 108591698 108985580 109102722 109018173 108804031 108639023 108594208 108824463 108849213 108223831
3832.4 108223831 108338928 108583717 108654617 108738762 108729408 109174316 109027122 108319229 107979836 108346756
3842.1 108346756 108548889 108448990 108443169 108381638 108341965 108428337 108484909 108583260 108734489 108933586 108990341
3852.7 108990341 109146881 108577080 108270218 108225716 108060539 108514137 108667809 108437675 108521812 108417839
3862.3 108417839 108378654 108444000 108440376 108548744 108387978 108353844 108332237 108351418 108890770 108814529 108616318
3872.9 108616318 108262535 107771141 108037071 108367836 108518379 108496361 108443016 108355217 108240074 108250069
3882.6 108250069 108355904 108691032 108768929 108548645 108730331 108573334 108334267 108498840 108625320 108162758
3892.2 108162758 108117813 108369164 108397575 108238708 108089615 108313400 108487228 108191902 108034706 107685371
3901.8 107685371 107894707 108168831 108096756 108225922 108353081 108326889 108360992 108523590 108240173 107946220
3911.5 107946220 108260147 108715660 108688988 108264503 108196243 108208519 107985519 107783806 107655556 108026192
3921.1 108026192 108217094 108097191 108119164 108183914 108145134 108275429 108082306 107733421 107795418 107927010
3930.8 107927010 108175713 108202477 108351814 108492172 108057724 107898125 107937675 108051025 108140709 108037773
3940.4 108037773 108007706 108015587 108065475 107884285 107916382 108103447 108095459 107945618 107538689 107550941 108027435
3951 108027435 108027702 107771660 107792816 107936020 108116959 108077301 107861671 108006577 107915543 107745811 107839027
3961.6 107839027 107854912 107880180 107798500 107833809 107781090 107564690 107639305 107715446 107661713 107503647 107241295
3972.2 107241295 107152229 107251717 107509712 107905937 108076256 108052803 108036545 107929565 107871910 107861786 107696457
3982.8 107696457 107625198 107845490 107820068 107672569 107728973 107670616 107649765 107623138 107708069 108016800 108269897
3993.5 108269897 108210777 107816818 107567528 107481300 107524025 107432510 107377472
4000.2 107377472
##END=$$ End of the data block
