##TITLE=$$ Begin of the data block
##JCAMP-DX=5.00 $$ ACD/SpecManager v 10.08
##SPECTROMETER/DATA SYSTEM=Varian
##DATE=19 Mar 2013 14:24:08
##DATA TYPE=INFRARED SPECTRUM
##DATA CLASS=XYDATA
##ORIGIN=
##OWNER=
##NPOINTS=3735
##FIRSTX=399.26403809
##LASTX=4000.35498047
##MAXX=4000.35498047
##MINX=399.26403809
##MAXY=757.15301514
##MINY=0.00000100
##XFACTOR=1.0000000000
##YFACTOR=0.000001000000000
##FIRSTY=0.00000100
##DELTAX=0.96440572
##XUNITS=1/CM
##YUNITS=TRANSMITTANCE
##XYDATA=(X++(Y..Y))
399.3AS2K19675078m3676849K81082%Wj76279311%N3478118N6963707l7992035p2449790
423.4A%TP0888793O86264221%p57153014%UK58553679k37431856k1121823%J4010188
436.9A4010189L9790215n3800403%S1M13446044%Zj19888062j75562141r2289629j6439994
462I266219O458862L8016324L6594334k865745j1766472J3778000M6529571q3633827
469.7E2377266m465279N9840157M0768410j2265458r465759R144531j8136795q658508
477.4A09138565l4508537j2225365Q0398407K7763260j2033402n9851882n8688374
484.1C9992672P126659J6497467J6066941K5564644L3912719k5903114k8208382J9453614
491.8A04503220M4012222J1789398m4683243k0427208M418084p143517M470459L0781128
$$ plain form
399.3 1 1 1 1 1 1 1 1 1 1 1 1 219675079 175998230 176279312 176279312 176279312 176279312 176279312 176279312 1 1 53478119 110441826 72449791 1
423.4 1 1 1 70888794 757153015 757153015 1 1 1 1 258553680 21121824 1 1 14010189
436.9 14010189 53800404 1 1 1 1 1 1 1 1 1 1 1 1 413446045 413446045 413446045 413446045 413446045 413446045 413446045 413446045 413446045 293557983 117995842 25706213 9266219
462 9266219 15725081 53741405 90335739 87469994 75703522 89481522 136011093 52377266
469.7 52377266 47911987 107752144 148520554 136255096 126789337 135933868 117797073 109138565
477.4 109138565 74630028 62404663 142803070 170566330 158532928 98681046 39992672
484.1 39992672 47119331 63616798 79683739 105248383 139161102 113257988 85049606 104503220
491.8 104503220 148515442 160304840 115621597 95194389 99612473 92468956 96939415 127720543
499.6A27720543J687996k3292206O570763J2533134R560440m696335l7027160j9680039
507.3G3377136J1328667K5194389J3497910j8952019o118904K782936m306419Q548835
515A05352531J1127846j439667m786369o073006o952110M450165J1203163J150520
522.7A14033073j0861694o050117N372650O635971r00032m238594K02537K062271k595062
531.4A03661003M849724M687927q256988r455338k625580N052544P984428L400071
539.1A09297791m114083l523086q37342J295159O711464K318161l20404m40140n979012
547.8A04408508k843109J633385N134575j293564j0046524j996193N012009Q67660
555.5A00876747k01843j177742k406243K552926L789337R83108M983139N201744p045234
$$ plain form
499.6 127720543 129408539 106116333 112687096 125220230 134780670 130084335 93057175 73377136
507.3 73377136 84705803 109900192 123398102 104446083 98327179 101110115 96803696 105352531
515 105352531 116480377 115040710 110254341 104181335 97229225 101679390 112882553 114033073
522.7 114033073 103171379 97121262 102493912 109129883 108229851 103991257 104193794 106256065 103661003
531.4 103661003 108510727 113198654 104941666 95486328 92860748 97913292 105897720 109297791
539.1 109297791 105183708 101660622 100823280 102118439 108829903 111148064 110827660 110387520 104408508
547.8 104408508 101565399 103198784 108333359 107039795 96993271 94997078 100009087 100876747
555.5 100876747 100674904 99497162 97090919 99643845 103433182 104416290 109399429 114601173 107555939
564.2A07555939r506150J059006J989250O28212K140587o94313J190086J579873Q38417
572.9A06780907m90486l312264n148888l659774M993103M661583Q24485j731552n693657
581.5I7223457L57392K989509J689202K475753J854515r89868n457390k983467J286995
590.2I8446098L856682L377754n36224j586838j403869O61483p60978j987160p19818
598.9I9347130J125351L641762l96149l329964l52440J346543q8166J14304J70364
607.6A01578735j121322P69127n93445R94324O189834J33759m245293N94444J298249
616.3A05598412j085000O10573R79126q28552m78737q03291j281151o01318o68938
624.9A01441124p74307N42328K478706K797905k029198l720939J657615L84949p31590
$$ plain form
564.2 107555939 98049789 99108795 101098045 101726257 103866844 103172531 104362617 105942490 106780907
572.9 106780907 106290421 102978157 97829269 94169495 99162598 103824181 104648666 102917114 97223457
581.5 97223457 97580849 100570358 102259560 104735313 106589828 105599960 100142570 97159103 98446098
590.2 98446098 102302780 105680534 105144310 103557472 102153603 102815086 102054108 100066948 99347130
598.9 99347130 100472481 104114243 103718094 100388130 100035690 101382233 101294067 101408371 101578735
607.6 101578735 100457413 101226540 100633095 101627419 107817253 107951012 103705719 104300163 105598412
616.3 105598412 104513412 105123985 106103111 105274559 104795822 103992531 102711380 102110062 101441124
624.9 101441124 100666817 101209145 103687851 106485756 104456558 100735619 102393234 102778183 102046593
633.6A02046593J837410p00402J062722J330818k328232j221252l03071j087638j150765
642.3I9486183Q07198L173424J914360k961075k366196K544800K814010J603623l28293
651A06688034j169014j9592k760071j676178J723320L02300J526039J483863k578079
659.7A03520622k048462j015800N53421P89474j017891J374596J709747K627991M884483
668.3A11378181q748100m171005k77863K370179O36566o73149k19109L6034J082763
677A01414497j187591k782913j716553r44801l56415J352928L607071J520103j892166
685.7I9014160j547821l29430p73063j33209J191681K45422M92592M64035k131241
694.4I6493126k247017L05901J268516J165924Q68782o07292r91959j303062j099403
$$ plain form
633.6 102046593 103884003 103183601 104246323 105577141 103248909 102027657 101724586 100636948 99486183
642.3 99486183 100293381 103466805 105381165 102420090 100053894 102598694 105412704 107016327 106688034
651 106688034 105519020 105499428 102739357 101063179 102786499 103088799 104614838 106098701 103520622
659.7 103520622 101472160 100456360 101009781 101799255 100781364 102155960 103865707 106493698 111378181
668.3 111378181 102630081 98459076 98181213 100551392 101187958 100514809 100295700 100331734 101414497
677 101414497 100226906 97443993 95727440 94782639 94426224 95779152 99386223 100906326 99014160
685.7 99014160 97466339 97136909 96363846 96230637 97422318 97667740 98160332 98624367 96493126
694.4 96493126 94246109 94552010 95820526 96986450 97855232 97247940 96255981 94952919 93853516
703.1I3853516O88385J285080P35931k14127p92686j402924m91111Q10356p96540p18505
712.7I2957375J660499J042214k529145k197853J73981m70596o32050p48428J20346
721.4H9376343P79625j813744j368767Q16262P85354J557060J571267K79693J67984
730.1I2151077j005806j562782K763107M519448q87802k267548M35898J743774K177353
738.7I8066719L21846j169990q19779L5515J062653J890251J909240m93751j954552
747.4I8848152j345192J335694L612350O20018r25125m4388p01431m93744R6832Q10547
757.1A01813713K75017j840950o25984K342834J087303j077865j418785j368416J384704
765.7A00571571K340088L4798j03760n12657j517281m7515P23289O76918J988426M58466
$$ plain form
703.1 93853516 94541901 95826981 96562912 96348785 95556099 94153175 93662064 94472420 93675880 92957375
712.7 92957375 94617874 95660088 93130943 90933090 91107071 90636475 90004425 89255997 89376343
721.4 89376343 90155968 88342224 86973457 87789719 88575073 90132133 91703400 91983093 92151077
730.1 92151077 91145271 89582489 92345596 96865044 95977242 93709694 94145592 95889366 98066719
738.7 98066719 98388565 97218575 96398796 96434311 97496964 99387215 101296455 100802704 98848152
747.4 98848152 97502960 98838654 102451004 103071022 102145897 102101509 101400078 100906334 101003166 101813713
757.1 101813713 102088730 100247780 99621796 101964630 103051933 101974068 100555283 99186867 100571571
765.7 100571571 102911659 102946457 102842697 102330040 100812759 100765244 101488533 102165451 104153877 104612343
775.4A04612343j393242j51199M47052N52139n09163j571198o10298Q21358J380844
784.1A03578636L58994p47452n97763M47395L07816J440063J873505k398049k290420
792.7A01972725K70576J232674K704308P39387j265121r66317l26347L72856k46605
801.4A04488136j40175J30768m15710p14493q07503J049095K078415q47473j131141
810.1A03689919N87226O16311J667869n42793k461266j24229k73224L36861J857071
818.8A05353745J226921k15340k292282j359711L80371N41893P11930N75172N41122
827.5A05463821p54829j278511q0620L96065P07992j38763k099792j613968P12570
836.1A01313965Q31642N09521Q68363o53328p85637N60814J034164K72149j250809
$$ plain form
775.4 104612343 103219101 103067902 103514954 104067093 103557930 101986732 101376434 102197792 103578636
784.1 103578636 103937630 103190178 102592415 103039810 103347626 104787689 106661194 104263145 101972725
792.7 101972725 102243301 103475975 106180283 106919670 105654549 104688232 104361885 104734741 104488136
801.4 104488136 104347961 104478729 104063019 103348526 102541023 103590118 105668533 104821060 103689919
810.1 103689919 104277145 104893456 106561325 106018532 103557266 103433037 103159813 103496674 105353745
818.8 105353745 106580666 106365326 104073044 102713333 103093704 103635597 104347527 104922699 105463821
827.5 105463821 104708992 103430481 103349861 103745926 104453918 104315155 102215363 100601395 101313965
836.1 101313965 102145607 102655128 103523491 102870163 102084526 102645340 103679504 103951653 102700844
844.8A02700844o93314k75192n31975O27106Q73878L18413m4754r33800r07951O07216
854.5A01740471L26630r56246r6702O60316O27129k77451p31354Q5564m24866J869
864.1A00955360J138123J208816O54290j259186k129204j226997J101684K511887J175072
872.8A04129845j19309j232368j064446r3971N71312Q68027P0961J31004N066l50830
882.4A02915291J57295P02904J07742j800354p22031J849167J359322p19025j565353
891.1A02284958r84085J32950J102607Q17749L85056K39586j85402j372231j107154
899.8A01314034J486381J110542l91441r14040j388069m9492J153939J109176p98301
908.5A02632729j155396N9761m78973O05568Q49373j300728j600777R03191J943229
$$ plain form
844.8 102700844 102007530 101732338 101200363 101827469 102701347 103019760 102975006 102041206 101133255 101740471
854.5 101740471 102067101 101110855 101014153 101674469 102301598 102024147 101292793 101378357 100953491 100955360
864.1 100955360 102093483 103302299 103956589 102697403 100568199 99341202 100442886 102954773 104129845
872.8 104129845 104010536 102778168 101713722 101619751 102191063 103059090 103130051 103261055 103266121 102915291
882.4 102915291 103072586 103775490 103883232 102082878 101360847 103210014 104569336 103850311 102284958
891.1 102284958 101300873 101433823 102536430 103354179 103739235 103978821 103793419 102421188 101314034
899.8 101314034 102800415 103910957 103519516 102605476 101217407 101167915 102321854 103431030 102632729
908.5 102632729 101477333 101537094 101058121 101663689 102513062 101212334 99611557 100514748 102457977
917.2A02457977m88228q47747o4179p93167p76855L85223R73999O88011N01633p19582
926.8A01317085q68980Q18054Q95958j63414o46683p8109L45863n76462m43634N70931
936.4A01170609K32086Q3236m31228p78809P77672O54160l91167o14868j32973J059372
946.1A01628090q133q06389m23973p43744K6169N79941M73320M83444K00043k38488
955.7A01170280p92526R0676R84352m34426q74511M07661L91182l84613l69446q9241
965.4A00099388N0858Q0322j36246k33894p2647N12184N50346o23550k8580M19129
975A00617310j075951l97499P56592P40104K14562q76663k40380J4054n77156P52380
984.7I9927353J75850j364037L57163M72816o44928N13649K91878o99242l81439M32716
$$ plain form
917.2 102457977 101969749 101122002 101057823 100264656 99487801 99873024 100847023 101535034 102036667 101317085
926.8 101317085 100448105 101266159 102162117 101998703 101352020 101273911 101619774 101043312 100599678 101170609
936.4 101170609 101402695 101485931 101054703 100275894 101053566 101707726 101316559 100701691 100568718 101628090
946.1 101628090 101619957 100813568 100389595 99645851 99672020 100251961 100725281 101208725 101408768 101170280
955.7 101170280 100377754 100468430 101452782 101018356 100143845 100551506 100942688 100558075 100188629 100099388
965.4 100099388 100150246 100230568 100094322 99860428 99787781 100299965 100850311 100226761 100198181 100617310
975 100617310 99541359 99143860 99900452 100640556 100855118 99978455 99738075 99752129 99174973 99927353
984.7 99927353 100103203 98739166 99096329 99569145 98924217 99437866 99729744 99030502 98649063 99081779
994.3I9081779P96486k95623p54349j89133k30423O7696Q41057N59326k4048n99587
1004I9253181j185661j54922M23607N4969k34382r34067k38686L66272j93756j58623
1013.6I6997932j01173o88644r83544l97354J77101P63924q6655j471130m92333J73546
1023.2I3891670L1037j02318o51718p67983o64383j44699j24100n00869p04033j016068
1032.9H9246536j07223O17103k4192q03818n07859N63424L3088o569J181412M70184
1042.5I0662086p98538p64854K50969J151367P99705J9089n19249o67557K50901N63003
1052.2I0946922L0442M26338K34726n27191j40198Q95378J120453j29311j149040m03275
1061.8I1305244N75989P89566P90161k91633l66768P53937L22288j33934J75224N69649
$$ plain form
994.3 99081779 99878265 99582642 98828293 98639160 98408737 98476433 99317490 99876816 99852768 99253181
1004 99253181 98067520 97912598 98336205 98391174 98156792 97222725 96984039 97350311 97156555 96997932
1013.6 96997932 96896759 96208115 95224571 94827217 95004318 95768242 95681587 94210457 93718124 93891670
1023.2 93891670 93922707 93820389 93168671 92400688 91736305 91591606 91467506 90966637 90262604 89246536
1032.9 89246536 89139313 89756416 89732224 88928406 88420547 88983971 89017059 89010490 90191902 90662086
1042.5 90662086 89863548 89098694 89349663 90501030 91300735 91319824 90800575 90133018 90383919 90946922
1052.2 90946922 90977364 91403702 91638428 91111237 90971039 91866417 92986870 92857559 91708519 91305244
1061.8 91305244 91881233 92670799 93460960 93169327 92802559 93556496 93878784 93744850 93920074 94489723
1071.5I4489723n32326j357437K71279J195678N74204l80493j151612j432815n33508
1080.1I1142693Q8142o38077m79248p7011n25085j017746k22290L57109n11292p62184
1089.8H7355011q98628m68140M77020N61707m42566r32121p13608r84619P3532N86563
1099.4H4614151J220268J158432j039551l98407N95849R57847Q77297m19617n50964
1108.1H7015305k25670k75566r179J063912J30363j222976n49889k1156N62752K93815
1117.7H6761711m39545j006454m79271Q53828N11048L69484O00090l85819o32507R02039
1127.4H7054604J376342M30672j266678j882149J00289P21916N4443p51045j270775
1136.1H4567619q99337p68723O7825L26859l1578p23274j117890m24194J06399L52761
$$ plain form
1071.5 94489723 93957397 92599960 92871239 94066917 94641121 94260628 93109016 91676201 91142693
1080.1 91142693 91230835 90592758 90113510 90036499 89511414 88493668 88271378 88628487 88117195 87355011
1089.8 87355011 86456383 85988243 86465263 87026970 86584404 85652283 84938675 83954056 84027588 84614151
1099.4 84614151 85834419 86992851 85953300 85554893 86150742 87108589 87985886 87566269 87015305
1108.1 87015305 86789635 86514069 86504890 87568802 87699165 86476189 85926300 85905144 86467896 86761711
1117.7 86761711 86322166 85315712 84836441 85690269 86201317 86570801 87170891 86785072 86152565 87054604
1127.4 87054604 88430946 88861618 87594940 85712791 85813080 86534996 86589439 85838394 84567619
1136.1 84567619 83668282 82899559 82967384 83294243 83262665 82539391 81421501 80997307 81103706 81456467
1145.7H1456467l93860p54975r97955j125992p98874p27134q2627p09297j594932j500016
1155.4G2770805l44207M34997q56880j648499r31236O14830R8961o82152l57109q17100
1165F8282410m14002O6864M64646N05050o0341q77395j177635j30173O74713P06184
1174.6F8040321J41999l88581p65571J73675P31087j58829R1187M63714M88587J26343
1184.3F8943932O45797J198868J21559l18023M26902J079331Q53912Q58498K21405
1193G4032181j80321M77989P14646J010727O58081O58226N08262L03345O70822K37770
1202.6G9091728M25888P76673K18681k87262L56979P51656L24455K43851J48773L16071
1212.3H2367493n4779p2144L57758J46339J08002J49154N00184J81358l80257q8379
$$ plain form
1145.7 81456467 81062607 80307632 79309677 78183685 77384811 76657677 76575050 75865753 74270821 72770805
1155.4 72770805 72426598 72861595 72004715 70356216 69424980 70039810 70138771 69456619 69099510 68282410
1165 68282410 67868408 67935272 68399918 68904968 68844627 67967232 66789597 66659424 67334137 68040321
1174.6 68040321 68182320 67793739 67028168 67201843 67932930 67774101 67865288 68329002 68817589 68943932
1184.3 68943932 69589729 70788597 70910156 70592133 71019035 72098366 72952278 73810776 74032181
1193 74032181 73851860 74329849 75044495 76055222 76713303 77371529 77879791 78183136 78853958 79091728
1202.6 79091728 79517616 80294289 80512970 80225708 80582687 81334343 81658798 81902649 82051422 82367493
1212.3 82367493 82312714 82240570 82598328 82744667 82852669 83001823 83502007 83683365 83303108 83214729
1221.9H3214729J79642l5118k62062p1579k00775j59172k22771l43895O8008r483l11813
1232.5H1845711l74161j71761J40015K31789n31555q57438j88453n8213o1233o3438
1242.2G9911263P2196k9800J12480M62502L35388M02740j0757n8823J57273M97627
1251.8H1852089Q88824N78637K33055n8365J03859M1931M04190P43652N5733n34874
1261.4H4308731n98442M71886O05369K86186N35485j61652j58401N22308M53560l9963
1271.1H6225067o950j91147k34230K82471L03596K07451m62578n26695K80105Q48908
1280.7H6725998R45686K20970p0152J13419N21530P89276N67535J64711j38839j70151
1290.4H9669983q5968O72233N55863m91608k73971J6807j92550j44501j75003j93779
$$ plain form
1221.9 83214729 83394371 83359253 83097191 83025612 82824837 82665665 82442894 82098999 82167007 82157524 81845711
1232.5 81845711 81471550 81299789 81439804 81671593 81140038 80282600 80094147 80035934 79974701 79911263
1242.2 79911263 79983459 79953659 80066139 80528641 80864029 81266769 81256012 81197189 81354462 81852089
1251.8 81852089 82740913 83319550 83552605 83494240 83598099 83640030 84044220 84787872 84843605 84308731
1261.4 84308731 83710289 84182175 84787544 85073730 85609215 85447563 85289162 85811470 86265030 86225067
1271.1 86225067 86218117 86026970 85792740 86075211 86378807 86586258 86123680 85596985 85877090 86725998
1280.7 86725998 87671684 87892654 87822502 87935921 88457451 89246727 89814262 89978973 89840134 89669983
1290.4 89669983 89584015 90256248 90812111 90320503 90046532 90063339 89870789 89726288 89551285 89357506
1300H9357506j27114j93893J77414Q47481Q18092J04790l10806n2170J04858K83310
1309.7I1009468L19595M8409k40418j46591L42179L52638K47001k86926m55765R3544
1319.3I1283134K11060M25285J61667j22627l8681K28599P15951M84817K97707K37007
1328.9I3883919j06339j30211J41884M40613J82533l74153m40208k05956K66022M77943
1338.6I4136047k29171p87865n09445k63687k4880K5269j94496m23836l33870j808
1348.2I1392258K2094J3131L35655J79130l69690R3018N36278M53750L45856p1915
1357.9I2929565k10693l18703k15698K08199L28506p08183j447876q61488o11550n39108
1367.5H8552971m63020p23580p99949m49006j33239k83745J24405k60666j051743m86152
$$ plain form
1300 89357506 89230392 89036499 89213913 90061394 90879486 90984276 90673470 90621300 90726158 91009468
1309.7 91009468 91329063 91377472 91137054 90990463 91332642 91685280 91932281 91645355 91189590 91283134
1319.3 91283134 91494194 91919479 92081146 91958519 91919838 92148437 92864388 93349205 93646912 93883919
1328.9 93883919 93777580 93647369 93789253 94229866 94412399 94038246 93598038 93392082 93658104 94136047
1338.6 94136047 93906876 93119011 92609566 92345879 92320999 92346268 92151772 91727936 91394066 91392258
1348.2 91392258 91414352 91427483 91763138 91942268 91572578 91665596 92201874 92655624 93001480 92929565
1357.9 92929565 92718872 92400169 92184471 92392670 92721176 92012993 90565117 89703629 89092079 88552971
1367.5 88552971 88089951 87366371 86566422 86117416 85984177 85700432 85824837 85564171 84512428 84026276
1377.2H4026276O15738J465416R82467Q45627J099075J067345Q04306P29027L88832
1385.8I2024109K68341P73277j14898J77543M13819l8117k29706k90779M80339N32562
1395.5I3996490j21376k33299l0540J76407J91146N75768M80217O97845O15578J0346
1405.1I6358582M2465L89633L87047k05918l52340l11150k56744l81043m81064n57029
1414.8I4632439p18415l90831l8673L53569P8285n55801N8967O6307K19826M05480
1424.4I4111153J00425R39k26425l43308m36302p07428r3452O2004o92589p10694j61590
1435I0902733K96921m38530j357529p09763p70065j64513k78640o99044l95187k18422
1444.7H6167961j75072l51821j86760p33666m00505j60980n51468q17055j382988r03610
$$ plain form
1377.2 84026276 84642014 86107430 87089897 87935524 89034599 90101944 90906250 91635277 92024109
1385.8 92024109 92292450 93065727 92950829 93128372 93542191 93504074 93274368 92983589 93463928 93996490
1395.5 93996490 93875114 93641815 93611275 93787682 93978828 94554596 95034813 95732658 96348236 96358582
1405.1 96358582 96401047 96790680 97177727 96971809 96619469 96308319 96051575 95670532 95189468 94632439
1414.8 94632439 93914024 93523193 93484520 93838089 93916374 93360573 93419540 93485847 93705673 94111153
1424.4 94111153 94211578 94212517 93986092 93642784 93206482 92499054 92405602 92467606 91775017 91064323 90902733
1435 90902733 91199654 90761124 89403595 88693832 87923767 87759254 87480614 86781570 86386383 86167961
1444.7 86167961 85992889 85641068 85454308 84720642 84320137 84159157 83607689 82790634 81407646 80504036
1454.3H0504036j193207o92314L76648r18480R2903p36809l90235p18720j75140j72951
1464G5975731n92651K65388l73070J347023J815300L122399L029770K644096N108940
1472.6I2342926K475571J575714O06109J016884N21233L46741Q27453N57221O90574
1481.3A00960426j724M93073Q57269O95839P11098L79821j6960k94632P72804P988
1491A04565002j4808K19345k63504L44032J153221R26682r86374o12229j73347j36215
1500.6A05021805Q1558J26167K55478R2308N34653O72256k01065N3246m77448Q3886
1510.2A06242844k22786K82608L10112l50350k13234L67234R30885m92462j2139L70118
1519.9A07212830J094230j50596j459710j07505j28128K55500j83441j31393K41730
$$ plain form
1454.3 80504036 79310829 78618515 78995163 78076683 78169586 77432777 77042542 76323822 76148682 75975731
1464 75975731 75383080 75648468 75275398 76622421 78437721 81560120 84589890 87233986 92342926
1472.6 92342926 94818497 96394211 97000320 98017204 98538437 98885178 99712631 100269852 100960426
1481.3 100960426 100958702 101451775 102309044 103004883 103715981 104095802 104078842 103784210 104557014 104565002
1491 104565002 104550194 104769539 104506035 104850067 106003288 106929970 105943596 105331367 105158020 105021805
1500.6 105021805 105103363 105229530 105485008 105577316 106111969 106784225 106583160 106636406 106158958 106242844
1510.2 106242844 106020058 106302666 106612778 106262428 106049194 106416428 107347313 106854851 106842712 107212830
1519.9 107212830 108307060 108156464 106696754 106589249 106461121 106716621 106533180 106401787 106643517
1528.6A06643517n570N4390l899L52669L54225N0026r8144M19J92505j62147k24854
1539.2A07153137k57728Q41392Q57002q99566o60187n95390l29743K56378K62581K32971
1548.8A06860847N08393j08902k03751J23413p5859J648J43753L04993M34494K64671
1558.5A08253700j599632m66873M76295Q1078K24228k55295k16217L56850M2488J14509
1568.1A07011131R9633J49200l74619k38853J07658J09612J53297P58797O61324j158570
1577.7A07278610l61603J29471M860j75079l4180N4939r5771J71150m0726j93168j79986
1588.4A06558517j35894N13755K83204l55851m27421n8495L52776M42322N7426l59802
1598A06870537l48450k99187K98066N33210J47370l97362m26231J57684K88048K47657
$$ plain form
1528.6 106643517 106637947 106692337 106688438 107041107 107395332 107445358 107347214 107347633 107540138 107377991 107153137
1539.2 107153137 106895409 107736801 108593803 107694237 107034050 106438660 106108917 106365295 106627876 106860847
1548.8 106860847 107369240 107260338 107056587 107180000 107104141 107105789 107249542 107554535 107989029 108253700
1558.5 108253700 106654068 106187195 106663490 106744568 106968796 106713501 106497284 106854134 106896622 107011131
1568.1 107011131 107110764 107259964 106885345 106646492 106754150 106863762 107017059 107775856 108437180 107278610
1577.7 107278610 106917007 107046478 107051338 106876259 106842079 106897018 106801247 106972397 106931671 106738503 106558517
1588.4 106558517 106422623 106936378 107219582 106863731 106436310 106377815 106730591 107172913 107230339 106870537
1598 106870537 106522087 106222900 106520966 107054176 107201546 106804184 106377953 106535637 106823685 107071342
1607.6A07071342p507J57746k62665n14786j36337j91086K63573J85256k5733j77926
1617.3A06361877q9698L52798q919r2826k66549n5931M50424j86370j76758j81191
1626.9A06106857j8600l32771K8259L93654P1891k45101j10230M34326P85980J12099
1636.6A07226364o07139p14875m13238m21570k9289M3266P9689k07283j79138K7855
1646.2A04804642N73684O63979j053131o49445l14720J98479K626114N82397j796860
1654.9A05635139j466255m56062m9530L37967M75113J39023j80611l13431M74625J18637
1664.5A04714615K3056q3275k41852j68174j9562P27783N63538j57013o75225j55189
1674.2A04528702k01332j08193L63533q4633r5420k01767o4034M8004L12584J224137
$$ plain form
1607.6 107071342 107063835 107221581 106958916 106444130 106307793 106116707 106380280 106565536 106539803 106361877
1617.3 106361877 106272179 106624977 106616058 106523232 106256683 106200752 106651176 106464806 106288048 106106857
1626.9 106106857 106088257 105755486 105783745 106177399 106249290 106004189 105893959 106328285 107114265 107226364
1636.6 107226364 106619225 105904350 105491112 105069542 105040253 105083519 105163208 104955925 104776787 104804642
1646.2 104804642 105378326 106042305 104989174 104339729 104025009 104223488 106849602 107431999 105635139
1654.9 105635139 104168884 103712822 103663292 104001259 104476372 104615395 104434784 104121353 104595978 104714615
1664.5 104714615 104737671 104654396 104412544 104244370 104224808 104952591 105516129 105359116 104683891 104528702
1674.2 104528702 104327370 104219177 104582710 104498077 104402657 104200890 104136856 104184860 104497444 105721581
1683.8A05721581j031579j498718o37840J65657N9151j72379m59679r86473l62945
1692.5A00796776K853K83173n0347r01374q08640o70563J86966j12350k046738q20221
1702.1I5859535n20065n39276o13770l21708j366547j467232j099373j066284j151588
1710.8H7713692r38393p30293p77603q30544j362778j001403n19333r54460j166245
1719.5G9432640r52347r29580r48853r38980j137444j189216j192238j452889j773490
1728.2F8917603j646706k247429k949696k346378j811825j781391m913456k405067
1735.9D8815655k408493j898053j467712q50254l69183n43098O07975P78320J498173
1744.6D4163330P22874J460537J677528K344559L726147J660091M068207L728248K840981
$$ plain form
1683.8 105721581 104690002 103191284 102553444 102719101 102778252 102605873 102146194 101159721 100796776
1692.5 100796776 100799629 101082802 101032455 100131081 99322441 98651878 98838844 98726494 96679756 95859535
1702.1 95859535 95339470 94800194 94186424 93864716 92498169 91030937 89931564 88865280 87713692
1710.8 87713692 86775299 86045006 85267403 84436859 83074081 82072678 81553345 80598885 79432640
1719.5 79432640 78480293 77550713 76601860 75662880 74525436 73336220 72143982 70691093 68917603
1728.2 68917603 67270897 65023468 62073772 59727394 57915569 56134178 51220722 48815655
1735.9 48815655 46407162 44509109 43041397 42191143 41821960 41278862 41886837 42665157 44163330
1744.6 44163330 44886204 46346741 48024269 50368828 54094975 55755066 59823273 63551521 66392502
1753.3F6392502L084999K960258K971688L733223L694389K171371K199433J599884
1761H8807747K682632K265534Q20686J238739J043732J049812M16550Q78670R26086
1769.7A00130188J92818L12172P99018P26250k2316L31505K71538K42012J96609J15822
1779.3A03295616M31687P7705L85818J43639L243J59210N2795O2737j96541K78686
1788.9A04694595M97849M10911J59829M4448j92787l50456K00508R5093Q2481J45050
1798.6A05787521k57171J9890K79861L55423m1237q9943K31110K41119L1555j06498
1808.2A06451630q4168o9557K17392J91788J25244J6685k04475j00227M1175K65770
1817.9A06851257J87294j12518p4989n9037k60620P9766O26709J41403n04913n1583
$$ plain form
1753.3 66392502 69477501 72437759 75409447 79142670 82837059 85008430 87207863 88807747
1761 88807747 91490379 93755913 94576599 95815338 96859070 97908882 98325432 99204102 100130188
1769.7 100130188 100323006 100635178 101434196 102160446 102138130 102469635 102741173 102983185 103179794 103295616
1779.3 103295616 103727303 103805008 104190826 104334465 104337708 104496918 104549713 104612450 104415909 104694595
1788.9 104694595 105192444 105603355 105763184 105807632 105614845 105264389 105464897 105559990 105642471 105787521
1798.6 105787521 105530350 105550240 105830101 106185524 106144287 106054344 106285454 106526573 106558128 106451630
1808.2 106451630 106367462 106297905 106515297 106707085 106832329 106849014 106644539 106544312 106585487 106851257
1817.9 106851257 107038551 106926033 106851044 106792007 106531387 106611153 107237862 107379265 106874352 106822769
1827.5A06822769K88223J22292r38O4735l35045m57809J34758M48044K21183J3695
1837.2A07321907k23694j07536j6098O9389M43146K90451Q5167l68393j59706L42491
1846.8A07677124K60719j55533m27200j55716K37686J98708J26434k876l90190l78777
1856.4A06990379J90865K37862J63162P1930k41486m5395K04163O7558j58585n34m1915
1867.1A07438004r1034N77934L16078l12118n16663l20648N9364J22032J78375k1781
1876.7A07429543j86005j46622j00372J11282K73743J08246k91085l56193l8353K15210
1886.3A07019394K55699M9042j00632O355M12J45684K37739l4126M6364q202j82579
1896.9A07435150J51817J37238k55142k56180q2573L0861K72392K55577k8015j84143
$$ plain form
1827.5 106822769 107110992 107233284 107232346 107297081 106962036 106504227 106638985 107087029 107308212 107321907
1837.2 107321907 107098213 106990677 106974579 107043968 107487114 107777565 107862732 107494339 107334633 107677124
1846.8 107677124 107937843 107782310 107355110 107199394 107437080 107635788 107762222 107759346 107369156 106990379
1856.4 106990379 107181244 107419106 107582268 107654198 107412712 107367317 107571480 107639038 107480453 107479919 107438004
1867.1 107438004 107346970 107924904 108240982 107928864 107412201 107091553 107150917 107272949 107451324 107429543
1876.7 107429543 107243538 107096916 106996544 107107826 107381569 107489815 107198730 106842537 106804184 107019394
1886.3 107019394 107275093 107324135 107223503 107229858 107230270 107375954 107613693 107579567 107625931 107617729 107435150
1896.9 107435150 107586967 107724205 107469063 107212883 107130310 107161171 107433563 107689140 107661125 107476982
1906.6A07476982j34270J43639K99179J68152l53821m04472O4110K02598J58714J5549
1916.2A07636360j17019k55272j12519K65633L19305J86264j05400l61191k01118M8164
1925.9A07303207J61774J44234J67373o1920k71324n2391K47826M7828l05381j36185
1935.5A07245041R6573J22711J2566m3084Q8211J56380L4546k64664j40670O1348J56745
1946.1A07525703J81733N0041n9212j85585k05399N356Q8250R1209O576j81610P6668
1956.7A07393730K28691r7717j86150j01356J00220J81289j5587L3287J35628J57807
1966.4A07829842J7150l38607j33873K60795Q0689j25458j9546m9309N3268J40053
1976A07715004K4384k4483j63689k5223J40480n4504J33888K20864j27465j16493P2090
$$ plain form
1906.6 107476982 107342712 107486351 107785530 107953682 107599861 107195389 107259499 107462097 107620811 107636360
1916.2 107636360 107519341 107264069 107151550 107417183 107736488 107922752 107817352 107456161 107255043 107303207
1925.9 107303207 107464981 107609215 107776588 107714668 107443344 107390953 107638779 107686607 107381226 107245041
1935.5 107245041 107341614 107464325 107476891 107433807 107522018 107678398 107712944 107448280 107307610 107368958 107525703
1946.1 107525703 107707436 107757477 107698265 107512680 107307281 107312637 107400887 107492096 107498672 107317062 107393730
1956.7 107393730 107622421 107524704 107338554 107237198 107337418 107518707 107503120 107536407 107672035 107829842
1966.4 107829842 107846992 107508385 107374512 107635307 107715996 107590538 107570992 107521683 107574951 107715004
1976 107715004 107739388 107714905 107551216 107525993 107666473 107611969 107745857 107966721 107839256 107722763 107794853
1986.6A07794853J39206n6770l10135j45882P8102J47293k9449j20010n7907r7634
1996.3A07341667K9808J71051J24390J09726j19972k34192J34582J29570p7507J37879
2005.9A07747002L715k15149R850N9013Q1818Q6746j74500o4781J30692l89J36291
2016.5A07800308J26328j28632k05269k13279J11831J52992j40411o2469j1345L4004
2026.2A07464058J91040K0279j34377l0716j37588n3352J95495L227j75735j18095
2035.8A07224236J26937K98012J99196P3219o2133j80916j93512J00189J29990j19248
2045.5A07595970L7270Q8104m311J7403L9833K312j1254M998j32935p0724j3565j5389
2057A07537712Q0109m0169j4282J36436K19780O6261j59385K6871m7532j56387J10214
$$ plain form
1986.6 107794853 107934059 107877289 107567154 107421272 107499374 107646667 107617218 107497208 107439301 107341667
1996.3 107341667 107371475 107542526 107666916 107776642 107656670 107422478 107557060 107686630 107609123 107747002
2005.9 107747002 107750717 107535568 107545418 107604431 107686249 107772995 107598495 107533714 107664406 107664017 107800308
2016.5 107800308 107926636 107798004 107592735 107379456 107491287 107644279 107503868 107441399 107430054 107464058
2026.2 107464058 107655098 107675377 107541000 107510284 107372696 107319344 107514839 107518066 107342331 107224236
2035.8 107224236 107351173 107649185 107848381 107921600 107859467 107678551 107485039 107585228 107715218 107595970
2045.5 107595970 107633240 107721344 107717033 107734436 107774269 107776581 107765327 107770325 107637390 107566666 107553101 107537712
2057 107537712 107617821 107577652 107563370 107699806 107919586 107985847 107826462 107853333 107805801 107649414 107759628
2067.6A07759628N4138J2230J46668j8479o5086J8074j74675J3550K66472l1265m4342
2078.2A07936913J8020j1345J40564L1128j17706k34596k68929K5826K95990K18780
2087.9A08034645J26465O2759k27264j65665k060R354N203k0172J46462j03913j06315
2098.5A07759499K51770K7778o447O1409j4686J15524J96564K5085k73185l30559j74088
2109.1A07638664k0889K68677M94453P8636k72247k03644j03615K23343J82274l9947
2118.7A08245705R819n3719j06857R1133K35580N410j23635j99051j59660Q5587J88415
2129.4A08218727J18576j89445q1543J89178R9938k01126l40035O1760J53870J90902
2139A08220802K37610n0537l0044o1791j35017K8938p828k19925k9045J48697K3834
$$ plain form
2067.6 107759628 107813766 107825996 107972664 107954185 107889099 107907173 107732498 107746048 108012520 107981255 107936913
2078.2 107936913 107954933 107943588 108084152 108115280 107997574 107762978 107494049 107519875 107815865 108034645
2087.9 108034645 108161110 108223869 107996605 107830940 107828880 107838234 107843437 107823265 107969727 107865814 107759499
2098.5 107759499 108011269 108039047 108032600 108094009 108079323 108194847 108391411 108416496 108143311 107812752 107638664
2109.1 107638664 107617775 107886452 108380905 108459541 108187294 107983650 107880035 108103378 108285652 108245705
2118.7 108245705 108255524 108201805 108094948 108186081 108421661 108427071 108303436 108104385 107944725 108030312 108218727
2129.4 108218727 108337303 108147858 108066315 108255493 108355431 108154305 107814270 107876030 108029900 108220802
2139 108220802 108458412 108407875 108377831 108316040 108181023 108209961 108202133 107982208 107953163 108101860 108125694
2149.6A08125694Q9569K5193j17997k71629k62207J28899M69848M09668j14303l93792
2159.3A08088943k36595J43486K95792J5762j38000r6115R6870p2349j21399K25601
2168.9A08201996P6874q8517j61079r4917J61255M0115j49918j90239n4893K05101
2178.5A07945778J84280Q110L5103j9020j45943m6867J24619J85150j17585k94410
2188.2A07859215k8893J16097J95419K11578n8082k37297K6459K14134R6512O6597
2197.8A08461739j23002k12577o920M7531J83327J02874k11647j34559R247O0585Q5273
2208.4A08261871l3607k05170j56570R6672J45744O4476j73721l16773J34140M37943
2218.1A08255005J93359N1354p4829l45726k63550q5701J64161M42559P4035j79740
$$ plain form
2149.6 108125694 108215263 108240456 108122459 107850830 107588623 107717522 108187370 108597038 108482735 108088943
2159.3 108088943 107852348 107995834 108291626 108307388 108169388 108073273 108170143 108097794 107976395 108201996
2168.9 108201996 108278870 108190353 108029274 107934357 108095612 108135727 107985809 107795570 107740677 107945778
2178.5 107945778 108130058 108138168 108173271 108154251 108008308 107961441 108086060 108271210 108153625 107859215
2188.2 107859215 107830322 107946419 108141838 108353416 108295334 108058037 108084496 108298630 108395142 108461739
2197.8 108461739 108338737 108126160 108119240 108166771 108350098 108452972 108241325 108106766 108116013 108176598 108261871
2208.4 108261871 108228264 108023094 107866524 107963196 108108940 108173416 107999695 107682922 107817062 108255005
2218.1 108255005 108448364 108499718 108424889 108079163 107815613 107729912 107894073 108336632 108410667 108230927
2227.7A08230927q4069j37604M9111J98631j06026l18573l6537J52985P8476O5544
2237.4A08092865J18340l083k68150j17149M1618L3966J26831M1779j14129q8653K89276
2248A08153511K78343j42807k21321k30148m5166J09077P8003R6405L9345j6121q3359
2258.6A08015762Q2489L3333k78801j9218K22130O8397m6287M0023J18866j21635j61957
2269.2A07953102j694r5886R140J83502K8626r3506j00746n5832O9885N1056J289J38955
2280.8A08087891J04263j52275l2135J79970j03005j96762j3885j28312j74209j1177
2290.4A07560364J65031J95252M3625q6800j60751q3603R5619J8608k08519L9787J49788
2301A07728401j55350k0362O6772J60774R8641m28940l51173K05329M59687N9745k49153
$$ plain form
2227.7 108230927 108146858 108009254 108058365 108256996 108150970 107832397 107795860 107948845 108027321 108092865
2237.4 108092865 108211205 108208122 107939972 107822823 107864441 107898407 108025238 108067017 107952888 107864235 108153511
2248 108153511 108431854 108289047 108067726 107837578 107792412 107901489 107979492 108075897 108115242 108099121 108015762
2258.6 108015762 108098251 108131584 107852783 107833565 108055695 108124092 108077805 108117828 108236694 108115059 107953102
2269.2 107953102 107951408 107855522 107864662 108048164 108076790 107983284 107882538 107826706 107896591 107947647 107948936 108087891
2280.8 108087891 108192154 108039879 108007744 108187714 108084709 107887947 107874062 107745750 107571541 107560364
2290.4 107560364 107725395 107920647 107964272 107877472 107716721 107633118 107728737 107747345 107538826 107578613 107728401
2301 107728401 107573051 107552689 107619461 107780235 107878876 107449936 107098763 107304092 107763779 107823524 107574371
2311.6A07574371j11419p5402r7694n188J40297k28523j70365K28279J23734L20595
2321.3A07698685m6677n04295j25244L56010K97501M470j92680p55127p02591m5677
2330.9A05984375M72122M08287k01164k84676P8934K43767J36391J36215n02312j66786
2340.6A06305153K07115m17595N07179O81168N4092l60015j27991K46094k2202m1290
2350.2A07031708m71550k93198K32102J15783K32872n04486k16072j18683P2953P32399
2359.8A06813828R52232P37083j219986j303978n24520R20944J374473k82394o26930
2368.5A06840752m41780J21360J90232M22058N54146l02384l33580O8779L22960K57790
2378.2A07700333J13067m8042j60385r926m3541J53992L22067J75941P9529r1064o9466
$$ plain form
2311.6 107574371 107462952 107387550 107289856 107284668 107424965 107196442 107026077 107254356 107378090 107698685
2321.3 107698685 107652008 107147713 107022469 107378479 107675980 107680450 107487770 106732643 106030052 105984375
2330.9 105984375 106456497 106864784 106663620 106378944 106457878 106701645 106838036 106974251 106471939 106305153
2340.6 106305153 106512268 106094673 106601852 107283020 107337112 106977097 106849106 107095200 107072998 107031708
2350.2 107031708 106560158 106266960 106499062 106614845 106847717 106343231 106127159 106008476 106081429 106813828
2359.8 106813828 107766060 108503143 107283157 105979179 105454659 106375603 107750076 107467682 106840752
2368.5 106840752 106398972 106520332 106710564 107132622 107686768 107384384 107050804 107119583 107442543 107700333
2378.2 107700333 107813400 107765358 107604973 107595047 107551506 107705498 108027565 108203506 108283035 108191971 108122505
2388.8A08122505O0814N2544N2086j69136l07122L1357J94367K13562Q8234j71570
2398.4A08167641L7414Q5640r0095j06446J2497M2374j34468K2240M8286N119O7261
2409A08157463k8755k1576r6535p942Q9142J58371J08322j91414l1082Q8493j6220
2419.6A08208267m9896R3582J48438k25518j17958J09940M6554n378m2084L4584j14944
2430.2A08085587N1689J09337j47004P8476N6702M8729J46271k9419q6716l1830k4917
2440.8A08256905j15273J30600O7917j75095J15342J57836J54999j2993l04306j87217
2450.5A08088715M7218J45439l89M4228M5684m2617r0317p3937J98220j3916j42334
2461.1A08205994l5584k14622M3594L65242K20467p0328j53992o2324l0655J747R38
$$ plain form
2388.8 108122505 108183319 108235863 108287949 108118813 107811691 107843048 108037415 108250977 108339211 108167641
2398.4 108167641 108205055 108290695 108200600 108094154 108106651 108149025 108014557 108036797 108085083 108090202 108157463
2409 108157463 108128708 108107132 108010597 108002655 108091797 108250168 108358490 108167076 108135994 108224487 108208267
2419.6 108208267 108158371 108251953 108400391 108174873 108056915 108166855 108213409 108208031 108165947 108200531 108085587
2430.2 108085587 108137276 108246613 108099609 108178085 108234787 108283516 108429787 108400368 108313652 108281822 108256905
2440.8 108256905 108141632 108272232 108340149 108165054 108280396 108438232 108593231 108580238 108275932 108088715
2450.5 108088715 108135933 108281372 108280983 108325211 108370895 108328278 108237961 108164024 108362244 108348328 108205994
2461.1 108205994 108170410 107955788 107999382 108364624 108585091 108514763 108360771 108298447 108267792 108269539 108270477
2471.7A08270477n8098p0701j8112Q4602J09581k6306p2670j59203j09451J40076Q2771
2482.3A08172966P7400M4090L335j3855r5826J67176P5866j00258p2044j19919J41083
2492.9A08280014Q041k17552n0712p4952J8769J50551P5050J11969K4872k31964q9249
2503.5A08004837J55876Q782N294r1k20703P1609K44133k2117k8061q2344j43616j18828
2515.1A07874771K4468J61254n516J7189N4833j06255j60919p614R5932o844N249R3125
2526.7A08039673K19833j9790m35677k08832J81839J21109p3372J10192J60499m9553
2536.3A08045921O6437J90338J4885k70569k64213K3552R3910o6078k5292M9507l814
2546.9A07854584n1201j00495O7772J14960M4945n9784j67183P3776N9128n0369R514
$$ plain form
2471.7 108270477 108212379 108141678 108123566 108208168 108317749 108291443 108218773 108059570 107950119 108090195 108172966
2482.3 108172966 108250366 108294456 108297791 108283936 108188110 108355286 108431152 108330894 108258850 108138931 108280014
2492.9 108280014 108288055 108070503 108019791 107944839 107963608 108114159 108189209 108301178 108326050 108094086 108004837
2503.5 108004837 108160713 108169495 108174789 108174698 107953995 108025604 108269737 108247620 108219559 108137215 107993599 107874771
2515.1 107874771 107899239 108060493 108054977 108072166 108126999 108020744 107859825 107852211 107948143 107941299 107946548 108039673
2526.7 108039673 108259506 108239716 107804039 107595207 107777046 107898155 107824783 107934975 108095474 108045921
2536.3 108045921 108112358 108302696 108317581 108047012 107782799 107806351 107900261 107834183 107808891 107858398 107854584
2546.9 107854584 107803383 107702888 107770660 107885620 107930565 107870781 107703598 107777374 107836502 107786133 107795647
2557.5A07795647N1925M4220q2946P2494R4353j98845j99921J55029K33216j26091
2567.2A07839081k55554m7905P1258J4664J52412J9341j62483M8553K8336n9304j33217
2577.8A07515182Q8990M9202j78849K82914J83029k13310j72577j19370j30844n7930
2587.4A07246437K34543J12106k79106j48376K89390J24932j31241k1218j17401L144
2597.1A07313210J06071J38741j3726k76634J16707K09007O546k0881j72371l7506
2606.7A07369164J1741k47200q5251K38549J50466r6328k27417k7375R4269p2319j12175
2617.3A06996124O1791K65243j5159k20665r0271m151J48056N9349n6022j07895m0215
2627.9A06996185J5396j08299Q5770J07109r5329j71181j06857J79969J34865q4770
$$ plain form
2557.5 107795647 107847572 107891792 107808846 107881340 107975693 107776848 107576927 107731956 107965172 107839081
2567.2 107839081 107583527 107535622 107606880 107621544 107773956 107793297 107630814 107679367 107707703 107648399 107515182
2577.8 107515182 107604172 107653374 107474525 107757439 107940468 107727158 107554581 107435211 107304367 107246437
2587.4 107246437 107480980 107593086 107313980 107165604 107454994 107579926 107448685 107427467 107310066 107313210
2597.1 107313210 107419281 107558022 107544296 107267662 107384369 107593376 107599922 107579041 107406670 107369164
2606.7 107369164 107380905 107133705 107048454 107287003 107437469 107341141 107113724 107086349 107180618 107108299 106996124
2617.3 106996124 107057915 107323158 107307999 107087334 106997063 106992912 107140968 107200317 107144295 107036400 106996185
2627.9 106996185 107011581 106903282 106989052 107096161 107000832 106829651 106722794 106902763 107037628 106952858
2637.6A06952858j12106r7741O0074k0706k25349J5327J21926o9260j47560O2263M00376
2648.2A06940102L4614m65675j55747J98708R4818n7800l7827M2259k6268j14395J00983
2658.8A06553772K9030j53763N5237r8915j64772J10778P4402j2695m6196j38222r0751
2669.4A06117905L1044o9794l3196J58936J9554j07780L5362J07071m3221j41899j08284
2680A05965698J15456L41476J40541j56288l55201k91657K18834L91678n097j20727
2689.6A06244713M6211J5106n8487M7066K32056L7376j30188Q8234r9342k19040J71791
2700.3A06375496J65901j13724n7480J08376J44005J6357j87370k22099M7531J83952
2709.9A06460945j14593j10703J1902j29120k2804J23779J84723O8413j45569j88858
$$ plain form
2637.6 106952858 106840752 106743011 106803085 106782379 106557030 106572357 106694283 106625023 106477463 106539726 106940102
2648.2 106940102 106974716 106509041 106353294 106552002 106646820 106589020 106551193 106593452 106567184 106452789 106553772
2658.8 106553772 106582802 106429039 106484276 106385361 106220589 106331367 106405769 106393074 106346878 106208656 106117905
2669.4 106117905 106148949 106079155 106045959 106204895 106224449 106116669 106152031 106259102 106215881 106073982 105965698
2680 105965698 106081154 106422630 106563171 106406883 106051682 105760025 105978859 106370537 106365440 106244713
2689.6 106244713 106290924 106306030 106247543 106294609 106526665 106564041 106433853 106522087 106422745 106203705 106375496
2700.3 106375496 106541397 106427673 106370193 106478569 106622574 106638931 106451561 106229462 106276993 106460945
2709.9 106460945 106346352 106235649 106247551 106118431 106095627 106219406 106404129 106472542 106326973 106138115
2719.5A06138115j27213Q4328J76376J08109j03439k29340m4495L0640m2992R919R9380
2730.2A06099388j40617k22718J30837K40074J7952j19018m4526m5127M3090R0012
2739.8A06049347j02341n798J53793P7904l876N203M1810p1274k42478m4204J91795
2750.4A06049881K4582j45584j28395J22650J61735K2370L3340o2675m3717r2651P4745
2761A06016281K82410l1815j57753o7787o3332j46804j13297n234L4996r3986j34552
2771.6A05519127K37991P8057j42006j02066k32674j1948p8445k29210J13670J32424
2781.3A05284920k59209o6498J96556p7034q8028l09608l34259m8271j37955J6685
2790.9A04177299L9010k7459j17965k01622l3936k13898j34880K07291R1652j16440
$$ plain form
2719.5 106138115 106010902 106095230 106271606 106379715 106276276 106046936 106002441 106033081 105990089 106000008 106099388
2730.2 106099388 105958771 105736053 105866890 106106964 106124916 106005898 105961372 105916245 105959335 106049347
2739.8 106049347 105947006 105941208 106095001 106172905 106169029 106174232 106216042 106144768 105902290 105858086 106049881
2750.4 106049881 106074463 105928879 105800484 105923134 106084869 106107239 106140579 106077904 106034187 105941536 106016281
2761 106016281 106298691 106266876 106109123 106041336 105978004 105831200 105717903 105712669 105747665 105653679 105519127
2771.6 105519127 105757118 105835175 105693169 105591103 105358429 105346481 105268036 105038826 105152496 105284920
2781.3 105284920 105025711 104959213 105155769 105078735 104990707 104681099 104346840 104298569 104160614 104177299
2790.9 104177299 104216309 104188850 104070885 103869263 103835327 103621429 103486549 103693840 103785492 103669052
2800.5A03669052k72240l74389j73660q0140k58758o0662K2889k29393k24099l29574
2810.2A01689026m40987k66433j52230j23108j32568k59155m35700m90227l61869k49131
2819.8I8777618l22616l45123j63559l95050q82256p67593n51217n45311n78765p64466
2829.5I3461662q25386q54515q24005q57544j023437q38463q98682j317581j428398
2838.2H4593651j413529j503212j804710k241676k619469k813934k954529l297554
2845.9F5945038l607735l563560l173657k946358k746269k332973j904053j296997
2853.6D4373436o24054K12147N70633P11841J288914J821407K219166K065537K052143
2862.3E4691170K465015K267647J698410J425671J380554J116325M62708M7477K26571
$$ plain form
2800.5 103669052 103396812 103022423 102848763 102768623 102509865 102449203 102472092 102242699 102018600 101689026
2810.2 101689026 101248039 100981606 100829376 100706268 100573700 100314545 99878845 99388618 99026749 98777618
2819.8 98777618 98455002 98109879 97946320 97551270 96669014 95901421 95350204 94804893 94226128 93461662
2829.5 93461662 92636276 91781761 90957756 90100212 89076775 88238312 87339630 86022049 84593651
2838.2 84593651 83180122 81676910 79872200 77630524 75011055 72197121 69242592 65945038
2845.9 65945038 62337303 58773743 55600086 52653728 49907459 47574486 45670433 44373436
2853.6 44373436 43749382 43961529 44532162 45244003 46532917 48354324 50573490 52639027 54691170
2862.3 54691170 57156185 59423832 61122242 62547913 63928467 65044792 65507500 65554977 65781548
2870.9F5781548N64605Q07038R15443J002564J042976J012771J036797P90428M65218
2879.6G3419388L93844L47832P7202j36475k41546o06446n60684l54645o62567p63862
2889.3G0912041q46848j007553q59840r09935j072174j040451r82499r07039r71840
2897.9F2313862j115711j062329r50462r15184j168289j342579j018051q09777j051857
2906.6E2879623j481006j547241j322705j127697j229774j637688j681015j724480
2914.3D1128017j734600j549270j441365j404480j555576j322483r88785o91761o14868
2923B9824829o48350k80000j30566P4835L86940O56916O41164L73217M34090Q41829
2932.7C2174904J221596J231670J369499J309811J389713J646252J484329J629738
$$ plain form
2870.9 65781548 66346153 67153191 68068634 69071198 70114174 71126945 72163742 72954170 73419388
2879.6 73419388 73813232 74161064 74238266 74101791 73860245 73253799 72693115 72338470 71675903 70912041
2889.3 70912041 70065193 69057640 68197800 67287865 66215691 65175240 64192741 63285702 62313862
2897.9 62313862 61198151 60135822 59185360 58270176 57101887 55759308 54741257 53931480 52879623
2906.6 52879623 51398617 49851376 48528671 47400974 46171200 44533512 42852497 41128017
2914.3 41128017 39393417 37844147 36402782 34998302 33442726 32120243 31131458 30439697 29824829
2923 29824829 29176479 28896479 28765913 28840748 29227688 29884604 30525768 30898985 31333075 32174904
2932.7 32174904 33396500 34628170 35997669 37307480 38697193 40343445 41827774 43457512
2940.4D3457512J686928J513076J380806J486630J639835J236443O76903L30040M76749
2949.1E3884922N75295K17838j99623l14175m7848M2969K76783M25526K58556L51257
2958.7E5471500N43232Q52692J320522J530297J299026J308441J637574J906490K038406
2967.4F7908180J731232J470055J469909J426857J513741J404983J081528R34898R14948
2976.1G9856331R60548Q22586O92284P89368P27569N68909O09215P21687P53105P75139
2985.7H7276741N54680L24875N21477O77536M87228J53953P4700J17393N7732L8979
2995.3I0285294k00211n66246p13646n87349o53236j034615r50996q17414j018554
3004H3743027r09638p18536o16928n31639m13246O919N89241Q58017P24434R12628
$$ plain form
2940.4 43457512 45144440 46657516 48038322 49524952 51164787 52401230 53078133 53408173 53884922
2949.1 53884922 54460217 54678055 54478432 54164257 54116409 54159378 54436161 54861687 55120243 55471500
2958.7 55471500 56014732 56867424 58187946 59718243 61017269 62325710 63963284 65869774 67908180
2967.4 67908180 69639412 71109467 72579376 74006233 75519974 76924957 78006485 78941383 79856331
2976.1 79856331 80816879 81639465 82331749 83121117 83848686 84417595 85026810 85748497 86501602 87276741
2985.7 87276741 87831421 88156296 88677773 89355309 89842537 89996490 90071190 90188583 90246315 90285294
2995.3 90285294 90085083 89518837 88805191 88217842 87564606 86529991 85578995 84761581 83743027
3004 83743027 82833389 82114853 81497925 80966286 80553040 80559959 81149200 82007217 82731651 83644279
3013.7H3644279J400513J511139J517304J532768J426422J461685J285545R77257J086022
3022.4I5842934J343574J092819O50231P28988O77758L55247L36411O18896P47505
3031A02394363L59536J75598J83288J129J54892L79967K02675O6063K03537K73674
3040.7A04394722J46011O4278J11481l319o0806M364l5950J01044K02125J70120L3150
3051.3A05127220j61621O9565K14516Q2641J12312O676j56830j33583R7763L20877
3060.9A05579536J01876k21405j97380J15829J80962l0075J08055J35673J2497P7095
3070.6A05862663l5919N989Q0086q6815l1456O8466Q2810J05995j17157j14502L13133
3081.2A06133293K85454k1942j5145Q0330l2135k44873o4583J74782K0066l3883J37581
$$ plain form
3013.7 83644279 85044792 86555931 88073235 89606003 91032425 92494110 93779655 94756912 95842934
3022.4 95842934 97186508 98279327 98929558 99658546 100336304 100691551 101027962 101646858 102394363
3031 102394363 102753899 102929497 103112785 103113914 103268806 103648773 103851448 103917511 104121048 104394722
3040.7 104394722 104540733 104605011 104716492 104713173 104652367 104656731 104620781 104721825 104923950 105094070 105127220
3051.3 105127220 104965599 105035164 105249680 105332321 105444633 105451309 105294479 105160896 105258659 105579536
3060.9 105579536 105681412 105460007 105262627 105378456 105559418 105529343 105637398 105773071 105785568 105862663
3070.6 105862663 105826744 105832733 105912819 105826004 105794548 105863014 105945824 106051819 105934662 105820160 106133293
3081.2 106133293 106418747 106396805 106381660 106461990 106429855 106184982 106120399 106295181 106315247 106281364 106418945
3091.8A06418945J49910P6699M1008R5810J74118j76125k85843K50755L71315o2606
3101.4A07053986j71524K5116n0057j30981r3872o6750R1438J38687O8718Q8890K02950
3112A07156601n8510l19107J2817K09992K10609J04302o7902k03537l51654k7717K20954
3122.6A06886848K9786n9571j35460L9093K62474J2063p3258K6253j38245j73324r064
3133.3A06667595J25404K12837R3750l16864j88301M25919K65968j78520j01028P3135
3142.9A07079895n3726q6922M9141p3166p7972p9178o0585K5085L1540J07682M2472
3153.5A06904266J14525N5412l7521p2624j37383P7881o0173N0698K34901l4843j31325
3164.1A06963814k13906P332J770j81442J06468m6783l34465O1905L29612J93268R6031
$$ plain form
3091.8 106418945 106568855 106645554 106686562 106782372 106956490 106780365 106494522 106745277 107116592 107053986
3101.4 107053986 106882462 106907578 106857521 106726540 106632668 106565918 106657356 106796043 106864761 106953651 107156601
3112 107156601 107098091 106778984 106791801 107001793 107212402 107316704 107248802 107045265 106693611 106665894 106886848
3122.6 106886848 106916634 106857063 106721603 106760696 107023170 107035233 106961975 106988228 106849983 106676659 106667595
3133.3 106667595 106792999 107005836 107099586 106782722 106594421 107020340 107286308 107107788 107006760 107079895
3142.9 107079895 107026169 106939247 106988388 106915222 106837250 106758072 106697487 106722572 106754112 106861794 106904266
3153.5 106904266 107018791 107074203 107036682 106964058 106826675 106904556 106844383 106895081 107129982 107095139 106963814
3164.1 106963814 106749908 106757240 106759010 106577568 106684036 106637253 106302788 106364693 106694305 106887573 106983604
3174.7A06983604j61804o5300K25136J89980J9706l90632k42073J49536Q3641L4088
3184.4A06825882r6405j54099j16012p9857Q1169K63168K30988r5024j71898M3777
3194A06731689m5097k65716k21756q1109J09658J62681k0439r7549L3088l8940r0561
3204.6A06175949L33572K80228n0651j80947l65745L7544J66016j46355N4550K12303
3214.3A06516464K8038j13121j52717q8639K03743J80886j98937k17117J2268L2486
3223.9A06203354K9129J87591L0739j35315o5033M5510n7129k08832Q4869K9824O6246
3234.5A06210953J00876l92090j48995J82465J29272J7846j76400L5683J41197r5695
3244.2A06005112o9634L2845j11748n0003R6039N363n2322L181j6166n5199j8723r9182
$$ plain form
3174.7 106983604 106821800 106756500 106981636 107171616 107191322 106800690 106558617 106708153 106791794 106825882
3184.4 106825882 106729477 106575378 106459366 106379509 106460678 106723846 106954834 106859810 106687912 106731689
3194 106731689 106686592 106420876 106199120 106118011 106227669 106390350 106369911 106272362 106305450 106266510 106175949
3204.6 106175949 106509521 106789749 106739098 106558151 106192406 106229950 106395966 106249611 106304161 106516464
3214.3 106516464 106544502 106431381 106278664 106190025 106393768 106574654 106375717 106158600 106170868 106203354
3223.9 106203354 106232483 106420074 106450813 106315498 106250465 106295975 106238846 106030014 106114883 106144707 106210953
3234.5 106210953 106311829 105919739 105770744 105953209 106082481 106100327 105923927 105959610 106100807 106005112
3244.2 106005112 105935478 105968323 105856575 105806572 105902611 105907974 105855652 105858833 105842667 105787468 105768745 105669563
3255.7A05669563k9854q4602j12091J15028k8724J6716n921p6210J17249j10756j55632
3266.3A05314766J13792K31018Q6365Q171k243j81686j02699j34369j10588q164r8472
3276.9A05115891Q9393Q4572r1126j0185n8479k14577n836J37382n0178L7101M1672
3287.5A05075630n5481P4715l822j08529j18301j6304J09146n8205k4841J4069j97731
3298.2A04690346r1019L1807p9994o9100J08452J07689Q9615K136p2159J96999k93663
3308.8A04621109n14763K13822K50839J76590p9445m82971j29334K22458R8923k7840
3318.4A04349388K2949j78077j35888Q2230j02531m4831K15752R8656k15592j11931
3328.1A03980125J00541J43180N4360j97235r7077l3020o8847J1474r7015j86630j77567
$$ plain form
3255.7 105669563 105639709 105555107 105443016 105558044 105529320 105546036 105540115 105463905 105581154 105470398 105314766
3266.3 105314766 105428558 105659576 105745941 105754112 105751869 105570183 105467484 105333115 105222527 105214363 105115891
3276.9 105115891 105205284 105289856 105198730 105188545 105130066 104915489 104909653 105047035 104996857 105033958 105075630
3287.5 105075630 105020149 105094864 105091042 104982513 104864212 104847908 104957054 104898849 104874008 104888077 104690346
3298.2 104690346 104599327 104631134 104551140 104482040 104590492 104698181 104787796 104789932 104717773 104914772 104621109
3308.8 104621109 104106346 104320168 104571007 104747597 104668152 104185181 104055847 104278305 104377228 104349388
3318.4 104349388 104372337 104194260 104058372 104140602 104038071 103993240 104208992 104307648 104092056 103980125
3328.1 103980125 104080666 104223846 104278206 104080971 103983894 103950874 103882027 103893501 103796486 103609856 103432289
3338.7A03432289J00510K68730K6665l0915j25930j66604K01752P5340k05680J3191
3348.3A03589348n4344k495J83113q9851j42174r7466l06770k0485L85719J04020j10634
3358.9A03437981j80054j17127M6921j24672L9109J11076j12961o5361N203J6266o3667
3369.5A02992714J9356O1233q7288l6750J41960j9066l15766k05093j69624l9482K61467
3380.1A02603661J43753q1131n898L2311j06148L7613j77063l82881J43730M10797
3389.8A02618744Q3527l20282q6915J49216j61865k14882n7526J38268J72439r3994
3399.4A02226730l51669j06537J82686Q8875l2082k27318j3336J87516m6540k8068
3409.1A01880257m2382k06894j00784R1538n5634k06291n9433J39068J32981J358N8670
$$ plain form
3338.7 103432289 103532799 103801529 103828194 103797279 103671349 103504745 103706497 103781837 103576157 103589348
3348.3 103589348 103535004 103532509 103715622 103625771 103483597 103386131 103079361 103058876 103444595 103548615 103437981
3358.9 103437981 103257927 103140800 103187721 103063049 103102158 103213234 103100273 103034912 103040115 103056381 102992714
3369.5 102992714 103012070 103073303 102986015 102949265 103091225 103072159 102756393 102551300 102381676 102342194 102603661
3380.1 102603661 102747414 102666283 102660385 102692696 102586548 102624161 102447098 102064217 102207947 102618744
3389.8 102618744 102702271 102381989 102295074 102444290 102282425 102067543 102010017 102148285 102320724 102226730
3399.4 102226730 101875061 101768524 101951210 102040085 102008003 101780685 101767349 101954865 101908325 101880257
3409.1 101880257 101837875 101630981 101530197 101621735 101566101 101359810 101300377 101439445 101572426 101573784 101632454
3419.7A01632454J5678j03080r4597k0417J59203R0172j90293j99943j32469r8496
3429.3A01058212L74718M48547k51358m78080r4651K40967M3335k03125r9190r8602
3439A00940773j23215n64o668K8717L3477k67028j08513J29570O1386N4787p7774p0939
3450.5A00594009j07917M3029J46981L4042j6327l15445k49794r9182J91734L78312
3460.2A00599442j313j51741j24428k0713l17551j99738K64405J20643J25679q3755
3469.8A00210930p4951J85051N0094k86964j92307M87656K34749j77971O8161J34201
3479.5A00638649j92375k18735J67076J89224J68412j89720k28753K05178J10107j59050
3489.1A00490013m56009j56105J67412K30408M36638J98959l7766l18374k77931J59500
$$ plain form
3419.7 101632454 101648132 101545052 101450455 101430038 101589241 101679413 101489120 101289177 101156708 101058212
3429.3 101058212 101432930 101881477 101630119 101152039 101057388 101298355 101341690 101138565 101039375 100940773
3439 100940773 100817558 100816994 100810326 100839043 100872520 100605492 100496979 100626549 100687935 100742722 100664948 100594009
3450.5 100594009 100486092 100529121 100676102 100710144 100693817 100378372 100128578 100029396 100221130 100599442
3460.2 100599442 100598129 100446388 100321960 100301247 99983696 99783958 100048363 100169006 100294685 100210930
3469.8 100210930 100135979 100321030 100371124 100084160 99891853 100379509 100614258 100436287 100504448 100638649
3479.5 100638649 100446274 100227539 100394615 100583839 100752251 100562531 100333778 100538956 100649063 100490013
3489.1 100490013 100034004 99877899 100045311 100275719 100712357 100911316 100873550 100555176 100277245 100436745
3498.7A00436745L05999P828l44719J2070K19276Q4443J35223j19881j03317J64383
3508.4A00798050R0477L2020K5338j09253j42502n2902R8045N8617J42143K91054m6311
3519A01184776l66966j37459K93473J52015l654k0546j30310K73231K37641M013j67527
3529.6A01318687j04568K32994M784P4188M6265q0643J78268R1652j31683q1757L58681
3540.2A01906868K86613j64817j10360K40494L51532k3536r0638P9338J19049J08017
3549.9A02702560L02544J78337l36204l4188N783N7610K68455O8711L3928J56288L01292
3560.5A03705116K22473Q5099j44730j52641K62367O30585P31453k52976k75100K67944
3570.1A05079590j21773k08862K8801J73279N0018j93955j6540J35643J23093J76513
$$ plain form
3498.7 100436745 100742744 100750572 100405853 100417923 100637199 100721642 100856865 100736984 100633667 100798050
3508.4 100798050 100888527 100920547 100945885 100836632 100694130 100641228 100739273 100797890 100940033 101231087 101184776
3519 101184776 100817810 100680351 100973824 101125839 101122185 101101639 100971329 101244560 101482201 101486214 101318687
3529.6 101318687 101214119 101447113 101451897 101526085 101572350 101491707 101669975 101761627 101629944 101548187 101906868
3540.2 101906868 102193481 102028664 101918304 102158798 102510330 102486794 102396156 102475494 102594543 102702560
3549.9 102702560 103005104 103183441 102847237 102813049 102818832 102876442 103144897 103213608 103247536 103403824 103705116
3560.5 103705116 103927589 104012688 103867958 103715317 103977684 104608269 105339722 105086746 104811646 105079590
3570.1 105079590 104957817 104748955 104777756 104951035 105001053 104807098 104790558 104926201 105049294 105225807
3579.7A05225807J19393k05521l4615M46206L79119K85569J78932j31516l2150j00410
3589.4A06130814J22169J28525j55945q2359L68561M06951j15455o3774J29707k28294
3599A06640900r0103K63710K10235r5497k15645Q8791J08879R9457M55742K95898k61192
3609.6A07501175l74863L9749J77796K32742K08237l08670j16486M85832L30101n4016
3619.3A08121597J01868l06694l53478J44890K14882o4064L9711K95822N85007P19269
3628.9A09498810p61521m58877k90321p5043J78482p698O5056R6405j95595k98714
3638.6A07750984J07453L72718J08971q1520o0440j85593J1986O63292P58827o23573
3648.2A08823105k59659J83838p248l7521k80495k59804L540L01964L94592k59033
$$ plain form
3579.7 105225807 105345200 105139679 105105064 105551270 105930389 106215958 106394890 106263374 106231224 106130814
3589.4 106130814 106252983 106381508 106225563 106143204 106511765 106918716 106803261 106739487 106869194 106640900
3599 106640900 106550797 106814507 107024742 106929245 106713600 106802391 106911270 107010727 107466469 107762367 107501175
3609.6 107501175 107126312 107166061 107343857 107576599 107784836 107476166 107359680 107845512 108175613 108121597
3619.3 108121597 108223465 107916771 107563293 107708183 107923065 107859001 107898712 108194534 108779541 109498810
3628.9 109498810 108737289 108278412 107988091 107913048 108091530 108083832 108148888 108245293 108049698 107750984
3638.6 107750984 107858437 108231155 108340126 108258606 108198166 108012573 108024559 108687851 109446678 108823105
3648.2 108823105 108563446 108747284 108740036 108702515 108422020 108162216 108165756 108467720 108862312 108603279
3657.9A08603279j79222N6496j50917k159J56852r3391j66039j95930P4478K66624
3667.5A08370071M25370N69099N8243J23497o01219o32637M06746J867698N5474j099770
3677.1A09542572m77730k44911r9480K5895L7063j16836k20551K49619M07135K24670
3686.8A09327446P76169J96342j309128k54676j47576j35437K11136K02446o241K3926
3696.4A08884407l5881r8190m6601k46315j95671O24512L24051l48473k13150J31653
3706.1A08780342Q4335n9883J07315M10553j43798n81223L73604L73520r5200r0477
3715.7A09159088k21260k47826k4475J18737J45736L77259N42587n91667m65828J18500
3725.4A08910851K24426j9554n13123k3003M28017N14046P35969n50613p9376P9002
$$ plain form
3657.9 108603279 108424057 108480553 108329636 108327477 108484329 108390938 108224899 108028969 108103447 108370071
3667.5 108370071 108795441 109364540 109422783 109546280 108945061 108312424 108719170 110586868 110642342 109542572
3677.1 109542572 109064842 108819931 108720451 108746346 108783409 108666573 108446022 108695641 109102776 109327446
3686.8 109327446 110103615 110299957 108990829 108736153 108588577 108453140 108664276 108866722 108860481 108884407
3696.4 108884407 108848526 108750336 108703735 108457420 108261749 108886261 109210312 108861839 108648689 108780342
3706.1 108780342 108864677 108804794 108912109 109322662 109178864 108597641 108971245 109344765 109249565 109159088
3715.7 109159088 108937828 108690002 108665527 108784264 108930000 109307259 109849846 109258179 108792351 108910851
3725.4 108910851 109135277 109115723 108602600 108579597 109007614 109521660 110257629 109707016 109627640 109706642
3735A09706642r09881J31225L00667K20413P8446J35940n9913k86568K04109K86621
3744.7A09807701p68425m2610R6298r4238r6802O23551L91090P56691m93202r56467
3754.3A09223587m28787n42R7641K43645K81166M4754j92581k34101k61306l9864L91625
3764.9A09125237M24438k43935j55494K9297j47202j62697J07788R5703J19881L4927
3774.5A09227943j13090L3455p6332j64078K20718J02555j60393N9906J95892l8749
3784.2A09287827k14478N6404j2527k05483q4564J82152L05114j2153l98659k78946
3793.8A08624687L1044J37146K39693L38707R3178J2581P00851R19228j182114o34697
3803.5A09280304k60658O1989N33203j08933p03888J69686J57280k17911m2023k03346
$$ plain form
3735 109706642 108796761 108927986 109228653 109449066 109527512 109663452 109603539 109316971 109521080 109807701
3744.7 109807701 109039276 108996666 109092964 108998726 108901924 109525475 109916565 110673256 110180054 109223587
3754.3 109223587 108794800 108794258 108891899 109135544 109416710 109461464 109268883 109034782 108773476 108733612 109125237
3764.9 109125237 109549675 109305740 109150246 109179543 109032341 108869644 108977432 109073135 109193016 109227943
3774.5 109227943 109114853 109148308 109071976 108907898 109128616 109231171 109070778 109130684 109326576 109287827
3784.2 109287827 109073349 109129753 109117226 108911743 108827179 109009331 109314445 109302292 108903633 108624687
3793.8 108624687 108655731 108792877 109032570 109371277 109464455 109477036 110177887 111097115 109915001 109280304
3803.5 109280304 109019646 109081635 109614838 109505905 108802017 108971703 109128983 108911072 108869049 108665703
3813.1A08665703J4297N99129L08785r0081j78421k5314M78088J20995p20757k06344
3822.8A08966080q789L6468Q8478M67858K58422k22534l42865j94465K42660j2253
3832.4A09279060l4950K28546Q1536p1732Q3252L68599m20548m38095j4663n6046J42471
3843A09147430L32161k19871k71553r0821j50367J8181L92501L18810K92801K34756
3852.7A10004028L6217k74513o41815k16889R4727Q4625k17743n1857M33502L47840
3862.3A09598122l48420j75415M63646j33598m23119k22679p7461L80638N12276j80344
3871.9A09393646k85080J2032j86463l8047J92306l197M4655K48116L16871l94287
3881.6A09300552l18756Q271J9378K72621L68683j38916l26111k13867L14858K79915
$$ plain form
3813.1 108665703 108680000 109279129 109587914 109497833 109319412 109294098 109772186 109893181 109172424 108966080
3822.8 108966080 108957291 108993759 109082237 109550095 109808517 109585983 109243118 109048653 109291313 109279060
3832.4 109279060 109244110 109472656 109554192 109482460 109565712 109934311 109513763 109075668 109061005 109004959 109147430
3843 109147430 109479591 109259720 108988167 108897346 108746979 108765160 109157661 109476471 109769272 110004028
3852.7 110004028 110040245 109765732 109123917 108907028 109001755 109086380 108868637 108816780 109250282 109598122
3862.3 109598122 109249702 109074287 109537933 109404335 108981216 108758537 108681076 109061714 109573990 109393646
3871.9 109393646 109108566 109120598 108934135 108896088 109088394 109085197 109129852 109377968 109694839 109300552
3881.6 109300552 108981796 108990067 109009445 109282066 109650749 109511833 109185722 108971855 109286713 109566628
3891.2A09566628n51156l56666J62918J55670j34735j8082K06673N65521J97090n74478
3900.9A09219383m31419R3246K90985K55974K0821j60774l96096k97729K39502L01018
3910.5A09134911j87310j08200K62596k2628k72934J86851L96706l23441l30688K07397
3920.2A08943260P7767j77620J08909K38259r9465k35290K73758J6624l79196o8749
3929.8A08698257J49979M97856L2440j91864K39029l40019m45091K67K34283R552k24830
3940.4A08659859m3595K98966L83896l13973j81602o4957j76178K54356K46125J39145
3950.1A09202042j89652l31253p6637M455M7417L70995L29437l23967j82762k06749
3959.7A08643326j82907L82507J49391J8288j65466j3024J36055l97941r9823j9226
$$ plain form
3891.2 109566628 109015472 108658806 108821724 108977394 108842659 108824577 109031250 109596771 109793861 109219383
3900.9 109219383 108787964 108881210 109172195 109428169 109448990 109288216 108892120 108594391 108833893 109134911
3910.5 109134911 108947601 108839401 109101997 109079369 108806435 108993286 109389992 109066551 108735863 108943260
3920.2 108943260 109021027 108843407 108952316 109190575 109091110 108855820 109129578 109146202 108767006 108698257
3929.8 108698257 108848236 109346092 109378532 109186668 109425697 109085678 108640587 108640854 108875137 108884689 108659859
3940.4 108659859 108616264 108915230 109299126 108985153 108803551 108738594 108562416 108816772 109062897 109202042
3950.1 109202042 109012390 108681137 108604500 108608955 108656372 109027367 109356804 109032837 108850075 108643326
3959.7 108643326 108460419 108842926 108992317 109010605 108845139 108832115 108968170 108570229 108470406 108451180
3969.3A08451180k2393K35962m1153o0959m6806N1285R7061o5971J05636K31278K51197
3980A09186317J04371k47239m15138p5500J84570n9097j6022N8289N6724P9712k44804
3990.6A08612183k43195j106K01179J71128k5315o4560j87126O737J31775J88682
4000.2A08790382
$$ plain form
3969.3 108451180 108428787 108664749 108623596 108562637 108515831 108567116 108664177 108598206 108703842 108935120 109186317
3980 109186317 109290688 109043449 108628311 108552811 108737381 108678284 108662262 108720551 108777275 108856987 108612183
3990.6 108612183 108368988 108367882 108569061 108740189 108714874 108650314 108463188 108469925 108601700 108790382
4000.2 108790382
##END=$$ End of the data block
