##TITLE=$$ Begin of the data block
##JCAMP-DX=5.00 $$ ACD/SpecManager v 10.08
##SPECTROMETER/DATA SYSTEM=Varian
##DATE=19 Mar 2013 14:26:58
##DATA TYPE=INFRARED SPECTRUM
##DATA CLASS=XYDATA
##ORIGIN=
##OWNER=
##NPOINTS=3735
##FIRSTX=399.26403809
##LASTX=4000.35498047
##MAXX=4000.35498047
##MINX=399.26403809
##MAXY=288.83483887
##MINY=0.00000100
##XFACTOR=1.0000000000
##YFACTOR=0.000001000000000
##FIRSTY=18.22511864
##DELTAX=0.96440572
##XUNITS=1/CM
##YUNITS=TRANSMITTANCE
##XYDATA=(X++(Y..Y))
399.3A8225119Uj8225118%ZR4376670p3767933p951002%WJ5181465%k7839200N9675357
421.4E9675358M8924129r6335486K746693J052189M503050K68268906%k41177376k5016174
430.1B2641289%Tk2641288%S7P6152427%ZR9138008j07536377k2769161N656036l31238
462.9E0309696R409298o390205P564361J7030465M1771636L4643555q3235771q183842
470.6F2919193O240689O1234893M6206650o7130821k8710274j992843J0104957j9965927
478.3F8906517N419823O6181320o866013r470428j9109886m1388935J3656J4722637
486.1G8408691k395263J2556068L2180397l820976j2434113J3498215L0349571r576492
493.8A38766098l2796532o83395K412857k2505905J086326K6531533j816872j5047447
$$ plain form
399.3 18225119 18225119 18225119 1 1 1 1 1 1 1 1 1 94376671 20608738 12657736 12657736 12657736 12657736 12657736 12657736 27839201 27839201 1 59675358
421.4 59675358 108599487 12264001 15010694 16062883 20565933 288834839 288834839 47657463 22641289
430.1 22641289 22641289 22641289 1 1 1 1 1 1 1 1 1 1 1 1 1 1 1 1 1 1 76152428 76152428 76152428 76152428 76152428 76152428 76152428 76152428 76152428 175290436 67754059 44984898 50640934 50309696
462.9 50309696 59718994 53328789 60893150 77923615 119695251 154338806 71103035 62919193
470.6 62919193 69159882 130394775 176601425 109470604 80760330 78767487 88872444 68906517
478.3 68906517 74326340 140507660 133641647 124171219 105061333 63672398 63686054 78408691
486.1 78408691 76013428 88569496 120749893 116928917 104494804 117993019 148342590 138766098
493.8 138766098 105969566 105286171 107699028 85193123 86279449 112810982 110994110 95946663
501.5I5946663k614914j773590K124130K866570J960067N121544M768509P981621q212296
510.2A08168304j5327041J0137291J0496025j3278679j004372L294533k499794L954796
517.9A03941063p12021o537064j198448J830269K646500m0627j011337L220253k036057
526.6A00102531n638748j419449M580819L379577l120025K143203M99916n301574j630951
535.2I3595299m83849K773758N758583q64189m617889L104522O304230Q57399j433823
543.9A04994041m351478n19882J453697m254326j53717M160789K299447j544716n412873
552.6I6670982O89392L344811m726936j420517J537208m14940L041855K984528q26737
561.3A00879646q85833J097953k589309k771569K220002l55881j193794J090545J208260
$$ plain form
501.5 95946663 93331749 91558159 93682289 96548859 98508926 103630470 108398979 116380600 108168304
510.2 108168304 92841263 102978554 113474579 100195900 99191528 102486061 99986267 103941063
517.9 103941063 103229042 96691978 95493530 97323799 99970299 99929672 98918335 102138588 100102531
526.6 100102531 94463783 93044334 97625153 101004730 97884705 100027908 100527824 95226250 93595299
535.2 93595299 93111450 95885208 101643791 100779602 96161713 99266235 105570465 106427864 104994041
543.9 104994041 100642563 100122681 101576378 97322052 97168335 101329124 103628571 102083855 96670982
552.6 96670982 97360374 100705185 95978249 94557732 96094940 95680000 98721855 101706383 100879646
561.3 100879646 99993813 101091766 98502457 95730888 97950890 97595009 96401215 97491760 98700020
570I8700020L7597r92042J310875J53114k702522k314758n68009R85817J662384K566185
579.6I8838661J221375k140992q56727Q0612l83140J094345k13929l96774m02443k193886
589.3I4647102l08723J963234K921982J113502n09773l17627q28674k131302j243798
597.9I5305923J494378O79931N1468l67134l49747J141465j89835l14583R56909J234551
607.6I9643326j481087j701569L93158N37964L762169J680657k551140q97377j44676
616.3I9241425M3113O96709P13097k31530l54492j922401j894158O3858j050583M3061
625.9I5348099J953842J126671J05400p87064j219192O42608O2287p17919J568711
634.6I8083443o26244L47633O22162j644081J328186K7390j517716o10771P61253K620766
$$ plain form
570 98700020 98737617 97745575 99056450 99209564 96507042 94192284 93624275 94610092 96272476 98838661
579.6 98838661 100060036 97919044 97062317 97142929 96759789 97854134 97640205 97243431 96840988 94647102
589.3 94647102 94338379 96301613 99223595 100337097 99827324 99509697 98681023 96549721 95305923
597.9 95305923 96800301 97480232 97531700 97164566 96814819 97956284 97766449 97451866 98408775 99643326
607.6 99643326 98162239 96460670 96853828 97391792 101153961 102834618 100283478 99386101 99241425
616.3 99241425 99284538 99981247 100694344 100462814 100108322 98185921 96291763 96355621 95305038 95348099
625.9 95348099 97301941 98428612 98534012 97746948 96527756 97170364 97232651 96514732 98083443
634.6 98083443 97457199 97804832 98426994 96782913 98111099 98138489 96620773 96010002 96771255 99392021
644.2I9392021J59783k340615m92325K219956J757713J055031p95143k68501J421547
652.9A02109467k846016j360833J269638j035217K48856J957451L27926k291664l154999
661.6I5224609q10020J209785M81629J369751J129761P88597L582779n347886k819885
670.3I4809120J26000K177528L85567j926789l86779O13128O27365j224098k023277
678.9I3177765o44264L50097k57904q97674J443351J035454o87278O5536O05438k86560
688.6I3903961j172462K98324L53714N4398M85351l71536p59132J60911O82801m56139
698.2I3180191r19762k25265N65338m05182n29037Q43925K93488J29821p63923j050598
707.9I1118996R8228J63391k81608r72924l91227O88392P85828j034401j021179L71101
$$ plain form
644.2 99392021 99551804 97211189 96718864 98938820 100696533 101751564 100956421 100687920 102109467
652.9 102109467 99263451 97902618 99172256 98137039 98385895 100343346 100671272 98379608 95224609
661.6 95224609 94414589 95624374 96106003 97475754 98605515 99394112 102976891 97629005 94809120
670.3 94809120 94935120 97112648 97498215 95571426 95184647 95797775 96425140 95201042 93177765
678.9 93177765 92533501 92883598 92625694 91728020 93171371 94206825 93519547 93585083 94190521 93903961
688.6 93903961 92731499 93029823 93383537 93437935 93923286 93551750 92792618 92953529 93636330 93180191
698.2 93180191 92260429 92035164 92600502 92195320 91666283 92510208 92803696 92933517 92169594 91118996
707.9 91118996 91217224 91380615 91099007 90126083 89734856 90423248 91209076 90174675 89153496 89524597
717.5H9524597M3152O31195p24037j590897r34051j337662M65767J701813J405700
726.2H9185577J319741J48224j068299j77955N74958L91343J496345J051872n48858
734.9I2372948l15796k00760L77724J521476P05941r07616n41901Q02796L87703L0983
744.5I4233498J113777N11757n69146r56634L34656K157211M45068K7008L60558o60011
754.2I6997742r0012n63835l28659Q45436n16022j035125P66288Q62999K89406p8247
763.8I7149971j223389M03168J311577j95236j06499j72714m10446J94427l01224j46164
773.5I6503471J867813J193329L4226N0255q94745k67716j6571Q9989k0363P7355O58592
784.1I9275635j138855q29483J164947J591622j38237l69515J189453j413376j534019
$$ plain form
717.5 89524597 89567749 90198944 89474907 87884010 86949959 85612297 86078064 87779877 89185577
726.2 89185577 90505318 90653542 89585243 89407288 89982246 90373589 91869934 92921806 92372948
734.9 92372948 92057152 91856392 92234116 93755592 94461533 93553917 93012016 93814812 94202515 94233498
744.5 94233498 95347275 95859032 95289886 94333252 94667908 96825119 97270187 97297195 97657753 96997742
754.2 96997742 96907730 96343895 96015236 96860672 96344650 95309525 96075813 96938812 97228218 97149971
763.8 97149971 95926582 96329750 97641327 97446091 97339592 97166878 96756432 96950859 96649635 96503471
773.5 96503471 98371284 99564613 99598839 99649094 98754349 98486633 98470062 98560051 98539688 98617043 99275635
784.1 99275635 98136780 97307297 98472244 100063866 99925629 99556114 100745567 99332191 97798172
792.7I7798172O74667P89536J030533l40004o14006j95549r1194N40931m93232j60347
802.4I8939507Q25798P7072q22281r53865J092392J578605j077385q4457J779892k00859
812A01154419r13734n98504j002914m51370m02886N01862J451889M05685m15939j058914
821.7I8669594n44571N5885O6643L70804j35887J88514j71722n29320j7021K87964
831.3I8240883J334511m6059j561859n06569J38123m44283m11606L72559j5213L59947
841I7460434L84140o1531k6993k03331M98787o4827o17699k50953l59177L6186J182106
851.6I7977142M23470j426552J07018Q00994K03186J1368l20877P00043l37753r37500
861.2I7200539M22096K39357l83659j01639N94116N36507j60668j064621j202469k30209
$$ plain form
792.7 97798172 98472839 99262375 100292908 99952904 99338898 99143349 99052155 99593086 99099854 98939507
802.4 98939507 99765305 99842377 99020096 98066231 99158623 100737228 99659843 99575386 101355278 101154419
812 101154419 100240685 99642181 98639267 98187897 97785011 98286873 99738762 100144447 99728508 98669594
821.7 98669594 98125023 98180908 98247551 98618355 98482468 98670982 98499260 97969940 97952919 98240883
831.3 98240883 99575394 99529335 97967476 97460907 97599030 97154747 96743141 97115700 97100487 97460434
841 97460434 97844574 97783043 97756050 97552719 98051506 97986679 97368980 97118027 96758850 96795036 97977142
851.6 97977142 98400612 96974060 97081078 97882072 98085258 98096626 97775749 98475792 98138039 97200539
861.2 97200539 97622635 97861992 97478333 97376694 97970810 98507317 98346649 97282028 96079559 95849350
870.9I5849350Q69095R78172N24002k87498q41278M71351O56159k27326n09140k19383
880.5I7263504O09825L35152k34169j99768N52315l25921p36068O15913r7855p02255
890.2I7080673n79582L14339R72244K42889m05769p46284K41859P59148J373q64334
899.8I7016556P2441R26659M2877j00548p85858n17472M3229q7113J43334J36993K83844
910.4I7174942k55714N2940k24243j082871n26161J023583J992622l26653j200485
919.1I6627960m3129M40438M52842l88038o85830k13768O73684N523k42248Q06877
928.7I7434311K72568n91637o45370P16064R57451o48323p06787L92791K62406m10607
938.4I7032867k54196l29628N42458J006698k32360j168709o46759M83299k86842k56432
$$ plain form
870.9 95849350 96718445 97696617 98220619 97933121 97091843 97563194 98219353 97992027 97482887 97263504
880.5 97263504 97873329 98208481 97974312 97774544 98326859 98000938 97264870 97880783 97782928 97080673
890.2 97080673 96501091 96815430 97787674 98030563 97624794 96878510 97120369 97879517 97880890 97016556
899.8 97016556 97088997 98015656 98058533 97957985 97172127 96654655 96697884 96610771 96754105 96891098 97174942
910.4 97174942 96919228 96972168 96747925 95665054 95138893 96162476 98155098 97828445 96627960
919.1 96627960 96584831 97025269 97478111 97090073 96404243 96190475 96864159 96869682 96627434 97434311
928.7 97434311 97706879 97115242 96469872 97185936 98143387 97495064 96788277 97181068 97443474 97032867
938.4 97032867 96778671 96449043 96991501 97998199 97765839 96597130 95950371 96433670 96146828 95890396
948I5890396R4879l89389K48810p6920j88514L57162K38327k62993q00460R5062J074913
958.6I6281273k5902j103142n7594N07729l55790n07759j32744K96708M05685l7071
968.3I5271393p965j77704l23990K96852m8096K55738O02722r23073r44885L99002
977.9I4399994J051514J85661m41521K74452k61932p13867K06436J00754m24179M81552
987.6I4858864Q0963n06683N66307J69639k84179k30004J15357M12803m39445j80809
997.2I4562813M54201R9464n13229o8367K89314O5460K70950l40782q9844K77649k84904
1007.8I4722725o74027j082389J01402J035629K83783L51380M51873q30055r75098
1016.5I3385223j24397l1944M57558L26484l38188J0452M0085o00143o81282l5187
$$ plain form
948 95890396 95985275 95595886 95844696 95767776 95579262 95936424 96174751 95911758 95111298 95206360 96281273
958.6 96281273 96255371 95152229 95094635 95602364 95246574 94738815 94606071 94902779 95308464 95271393
968.3 95271393 95263428 95085724 94761734 95058586 95010490 95266228 95868950 94945877 94000992 94399994
977.9 94399994 95451508 95637169 95195648 95470100 95208168 94494301 94700737 94801491 94377312 94858864
987.6 94858864 94939827 94433144 94999451 95169090 94884911 94654907 94770264 95183067 94743622 94562813
997.2 94562813 95017014 95116478 94603249 94534882 94824196 94889656 95160606 94819824 94729980 95007629 94722725
1007.8 94722725 94048698 92966309 93067711 94103340 94387123 94738503 95190376 94360321 93385223
1016.5 93385223 93260826 93228882 93686440 94012924 93674736 93685188 93725273 93125130 92443848 92408661
1026.1I2408661O44798L34648l49006k72049n80468k01431M69963L25150O96609J68984
1035.8I3645859n69954j26312M31930l13431p59803K2605r4619Q7112k00844j81648
1045.4I1940895N97618k69981o70380m62532K2331O11100L36082k91687j81473K13570
1055.1I1845543j61247L30734N68809R0844l77236o89041Q194j01875k43157J03836
1064.7I1375404l2478J44196M21073K04667l69950j55395K52533n77713r89815K16995
1074.4I0489517R73870N07370k57798r41505j113869q62358q6189Q7265m84528m73236
1084H7838539m25232l92998L9r2781m85978J9158l48297p77146P6332N7152m43962
1094.6H5024826m11072J29631r2575m44328J16600Q14499O51047m05808J21933N09331
$$ plain form
1026.1 92408661 93053459 93388107 93039101 92767052 92186584 91985153 92455116 92780266 93476875 93645859
1035.8 93645859 93075905 92949593 93381523 93068092 92308289 92330894 92236275 92323387 92122543 91940895
1045.4 91940895 92538513 92268532 91598152 91135620 91157951 91769051 92105133 91813446 91631973 91845543
1055.1 91845543 91684296 92015030 92583839 92674683 92297447 91608406 91616600 91514725 91271568 91375404
1064.7 91375404 91342926 91487122 91908195 92112862 91742912 91587517 91840050 91262337 90272522 90489517
1074.4 90489517 91463387 91970757 91712959 90771454 89657585 88795227 88709038 88796303 88311775 87838539
1084 87838539 87413307 87020309 87020348 86927567 86441589 86460747 86112450 85335304 85411636 85468788 85024826
1094.6 85024826 84613754 84743385 84650810 84206482 84323082 85137581 85788628 85382820 85504753 86014084
1104.2H6014084J31897K5635l23265Q7692M64142K40242k24640o0639J79894J67854
1113.9H6702896k27699o95030o0868j46751J0109j16867n17845M11865K36450J30905
1123.5H5727165M66362J16997k62337M8195L45223j28273q02460j168732j28525O2714
1133.2H4276329n65376o71433p31018j52900o49323r97772n38674r575M72947L30871
1142.8H0764076k46933q16337k66259q6525r0026j13602l83423n04394q27782k0775
1152.5G7408020K32307k18971n11909k42066K66968n51331q64845j85226O71409J56304
1162.1G6160660m32190P7720K32087L92776n7564q2466O4957O3576L5209m66461L37982
1172.7G6326286R17717L77541K06169J45531J19499N13359K16644k30766M27383P45758
$$ plain form
1104.2 86014084 86145981 86171616 85848351 85936043 86400185 86640427 86415787 86355148 86535042 86702896
1113.9 86702896 86475197 85780167 85719299 85572548 85582657 85465790 84947945 85359810 85596260 85727165
1123.5 85727165 86193527 86310524 86048187 86096382 86441605 86313332 85510872 84342140 84213615 84276329
1133.2 84276329 83710953 83039520 82308502 82155602 81506279 80508507 79969833 79960258 80433205 80764076
1142.8 80764076 80517143 79700806 79434547 79348022 79257996 79144394 78760971 78256577 77428795 77408020
1152.5 77408020 77640327 77421356 76909447 76667381 76934349 76383018 75518173 75332947 76004356 76160660
1162.1 76160660 75728470 75806190 76038277 76431053 76373489 76291023 76355980 76419556 76454765 75988304 76326286
1172.7 76326286 77244003 77621544 77827713 77973244 78092743 78606102 78822746 78591980 79019363 79765121
1182.4G9765121M63562j12770q3213N18486J71402R3803P25334L30467j2130M85473
1192H2345535J77735J67045Q8753J76254Q00995Q3550K90298N66559J06071R6253j96945
1202.6H4702103J48391K67990P187R1324J78169j40625q9942L85253J72539L55789
1212.3H6078178L3448j82717K13127m8713l4539j12754P1060J84334j05729J8303J9135
1222.9H6133133k97188m74480j42623N7327Q7005j68014l00827p8217k51388j13060
1232.5H4451668J30531J39702J46698N8464k69035j98975k1942j77399R7374J27312
1242.2H4484398L60870K57820j53976J03790Q5648K95776L69103K95128N4641q2283
1251.8H6070915M61769L81584K3041Q3420J05805k08825l105K64260K3284m3312j64901
$$ plain form
1182.4 79765121 80228683 80115913 80032700 80551186 80722588 80816391 81541725 81872192 81860062 82345535
1192 82345535 82523270 82690315 82779068 82955322 83756317 83839867 84130165 84696724 84802795 84899048 84702103
1202.6 84702103 84850494 85118484 85125671 85216995 85395164 85254539 85164597 85549850 85722389 86078178
1212.3 86078178 86111626 85928909 86142036 86093323 86058784 85946030 86017090 86201424 86095695 86113998 86133133
1222.9 86133133 85835945 85361465 85218842 85276169 85363174 85195160 84894333 84816116 84564728 84451668
1232.5 84451668 84582199 84721901 84868599 84927063 84658028 84459053 84437111 84259712 84357086 84484398
1242.2 84484398 84845268 85103088 84949112 85052902 85138550 85434326 85803429 86098557 86153198 86070915
1251.8 86070915 86532684 86914268 86937309 87020729 87126534 86917709 86914604 87178864 87202148 87158836 86993935
1262.4H6993935J87225J78970J09787L86719q057q7356P9399J23123J35758K16224
1272H8315727j16325m37554K4277K96066K52427k54746l08639L46878N10605L61122
1281.7H8989838J28425J50551K68959L21015L49144K41729P6470L4721P0778J1307
1291.3I0642937K73330J93871l75984l8681L96576j11840k87399j03912K1377K83295
1301I0893570P2594k7619N6504K76351M41628n3803n2825n5687j83091J32080J85173
1311.6I1684875N5123M1550Q3480j83822k30599j08017j4602J03241j7029K06001K08771
1322.2I1828972l0716k182K49481L70529P5966M2427K38304J70029o5086o0059m4647
1332.8I2773018o7612N6786j21483l40019n791K88284l11584n09278J6694n6130q8798
$$ plain form
1262.4 86993935 87181160 87360130 87469917 87856636 87848579 87761223 87840622 87963745 88099503 88315727
1272 88315727 88199402 87761848 87786125 88082191 88334618 88079872 87771233 88118111 88628716 88989838
1281.7 88989838 89118263 89268814 89537773 89858788 90207932 90449661 90526131 90560852 90631630 90642937
1291.3 90642937 90916267 91110138 90734154 90695473 91092049 90980209 90692810 90588898 90610275 90893570
1301 90893570 90966164 90938545 90995049 91271400 91713028 91659225 91606400 91550713 91367622 91499702 91684875
1311.6 91684875 91739998 91781548 91865028 91681206 91450607 91342590 91327988 91431229 91414200 91620201 91828972
1322.2 91828972 91798256 91796074 92045555 92416084 92492050 92534477 92772781 92942810 92877724 92817665 92773018
1332.8 92773018 92705406 92762192 92640709 92300690 92294899 92583183 92271599 91762321 91779015 91722885 91634087
1343.4I1634087o2989j56089k12677O9976J58959j73477j72707j1192M738k49154M2977
1354I0872452K90611o7909l7369j32759k21108j19499K62451K88231j92505k74482
1363.7I0668114j56052J02440l3844j69296m9660J53366j4824l05153o4758l69232
1373.3H9761101k64740k83219o83799j61545J09550M37844M53674O67931Q41316N06927
1382.9I1385040K54151M70543O38374M69147N38612r7397J01517K43759j00372k9640
1392.6I3873734j50071L1067J42578j07742j00540l8567j04027j08551L42675M66163
1402.2I4246719N47058M48014O3301k07916n0652N6694j99867j11344j64611m42353
1411.9I4185043l98567k60734m68842o84753l32199P4943L36235K99767q6304J04851
$$ plain form
1343.4 91634087 91571098 91415009 91202332 91272308 91431267 91257790 91085083 91073891 91078629 90829475 90872452
1354 90872452 91163063 91095154 91057785 90925026 90703918 90584419 90846870 91135101 90942596 90668114
1363.7 90668114 90512062 90614502 90580658 90411362 90361702 90515068 90500244 90195091 90130333 89761101
1373.3 89761101 89496361 89213142 88529343 88367798 88477348 88915192 89368866 90036797 90878113 91385040
1382.9 91385040 91639191 92109734 92748108 93217255 93755867 93658470 93759987 94003746 93903374 93873734
1392.6 93873734 93723663 93754730 93897308 93789566 93689026 93650459 93546432 93437881 93780556 94246719
1402.2 94246719 94793777 95241791 95305092 95097176 95046524 95103218 94903351 94792007 94627396 94185043
1411.9 94185043 93786476 93525742 93056900 92372147 92039948 92114891 92451126 92750893 92664589 92769440
1421.5I2769440M6592J12252N5359J50154J22314k23106k51793l88588o33141k48161
1431.2I1511322j64330m51744k62703j16210j64689l91975p28790m24614k68860Q3115
1440.8H8620522j24726k28584j9852j69830j66832j48064K7046o01280m91440k82806
1450.5H6414154o40434o52428o17340k25151q14270q94836k22100m04953M39194m2580
1460.1H2339256K61277j92681K59087M13765o27167j65535K0966Q53492R46694K230003
1469.7H6339157K652840K712425L369522O66031N37613L33397J067177L64051P1495
1478.4I8113708L74451J76087M21005J854J68571K11273J43166K68929K44995K89085
1488.1A00413124k19551M22684p9674p7896J47926q5518M61899N10765K57172l64495
$$ plain form
1421.5 92769440 92816032 92928284 92983643 93133797 93256111 93033005 92781212 92392624 91759483 91511322
1431.2 91511322 91346992 90895248 90632545 90516335 90351646 89959671 89230881 88806267 88537407 88620522
1440.8 88620522 88495796 88267212 88247360 88077530 87910698 87762634 87789680 87188400 86696960 86414154
1450.5 86414154 85773720 85121292 84503952 84278801 83464531 82569695 82347595 81942642 82381836 82339256
1460.1 82339256 82600533 82407852 82666939 83080704 82453537 82288002 82308968 83162460 84109154 86339157
1469.7 86339157 88991997 91704422 95073944 95739975 96277588 96610985 97678162 98042213 98113708
1478.4 98113708 98488159 98664246 99085251 99087105 99255676 99466949 99610115 99879044 100124039 100413124
1488.1 100413124 100193573 100616257 100536583 100458687 100606613 100521095 100982994 101493759 101750931 101386436
1497.7A01386436l61236J19659l0235l2867j55915J4015K89292K97615j053772J368973
1507.3A01841965N03509q94233K7214j21056K21725N13978j94603j58715L26264M00787
1517A02466835p82524K14317L79502M07783q392j081276Q2115J37260J10772R1468
1526.6A02017860j23611j5778J73966k9381o3248L69377j54724k23541J62315K43775
1536.3A02357010M30672k6116m02641p96456R19793J086952m51691m39049n05172l25768
1545.9A01847534l288Q4648K13135K06337m4541j23069M4372o4140l85887K36473N84869
1556.5A02596443N52780q10020l242996J257919J402977K55821n8700l05054J21582
1565.2A01770752M34128k3857K19055N12825J95686n40748m15253j45805k2889J05652
$$ plain form
1497.7 101386436 101025200 101144859 101114624 101081757 100925842 100939857 101229149 101526764 100472992 101841965
1507.3 101841965 102345474 101451241 101478455 101357399 101579124 102093102 101898499 101739784 102066048 102466835
1517 102466835 101684311 101898628 102278130 102685913 102677521 101596245 101678360 101815620 101926392 102017860
1526.6 102017860 101894249 101878471 102052437 102023056 101959808 102329185 102174461 101950920 102113235 102357010
1536.3 102357010 102787682 102761566 102358925 101562469 102482262 103569214 103117523 102678474 102173302 101847534
1545.9 101847534 101844246 101928894 102142029 102348366 102303825 102180756 102225128 102160988 101775101 102011574 102596443
1556.5 102596443 103149223 102339203 99096207 100354126 101757103 102012924 101954224 101649170 101770752
1565.2 101770752 102204880 102181023 102400078 102912903 103108589 102567841 102152588 102006783 101983894 102089546
1574.9A02089546M96262R7076n27084j22994k3529m837O905K3910j09870j93734K21329
1585.5A01952980K94914M1741k21329j07964J72104j99722k55585M7776J32316R4261
1595.1A01951492K48680J06461k33231j43196j42372P0175J63712M234k02377p1335
1604.7A01752243J85326q0361K4117J65725J93039m7813k25334k18094k00798L25928
1614.4A01873978K34588l4996n67878j07796K14050r3300N3955J26351P6942k52563
1624A01523331j89392P9658J02066L13210k66304k96654p0519J12633M189L5476P23534
1634.6A02071228L998k59003k46574m92218n3650l12050k33589j21231K62436K30606
1644.3A00849953r8267k00996j94428K54677m23141j75492K03911P26280J203652k894204
$$ plain form
1574.9 102089546 102585808 102682884 102155800 102032806 102009277 102004440 102011345 102035255 101925385 101731651 101952980
1585.5 101952980 102247894 102289635 102068306 101960342 102132446 101932724 101677139 101724915 101857231 101951492
1595.1 101951492 102200172 102306633 102073402 101930206 101787834 101858009 102021721 102025955 101823578 101752243
1604.7 101752243 101937569 101857208 101881325 102047050 102240089 102192276 101966942 101748848 101548050 101873978
1614.4 101873978 102108566 102073570 101505692 101397896 101611946 101518646 101572601 101698952 101775894 101523331
1624 101523331 101333939 101413597 101515663 101828873 101562569 101265915 101195396 101308029 101312218 101347694 102071228
1634.6 102071228 102075226 101816223 101569649 101077431 101023781 100711731 100478142 100356911 100619347 100849953
1644.3 100849953 100751686 100550690 100356262 100610939 100187798 100012306 100216217 100942497 102146149 99251945
1653.9I9251945M09928j74126m1817P5348J57654K94083K26730J99906M0992R4284
1663.6A00534927o4437o8406j05934j05751R7908K8534M51363K41729l05801o9862
1673.2A00634270L57071j44844p72477K40761J9303N7777Q6700j27548L800j41800
1682.9A00213013p89147J8685M64012j02013M6494j87470j95701j58409l68165j04225
1692.5I8837074p1678J04965J71990k14569j22757m21776n03639j902184M65256J009071
1702.1I7351753K42630l67393o30921k94601l62434k52175j90590j71768m04259l32634
1711.8I4587608k00599l93097p32987o72233j53527q77960j262138l5301l21915m78188
1721.4H9459663n26046o75484r34143p86759r37255r93477p98279q67867j384468j364158
$$ plain form
1653.9 99251945 99661873 99487747 99445930 99521278 99678932 99973015 100199745 100399651 100440643 100534927
1663.6 100534927 100470490 100402084 100296150 100190399 100288307 100316841 100768204 101009933 100704132 100634270
1673.2 100634270 100991341 100846497 100074020 100314781 100334084 100391861 100478561 100351013 100354813 100213013
1682.9 100213013 99423866 99442551 99906563 99804550 99851044 99663574 99467873 99309464 98941299 98837074
1692.5 98837074 98765396 98870361 99042351 98827782 98705025 98283249 97779610 95877426 96342682 97351753
1702.1 97351753 97594383 97226990 96596069 96301468 95939034 95686859 95496269 95324501 94920242 94587608
1711.8 94587608 94387009 93993912 93260925 92588692 92435165 91557205 90295067 90259766 89937851 89459663
1721.4 89459663 88933617 88258133 87323990 86537231 85599976 84606499 83808220 82940353 81555885 80191727
1731.1H0191727p32270p48268k114074l406342n97038q11898j035347r62478j264946
1739.8F8519066j062737l24951j57654o92123l14812j48338K87918J56220K42637P72873
1749.4F7278099L26813J077377O78787J310089J592263J694221K057495K159806J805565
1758.1G9980515J572044J904083J659714K560951J469078P67288J309624R73419Q64502
1766.8I3061218O81710R48936N87784L44070R40834J083664l9711j09588L19618K62199
1776.4I8080734K93244J16516J33384L82744q331J99310J87928L9489P7423J11870
1786I9614311j3641r148M00955M05632J67405k42165J01280J91406j47323J66283Q9210
1796.7A00724205J41090J88256j85845l1387J33186M3602o393N7190K14531J85585
$$ plain form
1731.1 80191727 79459457 78711189 76597115 73190773 72593735 71781837 70746490 69784012 68519066
1739.8 68519066 67456329 67131378 66973724 66281601 65966789 65818451 66106369 66262589 66505226 67278099
1749.4 67278099 67604912 68682289 69361076 70671165 72263428 73957649 76015144 78174950 79980515
1758.1 79980515 81552559 83456642 85116356 87677307 89146385 89913673 91223297 92196716 93061218
1766.8 93061218 93742928 94691864 95279648 95623718 96564552 97648216 97608505 97498917 97818535 98080734
1776.4 98080734 98373978 98490494 98623878 99006622 98998291 99197601 99385529 99425018 99502441 99614311
1786 99614311 99600670 99591522 99992477 100398109 100565514 100323349 100424629 100616035 100468712 100634995 100724205
1796.7 100724205 100865295 101053551 100867706 100836319 100969505 101013107 101006714 101063904 101278435 101464020
1806.3A01464020M3213K441j34621q8272K88155J26602n2833p355J1513O1111N3429
1816.9A01767403N0781J0475l1197r857l2753j053J59089K17742j66542k60978L11104
1827.5A02014214M64965o713l00293J4366K2522j76239K3925J62003r1652o0753N3070
1838.1A02119415J16730m2435q3839J47056R5391K93121J51886j90681J37436J29272
1847.8A02873352k24823k40845Q6998J44936j10924M128J51565j46179j30295Q1070
1857.4A02488983k3491O7688J70441O6132P4668Q1391j80588j81190J59217J45836
1867.1A02869087J2886j06720q0803O4057j48232j85539J36879J04912r6451Q6967
1876.7A02657043L0686p6775l9367r476Q0803n2506m6089j4488N6068R7351K0607P2144
$$ plain form
1806.3 101464020 101507233 101509674 101375053 101286781 101574936 101701538 101648705 101641350 101652863 101713974 101767403
1816.9 101767403 101818184 101828659 101797462 101787605 101754852 101753799 101912888 102130630 101964088 101703110 102014214
1827.5 102014214 102479179 102472466 102172173 102186539 102209061 102032822 102056747 102218750 102127098 102066345 102119415
1838.1 102119415 102236145 102193710 102109871 102256927 102352318 102645439 102797325 102606644 102744080 102873352
1847.8 102873352 102648529 102407684 102494682 102639618 102528694 102532822 102684387 102538208 102407913 102488983
1857.4 102488983 102465492 102533180 102703621 102769753 102844421 102925812 102745224 102564034 102723251 102869087
1867.1 102869087 102881973 102775253 102694450 102758507 102610275 102424736 102561615 102666527 102570076 102657043
1876.7 102657043 102687729 102610954 102571587 102562111 102642914 102590408 102544319 102529831 102585899 102683250 102703857 102776001
1888.3A02776001m044Q6136K0203l2532j457j701J90841q3786j61995M9225j3916j15974
1899.8A02707001j27297k5993k396J32477K14119O7741p5172q9462O2187N8227r9349
1910.4A02822083j47683k7092J09322J74606j549j22123L7590k5612n0179Q4755J34270
1921.1A02988388J03005j2726j36040j41983j20834j33286J39038K87903L9062j75575
1930.7A02836952j80107Q1490J79695r842j21781L8208L4829j24153l0068M5387J13724
1941.3A02864334M5944p7728k5528O0371J30951k6237o4453o813j2841j16691q0223
1951.9A02691086O5773K0500j7792q5724Q9875K35901K1545j57379j45401O2233J08307
1962.5A02888924m624Q1024J56311p2357j10573j00769k04544N2979J16844J42006
$$ plain form
1888.3 102776001 102771957 102858093 102878296 102845764 102844307 102842606 103033447 102949661 102787666 102836891 102822975 102707001
1899.8 102707001 102579704 102553711 102551315 102683792 102897911 102965652 102890480 102801018 102863205 102921432 102822083
1910.4 102822083 102674400 102647308 102756630 102931236 102929687 102807564 102845154 102819542 102769363 102854118 102988388
1921.1 102988388 103091393 103078667 102942627 102800644 102679810 102546524 102685562 102973465 103012527 102836952
1930.7 102836952 102656845 102738335 102918030 102908188 102786407 102824615 102859444 102735291 102705223 102750610 102864334
1941.3 102864334 102910278 102832550 102807022 102867393 102998344 102972107 102907654 102900841 102888000 102771309 102691086
1951.9 102691086 102756859 102777359 102759567 102673843 102763718 102999619 103021164 102863785 102718384 102780617 102888924
1962.5 102888924 102884300 102965324 103121635 103049278 102938705 102837936 102633392 102686371 102803215 102945221
1972.2A02945221J72142o9481o4911O0112r61j74812j01746Q0139J37909M5586L2257
1982.8A03061455O8298j81518j66817L3233J39718l7758j79070Q6495J7952j19049
1992.4A02722939n5260M9728N8594n2666J0613P2525Q2565n7312l9680L5942M7195
2003A02875183N2872j4015J13662p7339j98593j9028j251J55274K06573k5253j34697
2013.6A02933388n0171n0812K7222J5327K5467O4858j34331m3694r5192p5645J64497
2024.2A02780914P1900j7815K8381O7543r5924l3287q1787j64574J91902J40000r6329
2034.9A02790924j51894K5017J57013M2092L9833N9379J1528j39923M570N6122q8692
2045.5A02805969m7737M395J39099P507K3804J07330j23489r9762L8742P7682j17187
$$ plain form
1972.2 102945221 103117363 103047882 102982971 103043083 103042122 102867310 102765564 102845703 102983612 103029198 103061455
1982.8 103061455 103129753 102948235 102781418 102814651 102954369 102916611 102737541 102824036 102841988 102722939
1992.4 102722939 102667679 102717407 102776001 102723335 102733948 102806473 102889038 102831726 102792046 102827988 102875183
2003 102875183 102928055 102914040 103027702 102950363 102751770 102732742 102731491 102886765 103093338 103068085 102933388
2013.6 102933388 102883217 102832405 102859627 102874954 102900421 102965279 102830948 102787254 102692062 102616417 102780914
2024.2 102780914 102852814 102834999 102863380 102930923 102834999 102801712 102719925 102555351 102747253 102887253 102790924
2034.9 102790924 102639030 102664047 102821060 102863152 102902985 102962364 102973892 102833969 102838539 102894661 102805969
2045.5 102805969 102758232 102762627 102901726 102909233 102933037 103040367 102916878 102817116 102855858 102933540 102816353
2056.1A02816353p0290J81130r423p4989O5834O8405P0442M2901o0143j86691r6001
2066.7A02747528J43181J23787O7726P2433k7359n104l9978j41426l6697O5529r979
2077.3A02959641P1563P5859l4462J49460o9656k47376r056p5126K0919J46950j02615
2087.9A02886101m9118K46322R7023p6881l7582l4562q1802j0490K60902r3986k46956
2098.5A02858971J46789O2348J00586J13128Q309K7572l9489o1020k3384k5330q3023
2109.1A03085457K1072K0790J02967J65527m9866j12472p8308J01814J05003K6497
2118.7A03388481K1172n8182p3158o2455R6474J12061K9075j07956j50367p2411n7114
2129.4A03065620Q3695J9386O4087P7416o1997j18996j64589M0513J41517K33986J21086
$$ plain form
2056.1 102816353 102746063 102927193 102917770 102842781 102908615 102977020 103047462 103090363 103030220 102843529 102747528
2066.7 102747528 102890709 103014496 103082222 103154655 103127296 103122192 103082214 102940788 102904091 102969620 102959641
2077.3 102959641 103031204 103107063 103072601 103222061 103152405 102905029 102895973 102820847 102841766 102988716 102886101
2087.9 102886101 102836983 103083305 103180328 103103447 103065865 103031303 102949501 102939011 103199913 103105927 102858971
2098.5 102858971 103005760 103068108 103168694 103281822 103290131 103317703 103278214 103217194 103193810 103168480 103085457
2109.1 103085457 103106529 103127319 103230286 103395813 103345947 103233475 103155167 103256981 103361984 103388481
2118.7 103388481 103409653 103351471 103278313 103215858 103312332 103424393 103453468 103345512 103195145 103122734 103065620
2129.4 103065620 103149315 103168701 103232788 103310204 103248207 103129211 102964622 103005135 103146652 103380638 103501724
2140A03501724q7234o6735m5173M6913o4407j66039j15433K54296K65808j41381l3454
2150.6A03348885r9503j18706q6715j27526J36872L19633J67854k00401j20712J327
2160.2A03221008M0406Q2725n3062k5505j4206J29684M807j93917n6633J11107K93854
2170.8A03540268L3371j32980j16509k47566p9643P2784Q1039N9998q7028j43334J26068
2181.4A03106468K80869R727j94008n928K36168J465k41829J3313L1739j77735O4751
2192A03125000K40494J34903O3797q3000j39496q972P6889K2987K0409n6557k480Q4313
2203.6A03478287j54183M2855J36047p9941N2445K395j66954j31485P9071N4802l6354
2214.2A03276985L4294m867J58859J49307q9287j21192q7693L1418K9991j88835l776
$$ plain form
2140 103501724 103414490 103347755 103302582 103349495 103285088 103119049 103003616 103257912 103523720 103382339 103348885
2150.6 103348885 103249382 103130676 103043961 102916435 103053307 103372940 103540794 103340393 103219681 103221008
2160.2 103221008 103261414 103344139 103291077 103265572 103251366 103381050 103385857 103191940 103135307 103246414 103540268
2170.8 103540268 103573639 103440659 103324150 103076584 102996941 103069725 103150764 103210762 103123734 102980400 103106468
2181.4 103106468 103387337 103397064 103203056 103197128 103433296 103434761 103192932 103206245 103237984 103060249 103125000
2192 103125000 103365494 103500397 103564194 103481194 103341698 103332726 103409615 103432602 103453011 103396454 103393974 103478287
2203.6 103478287 103324104 103366959 103503006 103423065 103475510 103477905 103310951 103179466 103258537 103313339 103276985
2214.2 103276985 103311279 103306412 103465271 103614578 103525291 103404099 103316406 103347824 103377815 103188980 103185204
2224.8A03185204K59674n1522j00303J13762R7900M036r1782j31370j55525P7117R0188
2235.4A03297379p2358n905P2586J47263o26j6800r2239j31790J68731J35537p8545
2246A03423233k05978K2003K10563j11595k27394k0508J00708J57746J19133r8541
2255.7A03369370o7597j3054m9354M0855l0640l1166M181R9365J54618J6639J2856
2266.3A03506073l1151j10328o6323j274q4602J3946J92978j8158j32896j7143Q2824
2276.9A03333946O6750N6976J06789m7600k66747j50840J97670J14944j86912j58059
2286.5A03066917K8405R2697N3680L6896l6545k3941m768l5691R2514J14304p4097
2297.2A03310371k48336j76613J46698K20146K6497o0341j40289J37306K42058k22901
$$ plain form
2224.8 103185204 103444878 103393356 103293053 103406815 103504715 103508751 103416969 103285599 103130074 103207191 103297379
2235.4 103297379 103225021 103219116 103291702 103438965 103438339 103421539 103329300 103197510 103366241 103501778 103423233
2246 103423233 103217255 103239258 103449821 103338226 103110832 103090324 103191032 103348778 103467911 103369370
2255.7 103369370 103301773 103288719 103239365 103280220 103249580 103218414 103222595 103321960 103476578 103493217 103506073
2266.3 103506073 103474922 103364594 103298271 103296997 103212395 103226341 103419319 103401161 103268265 103251122 103333946
2276.9 103333946 103400696 103457672 103564461 103516861 103250114 103099274 103296944 103411888 103224976 103066917
2286.5 103066917 103095322 103188019 103241699 103278595 103242050 103218109 103213341 103177650 103270164 103384468 103310371
2297.2 103310371 103062035 102885422 103032120 103252266 103278763 103218422 103078133 103215439 103457497 103234596
2306.8A03234596k16713R3094K19879o3339j98761L693j175J66908k4712k83187j69465
2317.4A02760818K48703M13956j24763p4959o0417P3280L03368q0948k65724r2629
2327.1A03100685J62651k55310j85982L4989l7186j96724p04689K25731N80238O0784
2336.7A02785187J99234o11l45626l6019J64635k78526J16508K54257o0165M8134J54709
2347.3A03001717N7647q8348J55533Q3931q4511k50336m48791J61644L46107L13515
2356.9A03248108l6476j78261l63640n310K45857m05037M13742L26912J42357j6655
2366.6A03371597n83221p25113m87839N98892L68576J66878M79416m3373l26927J34842
2376.2A02953728M16610O5209j6708j22178n8380M7959L4278K29905N4611M6654Q1237
$$ plain form
2306.8 103234596 103017883 103110977 103330856 103267517 103068756 103072449 103071274 103238182 103213470 102930283 102760818
2317.4 102760818 103009521 103423477 103298714 103223755 103163338 103236618 103539986 103459038 103193314 103100685
2327.1 103100685 103263336 103008026 102822044 102857033 102819847 102623123 101918434 102144165 102724403 102785187
2336.7 102785187 102984421 102983810 102638184 102602165 102766800 102488274 102604782 102859039 102798874 102847008 103001717
2347.3 103001717 103059364 102971016 103126549 103210480 103125969 102875633 102426842 102588486 102934593 103248108
2356.9 103248108 103211632 103033371 102669731 102664421 102910278 102505241 102918983 103245895 103388252 103371597
2366.6 103371597 102788376 102063263 101575424 102174316 102542892 102709770 103189186 103145813 102818886 102953728
2376.2 102953728 103370338 103435547 103418839 103296661 103238281 103286240 103320518 103550423 103605034 103651688 103732925
2386.8A03732925j15707k15752j23214J56494J51932N1574q0574l1555L9314l0571
2396.5A03534866o3476j3077K60902K366j63048m0283r3194j312n1040J30645J08536
2407.1A03611885j54396q8898J9394J40862O2271q7120p7774M2991N4451Q0590M0153
2417.7A03644409j29120J4458J3161m1306l868n2727L6187K7427p2784m8897J43867
2428.3A03530807J50414m2175q3741l8040Q3824K3629j15853M9431J61949N5031k9625
2438.9A03745651J656K5009j23291n2765K4033r4704J4030L6149J17149P5905n3910
2449.5A03714912O4827r3803j04675l7720l5614R0012J25900N0842o3614M7974j65032
2460.1A03594009j78291P6927j05766O4056J60714N8570K5490n6740O0585J7403j1024
$$ plain form
2386.8 103732925 103617218 103401466 103278252 103434746 103586678 103638252 103557678 103526123 103565437 103534866
2396.5 103534866 103471390 103458313 103719215 103721581 103558533 103518250 103425056 103423744 103372704 103503349 103611885
2407.1 103611885 103457489 103368591 103387985 103528847 103591118 103503998 103426224 103469215 103523666 103604256 103644409
2417.7 103644409 103515289 103529747 103542908 103501602 103497734 103445007 103481194 103508621 103435837 103386940 103530807
2428.3 103530807 103681221 103639046 103555305 103517265 103601089 103624718 103508865 103558296 103720245 103775276 103745651
2438.9 103745651 103747307 103772316 103649025 103596260 103620293 103525589 103539619 103575768 103692917 103768822 103714912
2449.5 103714912 103779739 103685936 103581261 103543541 103507927 103597939 103723839 103774681 103711067 103759041 103594009
2460.1 103594009 103415718 103492645 103386879 103450935 103611649 103670219 103695709 103638969 103699554 103716957 103705933
2470.7A03705933k3529j35743l8398o684o4316K4704n1528j00884J40633J36238l2547
2481.3A03553879o1829P1137J62590N3154k8946n6534M745j5190m8874o6543K6947
2492A03594536K46574r4833l31780L067Q3023j1085N2109Q0505O9428J3885j34369
2502.6A03571060n1903L9353r1240o4102M4723M4098Q1467N9768l0235N9059m9591
2513.2A03612457k55676j42296J08490K42989k220p1228M3472j37512o5941K13165
2522.8A03545700J49971j5495k9007q2138K8999M1702j87210j32934O302N0979k3277
2533.4A03353592N6496J22284j41175k8824J55327J1315j00594j24733O2584J12022
2543.1A03478294j16569q0071J39077J90986q4327k70966J083J49536J52260o302j34170
$$ plain form
2470.7 103705933 103682404 103546661 103508263 103501579 103437263 103461967 103410439 103309555 103450188 103586426 103553879
2481.3 103553879 103492050 103563187 103725777 103778931 103749985 103693451 103698196 103683006 103634132 103567589 103594536
2492 103594536 103841110 103746277 103414497 103417564 103500587 103489502 103541611 103622116 103691544 103705429 103571060
2502.6 103571060 103519157 103558510 103467270 103403168 103447891 103491989 103573456 103633224 103602989 103662048 103612457
2513.2 103612457 103356781 103214485 103322975 103565964 103563744 103492516 103535988 103398476 103332535 103545700
2522.8 103545700 103695671 103680176 103651169 103569031 103598030 103639732 103452522 103319588 103325890 103376869 103353592
2533.4 103353592 103410088 103532372 103391197 103362373 103517700 103529015 103428421 103303688 103366272 103478294
2543.1 103478294 103361725 103281654 103420731 103611717 103527390 103256424 103257507 103407043 103559303 103553001 103418831
2553.7A03418831O2073m4831j15150J251Q9340O9603j68152j6967J82449o0776j68518
2564.3A03249153J14517P6447j68305n9280J5396j2726l5118R9526M2732o1203J5053
2574.9A03276192j10741m2358m7692J26152K87789k8298k2323k4849r8046J305N0896
2585.5A03368027o6597j10970j1085k205m4441j34217J07132P7774p6423R3086m9591
2596.1A03150490q8715o8161P6462M1473j08619K29942J68419j11595r7832K2385R628
2606.7A03223877q3267p3021j6770J43792Q4930j44905k36618j7189Q4419o1943o1775
2617.3A02841530P2380K15507j30165j97723J16829R9289j5396j93772q4358K9381
2627A02753502J18599K3872k55707r864J75300J05042j43753j86509J48156J53785
$$ plain form
2553.7 103418831 103480904 103436073 103320923 103322174 103411514 103481117 103312965 103295998 103478447 103417671 103249153
2564.3 103249153 103363670 103440117 103271812 103212532 103227928 103215202 103180084 103279610 103322342 103261139 103276192
2574.9 103276192 103165451 103123093 103075401 103201553 103489342 103461044 103438721 103413872 103315826 103317131 103368027
2585.5 103368027 103301430 103190460 103179375 103177170 103132729 102998512 103105644 103183418 103106995 103200081 103150490
2596.1 103150490 103061775 102993614 103070076 103111549 103002930 103232872 103401291 103289696 103191864 103214249 103223877
2606.7 103223877 103140610 103067589 103050819 103194611 103279541 103134636 102898018 102880829 102965248 102903305 102841530
2617.3 102841530 102913910 103129417 102999252 102801529 102918358 103017647 103002251 102808479 102724121 102753502
2627 102753502 102872101 102895973 102640266 102630402 102805702 102910744 102766991 102580482 102728638 102882423
2636.6A02882423n7548m6005O4308o5796j37299j62796m6959K00379O4880j45309j13953
2647.2A02436325K48543K18986k13012j19294O6300j10512k21397N2437J86897M6120
2656.9A02591393p1549j3779K3064j01875N3825j3649j57410K1912M4739M6043L0693
2667.5A02453407q0383j45119M6601L7948k18963j8372J90292K4331j40503L6338J45256
2678.1A02330833o8229q1116P6820J57731J18522J8746j22742j92940k0409J69617
2687.7A02386833N7869m9286J31295O8710j53267j04187Q6594R4787O050J04935p3731
2698.3A02556602j71165J18050J21574K724j02768q6106R4857J6746p9819k1751N4382
2708.9A02503326N8548j58157k03743L8780J37169L647o0944K3919K9777P6485o005
$$ plain form
2636.6 102882423 102824875 102778870 102843178 102777382 102640083 102477287 102430328 102630707 102695587 102550278 102436325
2647.2 102436325 102684868 102903854 102690842 102571548 102637848 102527336 102305939 102358376 102545273 102591393
2656.9 102591393 102519844 102506065 102529129 102427254 102481079 102467430 102310020 102331932 102376671 102422714 102453407
2667.5 102453407 102373024 102227905 102274506 102312454 102093491 102075119 102265411 102289742 102149239 102185577 102330833
2678.1 102330833 102262604 102181488 102258308 102416039 102534561 102553307 102430565 102237625 102217216 102386833
2687.7 102386833 102444702 102395416 102526711 102595421 102442154 102337967 102424561 102519348 102525398 102630333 102556602
2698.3 102556602 102385437 102503487 102625061 102627785 102525017 102438911 102533768 102550514 102470695 102448944 102503326
2708.9 102503326 102561874 102403717 102199974 102238754 102375923 102379570 102318626 102342545 102372322 102448807 102442802
2719.5A02442802j65664m1283K6924m6303q7570O7536J19568j18149j82732k190J89805
2730.2A02202744K4871p9376R0279O3102o5032j27106J3565J11694M3427p4402k0798
2740.8A02182968J90025J08536K686m4724o2370j9524r9105j82648l6026K37099P3028
2751.4A02349945k05398q3870J61232J18743j6891m4487j16707O5605P40n2658K18239
2762A02394493K579j08689L541n9624j27243j05370l1906j0055k2706j01707N8357
2772.6A01891670J49033Q232p7507j89247j19217r2987j22734L5423J9943k27463j30653
2783.2A01144493O9962j5038L2219l8902o8283o1547k25578q4770l7773r6779j21872
2793.8A00496132r7633O0043m0726l3264J43974J9783k01072k65076j85204l2646r9594
$$ plain form
2719.5 102442802 102277138 102235855 102262779 102216476 102128906 102196442 102316010 102197861 102015129 102012939 102202744
2730.2 102202744 102227615 102148239 102238518 102301620 102236588 102109482 102123047 102234741 102278168 102203766 102182968
2740.8 102182968 102372993 102481529 102484215 102439491 102377121 102357597 102258492 102075844 102039818 102276917 102349945
2751.4 102349945 102144547 102060677 102221909 102340652 102323761 102279274 102162567 102228172 102228912 102176254 102394493
2762 102394493 102397072 102288383 102291924 102232300 102105057 101999687 101967781 101957726 101935020 101833313 101891670
2772.6 101891670 102040703 102048935 101971428 101782181 101662964 101569977 101447243 101482666 101502609 101275146 101144493
2783.2 101144493 101214455 101199417 101231636 101192734 101124451 101062904 100837326 100752556 100714783 100618004 100496132
2793.8 100496132 100398499 100458542 100417816 100384552 100528526 100548309 100347237 100082161 99896957 99864311 99764717
2804.4I9764717k43828j22108j55091j78390n775j71532l21518k68852l77068k30240
2814I7690315P2960j06621l02406k81464k73925j64276l09144m63737k32391k26212
2823.7I5403099m53361n49096n24116l78456l87589n22262n01389n25894o30928o62102
2833.3I0267906o90437o82205p00089q49823r18648q32206q08785j030464j359886
2842H2395363j537338j547913j438995j297943j255761j294952j166916r83643r15802
2850.7G0956100q15979o69631l74070j747K69737K60033K16599M94529Q28415R93950
2860.3G2157936R14696Q70025J040009J074654P99026M61151M63761N57403L68691
2869G8707352J42715Q5030K36686M09417N20797N11589N40970N93544L17581J87233
$$ plain form
2804.4 99764717 99520889 99398781 99243690 99065300 99059525 98887993 98566475 98297623 97920555 97690315
2814 97690315 97763275 97656654 97354248 97072784 96798859 96634583 96325439 95861702 95629311 95403099
2823.7 95403099 94949738 94400642 93876526 93498070 93110481 92588219 92086830 91560936 90930008 90267906
2833.3 90267906 89577469 88895264 88195175 87345352 86426704 85594498 84785713 83755249 82395363
2842 82395363 80858025 79310112 77871117 76573174 75317413 74022461 72855545 71871902 70956100
2850.7 70956100 70140121 69470490 69096420 69094673 69364410 69624443 69841042 70335571 71163986 72157936
2860.3 72157936 73072632 73942657 74982666 76057320 76856346 77317497 77781258 78338661 78707352
2869 78707352 78850067 78935097 79171783 79581200 80101997 80613586 81154556 81748100 82065681 82252914
2878.7H2252914R9907M4960J21804j01921k28867l65517l43063k09145l54652m15451
2888.3H0500969m08730l20823l87146l78907l27667m62662m72671o03615m60792l40477
2897.9G6337479n22416m82528l66791l03291m62067n35339m88434m41376m39056m98658
2907.6G1797523m41780n61714m68689m85954o26663n29373p55249o76491n09461n06042
2917.2F6236107m89006o64101n21927l34404k71827l48988k72018l8254j05328J6445
2926.9F3206699q304j6937L10462L22873J62624J52771M21982P53166O94122N18151
2936.5F6517609O97937P26265M63424N51392P42248P37153O34857M65110N14359N74280
2946.2G2624634L60641J46042L2082R1316O6154j41967j45966N8594K09457J31706
$$ plain form
2878.7 82252914 82352821 82397781 82519585 82417664 82188797 81823280 81480217 81271072 80916420 80500969
2888.3 80500969 80092239 79771416 79384270 79005363 78677696 78215034 77742363 77138748 76677956 76337479
2897.9 76337479 75815063 75332535 74965744 74662453 74200386 73665047 73176613 72735237 72296181 71797523
2907.6 71797523 71355743 70794029 70325340 69839386 69212723 68683350 67928101 67251610 66742149 66236107
2917.2 66236107 65747101 65083000 64561073 64226669 63954842 63605854 63333836 63295582 63190254 63206699
2926.9 63206699 63198395 63181458 63491920 63814793 63977417 64130188 64552170 65305336 65999458 66517609
2936.5 66517609 67215546 67941811 68405235 68956627 69698875 70436028 71070885 71535995 72050354 72624634
2946.2 72624634 72985275 73131317 73163399 73254715 73320869 73178902 73032936 73091530 73300987 73432693
2955.8G3432693J92284K82936J90560L61282N13931N60593O88194O78780O66244Q99491
2965.5G8466988J181892J100899Q29788P98241R60151R75251Q64517P04216O70570
2974.1H6552513P77611Q10966P85637N71114N22636N57579M96399N03136M62425L68302
2983.8I2408318J94046L16665K83211J88583K56913N5305P2373j73760k38457p1174
2993.4I3292023l54073l05549l34961n92194o63582n48469o33942q92677o61339m97246
3003.1H7807991n77408n58067l57002k12021j30402J16615J21346M31816P58759N48339
3012.7H7949966O31516R39644J108589J073433R88609R21906R47044Q60710N12078
3021.4I5933495O11129Q54523O25801L69248L04771L61008L43513J45302K66479M41674
$$ plain form
2955.8 73432693 73624977 73907913 74098473 74459755 74973686 75534279 76222473 76901253 77567497 78466988
2965.5 78466988 79648880 80749779 81579567 82377808 83337959 84313210 85177727 85881943 86552513
2974.1 86552513 87330124 88141090 88926727 89497841 90020477 90578056 91074455 91577591 92040016 92408318
2983.8 92408318 92602364 92919029 93202240 93390823 93647736 93703041 93775414 93601654 93363197 93292023
2993.4 93292023 92937950 92632401 92297440 91705246 91041664 90493195 89859253 88966576 88305237 87807991
3003.1 87807991 87230583 86672516 86315514 86103493 85973091 86089706 86211052 86642868 87401627 87949966
3012.7 87949966 88581482 89521126 90629715 91703148 92691757 93613663 94560707 95421417 95933495
3021.4 95933495 96544624 97399147 98024948 98394196 98698967 99059975 99403488 99548790 99815269 100256943
3031A00256943J78886O8482O7672k6329J55014L06839J80672J22284P2784K5933J4076
3041.6A01423256L2410K34092R5940n9494N5252l7163L1212J43753Q8997l6430L1051
3052.2A02002876J96976m5136j07887O0257J71486R9831j72364k5764Q0391j03218
3061.9A02157448J9165Q7189l1388l05j4427M722J13945P6729J0887J5015J72699J29295
3073.5A02740974j50703o0745J11709P6363n524l7216N0102J96747K16126N9433O9931
3084.1A03267197M9011j22124j44668o7955Q6303L6690q4831p561R689R6627J42570
3094.7A03260948j6212j19812q1940J07292L33107J97518j67839j04958N8449N5534
3104.3A03522087j1398k29279j05263P1679L9512O5636O0867R8168n5573p1548L9344
$$ plain form
3031 100256943 100435829 100504311 100571983 100545654 100700668 101007507 101188179 101310463 101383247 101409180 101423256
3041.6 101423256 101455666 101689758 101785698 101726204 101781456 101744293 101775505 101919258 102008255 101971825 102002876
3052.2 102002876 102199852 102154716 102046829 102107086 102278572 102378403 102206039 102180275 102260666 102157448
3061.9 102157448 102176613 102263802 102232414 102232109 102217682 102222404 102336349 102413078 102423965 102438980 102611679 102740974
3073.5 102740974 102590271 102529526 102641235 102717598 102712074 102674858 102724960 102921707 103137833 103197266 103267197
3084.1 103267197 103316208 103194084 103049416 102981461 103067764 103104454 103019623 103012062 103021751 103118378 103260948
3094.7 103260948 103244736 103124924 103042984 103150276 103483383 103680901 103513062 103408104 103466553 103522087
3104.3 103522087 103510689 103281410 103176147 103247826 103287338 103352974 103413841 103512009 103456436 103384888 103424232
3114.9A03424232J6396K05940J33690o6452r5535j39053j8471L9222l8696J6968m4785
3125.5A03433456j11854P7309Q5678P3234n539j91887m9804j4740N8342K37091Q5426
3136.1A03676712k06505k12158R5902J70578N0895l05P0389P1281r7130j41098N463
3146.8A03484024Q2581p8782L586j0132q8233J7700k976K34238R4620q9722m4312j8440
3158.3A03584152K39807j31881j97197P8415p2953M1466K1568n2482n7274j19003m2916
3168.9A03291702L5683o638l4767J07292K13448J62987j31005j12434K08908J43921
3178.6A03879097q0521l62335k99660K01226K62451o3713j65955j17561l2234J12884
3188.2A03333679K17423K55630M341k78129j95023O1402P8041k07795k32711R964J20887
$$ plain form
3114.9 103424232 103440628 103646568 103780258 103713806 103618271 103479218 103460747 103499969 103461273 103478241 103433456
3125.5 103433456 103321602 103398911 103484589 103557823 103552284 103360397 103310593 103295853 103354195 103591286 103676712
3136.1 103676712 103470207 103258049 103353951 103524529 103575424 103575119 103645508 103716789 103619659 103478561 103484024
3146.8 103484024 103566605 103487823 103491409 103481277 103393044 103410744 103407768 103642006 103736626 103646904 103602592 103584152
3158.3 103584152 103823959 103692078 103494881 103573296 103500343 103541809 103563377 103510895 103453621 103334618 103291702
3168.9 103291702 103327385 103320747 103285980 103393272 103606720 103769707 103638702 103526268 103735176 103879097
3178.6 103879097 103798576 103436241 103136581 103337807 103600258 103536545 103370590 103253029 103220795 103333679
3188.2 103333679 103551102 103806732 103811073 103532944 103337921 103399323 103477364 103269569 103036858 103046822 103167709
3198.8A03167709J63262J55243p4211j92856j87798l6697K76039J12648O6360o6726
3208.5A03382973k61994K46529J96190j49307j34613K5619J00967o3430Q2016N2032
3218.1A03476982o9984m784J3954Q0826r2537k11708O1111L09746J39122j22192j85227
3228.7A03395309o2927J015n7770O0646J8532K1240Q232j48620l5103J9966j2093j32507
3240.3A03075920n9799J61407L3318l4363N005q0391m6577J98585K72003j5075k16149
3250.9A03293884p3913n1354m1900O0890r4300Q9943Q1078k22511l7560J3527q6998
3261.5A02930786j33530M0024K04834N9304p332k2614L7911J3031O8916P5127n9098
3272.1A03207359p126k40837j47102K24022L7224J991Q4015l2555J18317O2218k24457
$$ plain form
3198.8 103167709 103330971 103486214 103412003 103219147 103031349 102994652 103270691 103383339 103449699 103382973
3208.5 103382973 103120979 103367508 103563698 103414391 103279778 103305397 103406364 103342934 103424950 103476982
3218.1 103476982 103406998 103402214 103416168 103496994 103404457 103192749 103253860 103563606 103702728 103580536 103395309
3228.7 103395309 103332382 103333397 103275627 103336273 103354805 103376045 103384277 103235657 103200554 103220520 103208427 103075920
3240.3 103075920 103016121 103177528 103210846 103176483 103181488 103101097 103054520 103253105 103525108 103510033 103293884
3250.9 103293884 103219971 103168617 103126717 103187607 103093307 103183250 103264328 103041817 103004257 103017784 102930786
3261.5 102930786 102797256 102837280 103042114 103101418 103094086 103071472 103109383 103122414 103191330 103266457 103207359
3272.1 103207359 103200233 102959396 102812294 103036316 103073540 103075531 103159546 103126991 103245308 103307526 103083069
3282.7A03083069j32034l2509O263N8922l8j3023l8468j00898K2407J19225j19652
3293.3A02853264p7789N0872j1207P8407k9427j03134k0111P9056P0213p3669P1609
3303.9A02888084K39251N2734j05637O3301j58859k21237J66016n0537r6787M0062
3313.6A02816391l2845k9037o0463j4938Q5991J14837k37587j69822K04040L0129M2144
3324.2A02748840K23030J81900k27890l53080k976Q6518J94976O2111j15020j8052
3333.8A02780357n9845k7687r796q6456m5731J31813J03684k3857J26793m2351k75955
3344.4A02570969m9561N165k0111J71677J71188L74j03508j73767j09635l0189p5066
3355.1A02357536P5394J45195O0150N3665k06260o4141K26174j67404j56228J77025
$$ plain form
3282.7 103083069 102951035 102918526 102924789 102983711 102983673 102970650 102932182 102831284 102853691 102972916 102853264
3293.3 102853264 102775475 102826347 102815140 102893547 102864120 102760986 102740875 102819931 102890144 102816475 102888084
3303.9 102888084 103127335 103180069 103074432 103137733 102978874 102757637 102923653 102873116 102776329 102816391
3313.6 102816391 102783546 102754509 102694046 102679108 102765099 102879936 102642349 102472527 102676567 102706696 102748840
3324.2 102748840 102971870 103153770 102925880 102572800 102569824 102656342 102851318 102913429 102798409 102780357
3333.8 102780357 102720512 102692825 102683029 102596573 102550842 102682655 102786339 102762482 102889275 102846924 102570969
3344.4 102570969 102521408 102526573 102506462 102678139 102849327 102849701 102746193 102572426 102462791 102432602 102357536
3355.1 102357536 102432930 102578125 102638275 102691940 102485680 102421539 102647713 102480309 102324081 102501106
3364.7A02501106J04592K3887n1780p8476J4602J1505R613n0895r2201O7062M5143
3375.3A02504158r0958j22177j17645n7335P2678K24579J12983r826m5517o539R9907
3385.9A02564308k69554m23828O8420L86544J27372k05063k8030K51839P3646k93747
3395.6A02251907j61384K01927J48819K7718j18165j48315O3637M2251p6507j831o607
3406.2A02223450l3905k0356J6434P4631o7665J6098O2973r7199K678J7067J17775
3416.8A02311981J14205q9798m4747O6414N4230r2766o4568n3703j22841p5691M6318
3427.4A02049034J43746N9371K01668J55197j89956j54213O6017K04521j56647m93209
3437A01885529r7420K25120J10932O6726M0787r9907j62430o8519J33331R1423j64177
$$ plain form
3364.7 102501106 102605698 102629585 102577805 102499329 102513931 102525436 102535049 102484154 102391953 102459015 102504158
3375.3 102504158 102413200 102291023 102173378 102116043 102188721 102413300 102526283 102516457 102470940 102464401 102564308
3385.9 102564308 102294754 101870926 101939346 102325890 102453262 102248199 102220169 102472008 102545654 102251907
3395.6 102251907 102090523 102292450 102441269 102468987 102350822 102202507 102266144 102308395 102231888 102230057 102223450
3406.2 102223450 102189545 102169189 102185623 102260254 102192589 102208687 102271660 102174461 102177139 102194206 102311981
3416.8 102311981 102426186 102336388 102291641 102358055 102412285 102319519 102254951 102201248 102078407 102002716 102049034
3427.4 102049034 102192780 102252151 102453819 102609016 102419060 102264847 102330864 102535385 102378738 101885529
3437 101885529 101788109 102013229 102124161 102190887 102231674 102131767 101969337 101900818 102034149 102125572 101961395
3447.6A01961395j11931O0013k4215p0160J05186J34987P3143q1871q6166q6785j54030
3458.2A01719566J15494Q6395j800n4909l9497J27182k64557k69287P8613K38480K35664
3468.8A01971344q3168P3769J35070k55020k75467l3981K77069J86493j08459J65695
3478.5A02053345K39471j04019L7743L0960o7597N5031j03134k1034J21978R0241j56273
3489.1A02176712l61732j61J67031J00433J19354J04706K44400O3965k33765j83448
3498.7A02197495R5359K46498l700J69304J42059l55774N188J17135l4714N523m9186
3509.4A02535187J22238n5794l8246K07809K1935l2478j20812r3185J27159M0420j63757
3520A02550476N7922K55005j84280p2510K26486K2133P3662n8029n6595o5567j11664
$$ plain form
3447.6 101961395 101849464 101909477 101885262 101815102 101920288 102055275 102128418 102046547 101960381 101873596 101719566
3458.2 101719566 101835060 101921455 101919655 101864746 101825249 101952431 101687874 101418587 101497200 101735680 101971344
3468.8 101971344 101888176 101961945 102097015 101841995 101566528 101532547 101809616 101996109 101887650 102053345
3478.5 102053345 102292816 102188797 102226540 102257500 102189903 102244934 102141800 102120766 102242744 102332985 102176712
3489.1 102176712 101814980 101814819 101981850 102082283 102201637 102306343 102550743 102614708 102380943 102197495
3498.7 102197495 102292854 102539352 102535652 102704956 102847015 102491241 102496429 102613564 102578850 102584373 102535187
3509.4 102535187 102657425 102601631 102563385 102771194 102793129 102760651 102639839 102546654 102673813 102714233 102550476
3520 102550476 102608398 102863403 102679123 102606613 102833099 102855232 102928894 102870865 102814270 102748703 102637039
3530.6A02637039M8187m3754J02150J14609j13045o1058J03935J17905j35674n2421
3540.2A02717873J08848Q6754K28012J6167j51268J7860R8755J2848o2927J28311J63483
3550.8A03364716q1101k45140M6799M326j91674J90590K57118L0968j991o2157K56356
3561.4A03568810J80191k59110J8761K98385K54654K51854m45198l00758L02772j30241
3571.1A03740120j05820L56034J52839k34993k68440o3095o2874n2887J17279R9762
3580.7A03677925k5146K05345L10997M6753M8416O8069J04203p9056l41492J4328O2393
3591.3A04092735L1403M6341K62634L24280k88979l18634J17073K10396q6998j61087
3601A04229164P8163J05912j09765n4847K41394m7913p6874L17871l7933j02470P1693
$$ plain form
3530.6 102637039 102685226 102641472 102743622 102858231 102745186 102684128 102788063 102905968 102770294 102717873
3540.2 102717873 102826721 102913475 103141487 103157654 103006386 103024246 103123001 103135849 103072922 103201233 103364716
3550.8 103364716 103283615 103038475 103085274 103089600 102897926 103088516 103345634 103376602 103374611 103312454 103568810
3561.4 103568810 103749001 103489891 103508652 103807037 104061691 104313545 103868347 103567589 103870361 103740120
3571.1 103740120 103634300 103990334 104143173 103908180 103639740 103576645 103513771 103460884 103578163 103677925
3580.7 103677925 103652779 103858124 104169121 104215874 104264290 104332359 104436562 104357506 104016014 104030342 104092735
3591.3 104092735 104124138 104170479 104433113 104757393 104468414 104149780 104266853 104477249 104390251 104229164
3601 104229164 104307327 104413239 104303474 104248627 104490021 104442108 104365234 104683105 104645172 104542702 104614395
3611.6A04614395k8435j96792M4563L7026m3328K39433J19095J41808L73566l91861
3621.2A04909470l57064J21407O2820o0859M1694J14601L13530j95793o67183L13324
3630.9A04595947J29814L2723J46118J9013j74859o6230p0038k602J80908N1094J48690
3641.5A04990578J19095n4520j71982j78390M47082N30090l61900M891n8861l18466
3651.1A04947617m08959j71287M0962K52731K62467k11602l4958J86669K0172j44173
3660.8A04739639L0487J29692o2072j18332k1225J71150K28310n2910M9782L54888
3670.4A05449409k76077j79260Q5922M46694P76695j048393k26876J75911j4785j48560
3680A05040680M3823K07375n0705l52226j5664K86278Q6189L56873L05275n38841q7372
$$ plain form
3611.6 104614395 104585960 104389168 104433731 104470757 104427429 104666862 104785957 104927765 105301331 104909470
3621.2 104909470 104552406 104673813 104736633 104675774 104717468 104832069 105145599 104949806 104282623 104595947
3630.9 104595947 104725761 104758484 104904602 104923615 104748756 104682526 104612488 104609886 104790794 104841888 104990578
3641.5 104990578 105109673 105055153 104883171 104704781 105151863 105681953 105320053 105324944 105266083 104947617
3651.1 104947617 104538658 104367371 104408333 104661064 104923531 104711929 104676971 104863640 104883812 104739639
3660.8 104739639 104770126 104899818 104837746 104719414 104698189 104869339 105097649 105044739 105094521 105449409
3670.4 105449409 105173332 104994072 105079994 105526688 106303383 105254990 105028114 105204025 105189240 105040680
3680 105040680 105084503 105291878 105241173 104888947 104873283 105159561 105245750 105602623 105907898 105369057 105281685
3690.6A05281685l74268j07208O2141J1277K11952m5899k98255K0484J90766k0554
3700.3A04932121j12846J89659K54456r8015j85814J13182K7389j1856L04558L07770
3709.9A05720604k7786n67139m46190K24373K6169J34689R9793Q8913P0488k75811
3719.6A05048103m0100K36275J24420N0575m2266k96883r7878J18477m4883k5177K03041
3730.2A05233704M80178K84470j15036M04060k98004j354431J46446L94074J05949
3738.9A05281410R6855L36121J83945j66535M204o33614m64096N24277M85001m2565
3748.5A05605003q59634L81828M01123m40406K54608M4807j53206j25419l0709K23908
3758.2A05301903k2820j50429Q545j05644o676J02974J50048o2775j74606J54953J05591
$$ plain form
3690.6 105281685 104907417 104800209 104862350 104873627 105085579 105039680 104741425 104761909 104952675 104932121
3700.3 104932121 104819275 105008934 105263390 105165375 104979561 105092743 105120132 105108276 105412834 105720604
3709.9 105720604 105692818 105125679 104679489 104903862 104930031 105064720 105164513 105253426 105323914 105048103
3719.6 105048103 105008003 105244278 105368698 105419273 105377007 105080124 104982246 105100723 105055840 105030663 105233704
3730.2 105233704 105713882 105998352 105883316 106287376 105989372 104634941 104781387 105175461 105281410
3738.9 105281410 105378265 105714386 105898331 105731796 105736000 105102386 104638290 105162567 105647568 105605003
3748.5 105605003 104745369 105127197 105528320 105087914 105342522 105387329 105234123 105108704 105077995 105301903
3758.2 105301903 105279083 105128654 105137199 105031555 105024879 105127853 105277901 105215126 105040520 105195473 105301064
3768.8A05301064l09433j63414K06764j2062J67679J68403j11824R1583j9996j21903
3778.4A05196861j90315l01674J89339J82129K87613K14164j56768J00669j08001l63312
3788A05050705k4887J77490J22460K4414Q926m5776p1457M7233j56097j26640L16993
3798.7A05323364K65900J68190R659n80147k40692l0770K39754L19222n35805j01265
3808.3A04837410N26176O4507k85141L0731J1192M7387K96013j99410j90010L86223
3817.9A05525078K38426Q7311m63013o29135J88095J41838K63725K29248J38131o6872
3827.6A05652832k88605q1062J73981j22994m92492L02040N78346K26295j34399j31096
3837.2A05682846j41762p3051j47949l59215o1752K95837K46948j08742k11738j02661
$$ plain form
3768.8 105301064 104991631 104828217 105034981 105022919 105190598 105359001 105247177 105338760 105318764 105196861
3778.4 105196861 105006546 104704872 104894211 105076340 105363953 105578117 105421349 105522018 105414017 105050705
3788 105050705 105025818 105203308 105325768 105350182 105359108 105313332 105241875 105289108 105133011 105006371 105323364
3798.7 105323364 105589264 105757454 105767113 105186966 104946274 104915504 105155258 105474480 104938675 104837410
3808.3 104837410 105363586 105428093 105142952 105173683 105184875 105232262 105528275 105328865 105138855 105525078
3817.9 105525078 105763504 105850815 105387802 104758667 104946762 105088600 105352325 105581573 105719704 105652832
3827.6 105652832 105364227 105283165 105457146 105334152 104841660 105143700 105722046 105948341 105813942 105682846
3837.2 105682846 105541084 105468033 105320084 104960869 104899117 105194954 105441902 105333160 105121422 105018761
3846.9A05018761J54770K10693K18918O7329M6456M07058L4149p98728q0239k5703
3856.5A05253464j97693J98082J70563p9705J70357P5073j46728J54175M486k03049
3866.2A05399025j49567j21154m5273n7274J99714r4802N5099K45636l90549N4467
3875.8A05095322K57385N5405M5387o7696j60286k23510J0688J59279J38832J12992
3885.4A05423798k77810l0799O4613M3472K49329L06930j94389j89522J46050k8763
3895.1A05512909l36739j68693K10136J34201k44903M6241J40023J54289J12419j81679
3904.7A05378204k99728j6731P0541j15372j0292k9846j30989K73796M77409J9448
3914.4A05616440l29819j00479J58211N2482k59048k66335K13028L952j89232R3323
$$ plain form
3846.9 105018761 105173531 105384224 105603142 105670471 105716927 106123985 106158134 105359406 105279167 105253464
3856.5 105253464 105055771 105253853 105424416 105344711 105515068 105590141 105443413 105597588 105602074 105399025
3866.2 105399025 105249458 105128304 105083031 105025757 105225471 105130669 105185768 105431404 105040855 105095322
3875.8 105095322 105352707 105408112 105453499 105385803 105225517 105002007 105012695 105171974 105310806 105423798
3885.4 105423798 105145988 105115189 105179802 105223274 105472603 105779533 105585144 105395622 105541672 105512909
3895.1 105512909 105176170 105007477 105217613 105351814 105106911 105153152 105293175 105447464 105559883 105378204
3904.7 105378204 105078476 105061745 105132286 105016914 105006622 104976776 104845787 105119583 105596992 105616440
3914.4 105616440 105286621 105186142 105344353 105396835 105137787 104871452 105084480 105088432 104899200 104992523
3924A04992523L8155l6873K40684j4999k51480n6328K7054J07765q4274J10588K42828
3934.6A05315643k06161k14676M4594K04735L0128j25565L8132K66617R3445k61963
3944.3A05184929L9200L2203j6677k4689j57700J38458p6461l59543q1253L05855J92909
3954.9A05177231L3150J4167k19116r056P2624P462R8671L9863M3000j29181r1591
3965.5A05037224o7322j23192Q7586j0453k4452N3772k54631j97029K09099K44484
3975.1A04955086K11937J38321j05645k40776m0435J86744K2095l769K6741j63216
3984.8A04987083j97723J24962L02383J05088K1164k24198j65687J88842M6547j94465
3994.4A04993996j91552n1635m5388O7528P9941N3566
$$ plain form
3924 104992523 105030678 104993805 105234489 105219490 104968010 104911682 104938736 105046501 104962227 105072815 105315643
3934.6 105315643 105109482 104894806 104939400 105144135 105174263 105048698 105086830 105353447 105446892 105184929
3944.3 105184929 105224129 105256332 105239655 105214966 105057266 105195724 105119263 104759720 104678467 104984322 105177231
3954.9 105177231 105210381 105224548 105005432 104996376 105069000 105076462 105175133 105214996 105257996 105128815 105037224
3965.5 105037224 104969902 104846710 104934296 104923843 104899391 104953163 104698532 104501503 104710602 104955086
3975.1 104955086 105167023 105305344 105199699 104958923 104918488 105105232 105127327 105123558 105150299 104987083
3984.8 104987083 104789360 104914322 105216705 105321793 105342957 105118759 104953072 105141914 105188461 104993996
3994.4 104993996 104802444 104750809 104705421 104772949 104852890 104906456
4000.2A04906456
$$ plain form
4000.2 104906456
##END=$$ End of the data block
