##TITLE=Pastilha KBr $$ Begin of the data block
##JCAMP-DX=5.00 $$ ACD/SpecManager v 10.08
##SPECTROMETER/DATA SYSTEM=Alpha
##DATE=23 Oct 2013 09:42:02
##DATA TYPE=INFRARED SPECTRUM
##DATA CLASS=XYDATA
##ORIGIN=
##OWNER=
##NPOINTS=1765
##FIRSTX=399.75695801
##LASTX=3997.56933594
##MAXX=3997.56933594
##MINX=399.75695801
##MAXY=0.92036647
##MINY=0.84695876
##XFACTOR=1.0000000000
##YFACTOR=1.000000000000000e-9
##FIRSTY=0.91735721
##DELTAX=2.03957629
##XUNITS=1/CM
##YUNITS=ARBITRARY UNITS
##XYDATA=(X++(Y..Y))
399.8I17357206J462937j372636k893924K171099N93364l038287K000213L924608m03226
418.1I19801354K85328K79784m063368j328170K730548j346469j718342K639949o03318
436.5I16677296k620816K134442O18100k765297J523375J499057k815664N75304L018200
454.8I17843997j772582j365066J849175j896978k239584K500653K74002k166032K099573
473.2I15127158R01699l066361O53148K251089k083064n39720K291322j513421j317144
491.5I12704706K726317l72947k336621K079249Q65936k869070Q22127J769841k420962
509.9I12968576k51830K575100j284063j415610K259194o18040k390206J924336R38118
528.3I14705575k490402R51648K029061k158105m44412K427399j370072j746119K199471
$$ plain form
399.8 917357206 918820143 917447507 914553583 916724682 917318046 914279759 916279972 920204580 919801354
418.1 919801354 920086682 920366466 916303098 914974928 917705476 916359007 914640665 917280614 916677296
436.5 916677296 914056480 916190922 916809022 914043725 915567100 917066157 914250493 914825797 917843997
454.8 917843997 916071415 914706349 916555524 914658546 912418962 914919615 915193617 913027585 915127158
473.2 915127158 916028857 912962496 913615644 915866733 913783669 913243949 915535271 914021850 912704706
491.5 912704706 915431023 915058076 912721455 914800704 915666640 912797570 913619697 915389538 912968576
509.9 912968576 912716746 915291846 914007783 912592173 914851367 914233327 911843121 913767457 914705575
528.3 914705575 912215173 913166821 915195882 913037777 912593365 915020764 913650692 911904573 914104044
546.6I14104044j0669k136707J537084R84192k343714M27544J801908j902044o74963
565I11786675K372504p30872j683534J788557K67506k084434R91821J035035k122462
583.3I11620796P7724J840770j406610q91566J877368p77662j891971J491904L70026
601.7I12310779k239764N91457J244426j956165l86774J745999j266540j402318J798153
620I10439253K1517j589239J593531J216828j847207L55780J833558j359403o36220
638.4I10028398K135813l69966j443743J784980O59048k035439O68526J432240j664698
656.7I11195159k24352J785040j286924j786292J642764K98739j604438J716017J280964
675.1I13016677j784146J22905J586258j560688r53257J888395n26011j882673J300097
$$ plain form
546.6 914104044 914093375 911956668 913493752 914477944 912134230 912561774 914363682 912461638 911786675
565 911786675 914159179 913428307 911744773 913533330 913800836 911716402 912708223 913743258 911620796
583.3 911620796 911698520 913539290 912132680 911241114 913118482 912340820 910448849 911940753 912310779
601.7 912310779 910071015 910662472 911906898 909950733 909563959 911309958 910043418 908641100 910439253
620 910439253 910460770 908871531 910465062 911681890 909834683 910190463 912024021 910664618 910028398
638.4 910028398 912164211 911794245 910350502 912135482 912794530 910759091 911427617 912859857 911195159
656.7 911195159 910970807 912755847 911468923 909682631 911325395 911624134 910019696 911735713 913016677
675.1 913016677 911232531 911355436 912941694 911381006 910427749 912316144 911790133 909907460 911207557
693.5I11207557O75499j937628L75510J345455j646816n87404J821697p77722j614630
711.8I08861518J476109M99129j741826P48515J262486j696348l32177J836955o98089
730.2I10216272j168609J563668J94550j652360Q98361J066745j601041q9466J500070
748.5I10928190j098097j054287J477182j73032j586199R77695P84874j570701J07824
766.9I08793449J369000j080036q58724J301050k97308j352728R43482N25594j484573
785.2I07859206K41399J164436j024067m81546J278162l95536j030863J142979N38349
803.6I09292519j109004N42760J031160r26315j55747J222670n11945q25107J089454
821.9I09650445J63376j147508N69999O48260j206040o5744J214981n74947o71208
$$ plain form
693.5 911207557 911883056 909945428 910320938 911666393 910019577 909432173 911253870 910476148 908861518
711.8 908861518 910337627 910836756 909094930 909843445 911105931 909409583 909077406 910914361 910216272
730.2 910216272 909047663 910611331 910805881 909153521 910051882 911118627 909517586 909428120 910928190
748.5 910928190 909830093 908775806 910252988 910079956 908493757 909471452 910256326 908685625 908793449
766.9 908793449 910162449 909082413 908223689 909524739 909227431 907874703 908818185 909343779 907859206
785.2 907859206 908100605 909265041 908240974 907759428 909037590 908642054 907611191 908754170 909292519
803.6 909292519 908183515 908726275 909757435 908831120 908675373 909898043 909386098 908560991 909650445
821.9 909650445 909813821 908666313 909236312 909884572 908678532 908612788 909827769 909252822 908581614
840.3I08581614J073659q1420j156688O68645N75066j229108k8789J028300p37667
858.7I08693612n65589J050055k38418j052916O85036K04503j351237K00152R88841
877I08614039p71343k56956J129806l75032q99494Q44300K24232j093626L75510O51359
897.4I08442795j148879l13580J059472n08487q34525Q51870j4961j219451M23789
915.8I06738043O66499j050711j82152R53079o57380p69019R13084m4764j141011M82976
936.2I05908644N09978j164794r7812R66072p48157p89464Q46982j89125j161695N10872
956.6I04591501M45306j173496j11044Q02338q16524o70492Q59678k75016j105547
974.9I02546704N35548L13282j209438m4942P68482q91864p17342P56204l40402j035392
$$ plain form
840.3 908581614 909655273 909573853 908417165 909085810 909660876 908431768 908402979 909431279 908693612
858.7 908693612 908128023 909178078 908939660 907886744 908571780 908776283 907425046 907625198 908614039
877 908614039 907842696 907585740 908715546 908340514 907441020 908285320 908509552 907415926 907791436 908442795
897.4 908442795 907293916 906980336 908039808 907531321 906696796 907548666 907533705 906314254 906738043
915.8 906738043 907404542 906353831 906171679 907124758 906467378 905698359 906611443 906566679 905425668 905908644
936.2 905908644 906418622 905253828 905156016 906122088 905373931 904584467 905431449 905242324 904080629 904591501
956.6 904591501 905036807 903863311 903752267 904554605 903738081 903067589 903927267 903652251 902546704
974.9 902546704 903082252 903395534 902186096 902141154 902909636 902017772 901300430 902056634 901716232 900680840
995.3I00680840O17385L39210j205385j25527N76258j016915p09474P34508m19379
1013.7H99471521j092612M76360J36375j208007M5896P23183q37803m87983Q72254
1032H98099184k61009q08358P70331M09424r26018J62661O93500p38740l00526R55224
1052.4H98055673k65062q92759N43654K05517r55820K01702O93321p97987m46379P39217
1072.8H97081077l70026q28266O20365K27929r72927J04189N74708p58648l13163P91013
1093.2H96156251l08156p14421O34730K41399q09670K47836O28353o75738k39432Q36730
1113.6H95997882j72913n22733P89344L93331p06553K53558O85454n11766j14083Q93175
1134H96984696j37806n60581O68049K97546p09951K43485O21855n66899k53797O81758
$$ plain form
995.3 900680840 901298225 901637435 900432050 900306523 900882781 899865866 899156392 899890900 899471521
1013.7 899471521 898378909 898855269 898991644 897783637 897829533 898552716 897714913 897226930 898099184
1032 898099184 897838175 897029817 897800148 898209572 897283554 897446215 898139715 897400975 897100449 898055673
1052.4 898055673 897790611 896897852 897441506 897647023 896691203 896892905 897586226 896788239 896341860 897081077
1072.8 897081077 896711051 895882785 896503150 896731079 895758152 895862341 896437049 895678401 895365238 896156251
1093.2 896156251 895848095 895133674 895768404 896009803 895200133 895447969 896076322 895400584 895161152 895997882
1113.6 895997882 895824969 895302236 896091580 896484911 895778358 896031916 896717370 896205604 896091521 896984696
1134 896984696 896846890 896286309 896954358 897251904 896541953 896785438 897407293 896840394 896586597 897268355
1154.4H97268355k22445o32643M38571J37686o72757K88844O66439l97384o7234P31290
1174.8H97538722j97411m83215O45459L31342n35786K51591M91679n43654j86980O22392
1195.2H97934139j65880l87013N74887J78873n99503K09808N04136m13835j22308N55515
1215.6H98268819k30670m54426M82142J81496m98771J99079L13640n69046j63257N35429
1236H98064435j98961m20093L82662J9133n92947J90377M06980m28438j54555L91245
1256.4H97659838k97367m23015L86775J24872l52919L32236L72410m45545o5804N04435
1276.8H97795916j39118k09331M85778N3405m41491K56240K68042m91380o1393M42087
1297.2H97958755k97546l88145L79443N9783m23133K03192K22743n18322q5175M82559
$$ plain form
1154.4 897268355 897045910 896413267 896851838 896989524 896316767 896605611 897272050 896874666 896807432 897538722
1174.8 897538722 897341311 896858096 897503555 897834897 897299111 897550702 898042381 897498727 897311747 897934139
1195.2 897934139 897768259 897381246 897956133 898135006 897535503 897745311 898249447 897835612 897713304 898268819
1215.6 898268819 898038149 897583723 898065865 898247361 897748590 897947669 898261309 897692263 897529006 898064435
1236 898064435 897865474 897445381 897828043 897847176 897254229 897444606 897851586 897423148 897268593 897659838
1256.4 897659838 897362471 896939456 897326231 897451103 897098184 897430420 897802830 897357285 897291481 897795916
1276.8 897795916 897656798 897447467 897933245 897986650 897545159 897801399 898069441 897578061 897516668 897958755
1297.2 897958755 897661209 897273064 897652507 897712290 897289157 897492349 897715092 897196770 897111595 897594154
1317.6H97594154k72870m55260K55763o4552m65989K52605L47077k60591K58982P07388
1338H97896707l71873p42078R5248p2122m83930J42694J73330m86135o3956N69641
1358.3H96657526J70887r8407p75m55678n94854K82705N23329m67003o14106l29674
1378.7H95073950j140475j107156N41746J052857K05040M88043Q86976J11282j00910
1397.1H96011353l8982p45952m24087K94149l22521o32703J95086M31835K47062P95364
1417.5H95810604L51548j060068p77960J16229N9307k97487O9082O25371L40164m50134
1437.9H94786656o24418o19650j84000O52909J77265n54979M40180J630187J294494
1456.2H96998644o35266j482368q21054o6340J22070J13726Q05795J302302m0352j354695
$$ plain form
1317.6 897594154 897321284 896866024 897121787 897057235 896591246 896843851 897190928 896930337 897189319 897896707
1338 897896707 897524834 896782756 896878004 896805882 896321952 896464646 896637976 896151841 896087885 896657526
1358.3 896657526 896828413 896730006 896729231 896273553 895678699 895961404 896484733 896017730 895403624 895073950
1378.7 895073950 893933475 892826319 893368065 894420922 894625962 895114005 896000981 896112263 896011353
1397.1 896011353 895972371 895226419 894802332 895096481 894773960 894141257 894336343 894768178 895015240 895810604
1417.5 895810604 896162152 895102084 894324124 894440353 894499660 894202173 894271255 894896626 895236790 894786656
1437.9 894786656 894162238 893542588 893358588 894011497 894188762 893633783 894073963 895704150 896998644
1456.2 896998644 896363378 894881010 894059956 893993616 894115686 894229412 895035207 896337509 896297157 894942462
1476.6H94942462p33852J75357k1279K65300J367212R21786p17819m29213O62386K59698
1497H96692038n21243k48730O53147K087713J535475j549602j799047q9526R30071
1515.4H97690296N80311N72801M77194q06033r85801n26369l95179J61350M99308L94762
1535.8H97662640J203894J713217l66569k079904j700521m25338Q404l2127R58085
1554.1H96941781K216160J608849j919866k590775j252592k07186N30482k65420o84559
1572.5H94376874N15401J69278j349271q26061l4809k93553l19361J70171j0192l96490
1592.9H92001987j61291j75714n29111k79247l8147m15862m31776j49488l81053j67251
1613.3H89273047N84484k03133j177013k25365K50935n36739o98507l14594K13862
$$ plain form
1476.6 894942462 894208610 894383967 894362688 894627988 895995200 896916986 896199167 895769954 896432340 896692038
1497 896692038 896170795 895922065 896575212 898662925 900198400 898648798 896849751 896760225 897690296
1515.4 897690296 898270607 898843408 899320602 898514569 897528768 897002399 896607220 896768570 897267878 897662640
1535.8 897662640 898866534 900579751 900213182 898133278 896432757 896007419 896015823 895983696 896941781
1554.1 896941781 899157941 900766790 898846924 896256149 895003557 894796371 895326853 895061433 894376874
1572.5 894376874 894892275 895061553 893712282 892886221 892851412 892557859 892238498 892408669 892398477 892001987
1592.9 892001987 891840696 891664982 891135871 890856624 890818477 890402615 889970839 889821351 889440298 889273047
1613.3 889273047 889857531 889654398 888477385 888252020 888502955 887966216 887267709 886953115 887166977
1631.6H87166977J154602J111209p95484j335025n3286J393616J456559J24514L92020
1650H90615702J413941o17206k114713q58546K10584O88016M52578M65453J127958
1668.4H91383767R32098P6472j19209j69635N782Q09550J728237O40511j498162j126349
1688.8H92663062q2255O31869J216710J427114Q78811q40724j229703l10302n92530
1707.1H93762052o69300L45289J058161J106084L11315j232982j430690m42565J74523
1725.5H92981887K07126N64098J302302P44283r49740n45621J43349l06427j87516
1743.8H93953741N06997O29842J02460n23567o18398l09467O5505K31385k21610l37958
1764.2H93478930L31581N91635N58973K00927q04901q77440k4200K16484k54273k59280
$$ plain form
1631.6 887166977 888321579 889432788 888637304 887302279 887248993 888642609 890099168 890223682 890615702
1650 890615702 892029643 891412437 889297724 888439178 888649762 889337778 889790356 890255809 891383767
1668.4 891383767 892315865 892392337 892273128 892103493 892109275 892918825 894647062 895287573 893789411 892663062
1688.8 892663062 892580807 893212676 894429386 895856500 896735311 895894587 894664884 894354582 893762052
1707.1 893762052 893092752 893438041 894496202 895602286 895913601 894680619 893249929 892807364 892981887
1725.5 892981887 893189013 893753111 895055413 895799696 894849956 894304335 894447684 894141257 893953741
1743.8 893953741 894460738 895090580 895193040 894669473 894051075 893741608 893807113 894038498 893816888 893478930
1764.2 893478930 893810511 894402146 894961119 895162046 894357145 893479705 893455505 893671989 893417716 893158436
1784.6H93158436N2810L12805O34968L08335n62310n48244J41442J35243n01514l34620
1805H92797351K35677J31070k24769j81556j22249j85847O9082L52621K53916J56581
1825.4H93281877L07977Q703n85199l62694q7798k57671P4804O88672M43876k80082
1845.8H93232465m09723m81903m47929l994J05441q8692R2924K11239L5286L23057
1866.2H92568171M85063l57032p18892j46270l2186l17216q1420J89006N305J30057
1886.6H91724586L99292j01149m56274n7697J4186k19643J3113J80483j50562j73449
1907H91172886J44958k1338j75655K80380L35038k66790k55526L2247k07663k23517
1927.4H90815020J05083j8239k94030m1664J97888J22249J85489R4474l36468l93928
$$ plain form
1784.6 893158436 893211246 893524051 894159019 894467354 893905044 893356800 893498242 893633485 893131971 892797351
1805 892797351 893033028 893164098 892939329 892757773 892635524 892449677 892518759 892871380 893125296 893281877
1825.4 893281877 893589854 893598557 893013358 892650664 892562866 892305195 892379999 893068671 893512547 893232465
1845.8 893232465 892822742 892340839 891892910 891888916 891994357 891905665 891998589 892209828 892245114 892568171
1866.2 892568171 893053234 892696202 891977310 891831040 891798854 891481638 891400218 891589224 891594529 891724586
1886.6 891724586 892123878 892022729 891566455 891508758 891522944 891303301 891316414 891496897 891346335 891172886
1907 891172886 891317844 891296506 891120851 891401231 891736269 891469479 891213953 891246200 891038537 890815020
1927.4 890815020 890920103 890901864 890607834 890566170 890764058 890886307 891071796 891166270 890829802 890435874
1947.8H90435874J2935J21236n6208K5273K5272k61664j82808K18213J78099r0957
1968.2H90425265m0353r3817l13282j12176J54197Q225l0994J37270m888j43588J01209
1990.6H90087068P7725k36035j19686N3942j59025k00808P1049R6559l3200O4850O1632
2013H89764071j47820j06692N1140n1856q8751P0155l1650k32816o6459R7334l2246
2035.5H89224410j1265J26421o9558k36929j2398J00255k8312P928L6656j74343j92106
2057.9H88770759P6890J32620L756M410n1796k04981j19686O2943J4543m2498L8088
2080.3H88685048k6644j52409j8596J16467j788o8963l4630j27673j46568O0618J41382
2102.8H88426244O140l9876l8326j32918r3758R7453R7752l6597l5942m0233j25468
$$ plain form
1947.8 890435874 890448809 890570045 890513837 890539110 890564382 890302718 890119910 890338123 890516222 890425265
1968.2 890425265 890384912 890291095 889977813 889865637 890019834 890028059 889997065 890134335 890129447 889985859 890087068
1990.6 890087068 890164793 889928758 889809072 889863014 889703989 889503181 889574230 889670789 889637589 889702439 889764071
2013 889764071 889616251 889509559 889560699 889508843 889420092 889490247 889458597 889225781 889159322 889256656 889224410
2035.5 889224410 889213145 889339566 889270008 889033079 889020681 889120936 889092624 889100552 889137208 888962865 888770759
2057.9 888770759 888847649 888980269 888984025 888988435 888936639 888731658 888611972 888674915 888689458 888646960 888685048
2080.3 888685048 888658404 888505995 888487399 888603866 888602078 888533115 888498485 888370812 888224244 888284862 888426244
2102.8 888426244 888432384 888392508 888354182 888221264 888127506 888224959 888322711 888286114 888250172 888209939 888084471
2125.2H88084471m9889J08242O1095m7326j6868n1141j38581j1682J22010P332r5010
2147.7H87972653o0499j02520j14322O2347J25468l5942r5427m3571q1539o5386R6261
2170.1H87657523J14262o1035j05500m5598q1181l8207J01447N1201r7096p7367k0742
2192.5H87397707m7923J5557J06871n36j34111q8572l0100l9399J9133O1452l7253
2215H87222826r4711n2035p6950p9214O3419R4473n7995o9857P928p0691p3493Q1301
2239.4H86895001N7161j02759r8705j1027p748K3245R9481L1471j04606p1705q702
2261.9H86701107k9862O3479J36495j4842j34766r0122p6473o5207N9366Q2493m1843
2284.3H86589825n1915L5762O9142J63436K89917K03192N4002Q8632J65105K35557
$$ plain form
2125.2 888084471 888034582 888142824 888203919 888156593 888139725 888088584 887950003 887938321 888060331 888067663 887972653
2147.7 887972653 887912154 887809634 887695312 887757659 887883127 887847185 887751758 887708187 887626648 887561262 887657523
2170.1 887657523 887771785 887710750 887605250 887559652 887478471 887440264 887541711 887592912 887495816 887418449 887397707
2192.5 887397707 887349784 887365341 887472212 887471676 887337565 887248993 887218893 887179494 887198627 887260079 887222826
2215 887222826 887128115 887076080 886999130 886919916 886983335 887077808 887019813 886949956 886957884 886887193 886813700 886895001
2239.4 886895001 886952162 886849403 886750698 886739671 886731923 886755168 886854649 886886120 886781514 886709809 886701107
2261.9 886701107 886671245 886734724 886871219 886856377 886721611 886631489 886555016 886489809 886549175 886631668 886589825
2284.3 886589825 886537910 886573672 886642814 886806250 887096167 887299359 887353361 887441993 887607098 887842655
2304.7H87842655M32193N43476L28481P0572J27136L89815O07252O74486M73380J25051
2325.1H91614497j0908P4148J32442J98841L36945K23279j46449l86953n64039p28249
2345.5H90743554k27511N98967R60231Q06331O09517M37260J99139R2983k10642q18551
2365.9H93191278j196921j171410j045704q98898p44640p88331r03607p86125n20468
2384.2H85135174l05951r5665N5372m4822j67251q4817k5332n6684K2053Q6546m9173
2406.7H84469450j29819n5015m6015k4855J02520P8737j17719j62959o4611l5823J4842
2429.1H84028733J02460P630j51277j17064l1352k1457M2438Q9169k1875j06871o4612
2451.5H83755922n2154l5286N1380K1100j21356j38938o1870l1769L3379J18792K8550
$$ plain form
2304.7 887842655 888274848 888818324 889146805 889217377 889344513 889734328 890341580 891016066 891489446 891614497
2325.1 891614497 891603589 891677737 891810179 892009020 892345965 892569244 892422795 892035842 891471803 890743554
2345.5 890743554 890516043 891115010 892075241 892881572 893491089 893928349 894127488 894220471 894009829 893191278
2365.9 893191278 891994357 890822947 889777243 888878345 888133705 887345374 886441767 885655642 885135174
2384.2 885135174 884829223 884733558 884788930 884744108 884576857 884492040 884466708 884410024 884432077 884518623 884469450
2406.7 884469450 884339631 884284616 884238601 884213746 884316266 884395003 884277284 884114325 884049714 884013891 884028733
2429.1 884028733 884131193 884138823 883987546 883870482 883839130 883817673 883860111 883949280 883927405 883820534 883755922
2451.5 883755922 883703768 883668482 883719862 883740962 883619606 883480668 883418798 883387029 883420408 883539200 883567750
2474H83567750j38461j26541l9518j8835L8326N9068n9068j30296o7532k9087l0458
2496.4H83025348N0724P9930o7771j61230r8348l5226K0384O2943k3067j33515q8989
2518.9H82631183q464j1623P450K0206o4849j15931n0486L100K5988P2062J2397j51097
2543.3H82369936j80841n6028J8119L7373O7889M77j13189j01686l9637k8372K3127
2565.8H81997168O9737m2974j63317r9480j2338q107M0770M5299q2731j45316q8394
2588.2H81510317k0086M9293P7664j1742r4413n9009k8789m4048l219L9995l1769j09673
2612.7H81274521p5519m3630j3709Q5115O2823j24991j93178p5758J9849L9458N2571
2635.1H81007552J7882o9678r8050p0274l7193L5882N3823o1929j35899o1691p689
$$ plain form
2474 883567750 883429289 883302748 883263230 883244395 883282721 883341789 883282721 883152425 883084893 883055806 883025348
2496.4 883025348 883076072 883156002 883088231 882927001 882828653 882793427 882813811 882876754 882853687 882720172 882631183
2518.9 882631183 882622719 882611096 882618546 882638752 882573903 882457972 882407486 882410586 882436574 882508636 882521033 882369936
2543.3 882369936 882189095 882133067 882151186 882188559 882256448 882256925 882143736 882042050 882002413 881974041 881997168
2565.8 881997168 882066905 882023931 881860614 881761134 881748796 881740689 881781459 881826758 881744027 881598711 881510317
2588.2 881510317 881490231 881539524 881617188 881605446 881511033 881452024 881423235 881379187 881375968 881415963 881384194 881274521
2612.7 881274521 881199002 881155372 881141663 881226778 881289601 881164610 880971432 880895674 880915523 880954981 881007552
2635.1 881007552 881025434 880955756 880857706 880787432 880750239 880786121 880839944 880778015 880642116 880580425 880572736
2657.5H80572736l1888P748J5498q6308j06990l3081K265J9133N7221R179j12117j26779
2682H80186617p6294o0141K0564R1135j6927j28985q2373m3631n0962M2856Q5652o5625
2706.5H79901886j42038o6519l8623Q702Q4758J3053r3102n9724J2099j4543m4346
2728.9H79561603N186m2737j32739p9275l4511m1246M1425J08779K2351r7513j40428
2751.4H79170895j36197n6982M9353J4662j19984j30653m3094o616M3749J05799L8027
2773.8H78928959j16229j54435q1003l5346K8074J03533O1989q4221j81615j34170
2794.2H78335536J2457P7605q4340k53380j67727J0073N9128N603p3016j54734j75893
2816.6H77591312q3447l7372p7784l1650j0490j27673j77324p0214L4868P1168k9027
$$ plain form
2657.5 880572736 880540848 880548596 880564094 880477786 880370796 880337715 880339980 880359113 880416334 880425513 880313396 880186617
2682 880186617 880110323 880050182 880070746 880161881 880144954 880015969 879933596 879889965 879839003 879881859 879967511 879901886
2706.5 879901886 879759848 879693329 879654706 879663408 879748166 879761219 879668117 879608393 879620492 879605949 879561603
2728.9 879561603 879566789 879524052 879391313 879312038 879277527 879236281 879277706 879386485 879408836 879311323 879170895
2751.4 879170895 879034698 878977716 879027069 879041731 878921747 878791094 878748000 878741384 878785133 878890932 878928959
2773.8 878928959 878812730 878658295 878577292 878541946 878570020 878673553 878735542 878651321 878469706 878335536
2794.2 878335536 878347993 878425598 878341258 878087878 877920151 877930224 877989352 877994955 877921939 877767205 877591312
2816.6 877591312 877507865 877470493 877392709 877361059 877350569 877222896 877045572 876975358 877010226 877081394 877052367
2839.1H77052367l08693m66287l74317k89440l05593k50638q2671J8179P8559J75416
2859.5H75246882J94848J48654J28329O9797J4245J11282R2864j98424k77936p0453
2879.9H75460088k6464j54674j75715o1571q345k1577K7835m0650k76089l25143j81675
2902.3H74216020j25170j18434r0778p8261r6023k48790m89473n43773l51012j44958
2922.7H71929348o9798P8440L00110K38239O9201J22667J66535J27196K45572L89218
2943.1H73596728K86937L4451j21832r6082r6441j76489j37448J3053J40488Q9884
2963.5H73533249n6684j8239J16289J90973K71678K64764J43110M6552o2585j64032
2983.9H74265075j18912N5969K26915J80543m7028r8408m9472p7605k6345j8120r5785
$$ plain form
2839.1 877052367 876743674 876277387 875903070 875613630 875308037 875057399 874974728 874992907 875071466 875246882
2859.5 875246882 875441730 875590384 875718713 875788510 875802755 875914037 876006901 875808477 875530541 875460088
2879.9 875460088 875433624 875278950 875103235 875041664 875033319 875011742 875039577 874998927 874722838 874397695 874216020
2902.3 874216020 874090850 873972416 873881638 873803377 873707354 873458564 872969091 872425318 872074306 871929348
2922.7 871929348 871859550 871937990 872238100 872476339 872545540 872668207 872834742 872961938 873207510 873596728
2943.1 873596728 873883665 873918116 873796284 873700202 873603761 873427272 873289824 873302877 873443365 873533249
2963.5 873533249 873476565 873458326 873574615 873765588 874037266 874302030 874445140 874491692 874429107 874265075
2983.9 874265075 874146163 874202132 874429047 874609590 874562562 874464154 874414682 874337077 874310732 874292612 874196827
3006.3H74196827P8857L92437L41773L875j88589k35200k58804j50382m0949r7930
3026.7H74041915j6332J70291J24156r0122k20358l5704K24650J51754j20998k66373
3047.1H73962879j46687j8537j07825j28686p5817j59681j51277M0353J66535M4525
3067.5H73425782j76668k06471p7605J56402L66569J81913j56521k10584k09927k34962
3087.9H72857928j60157j85728k54214j12832J14560J07348j48654k16782L9935J23441
3108.3H72164845o1750O974K68578K26140j8716k76505n11229m38273j25945m590j29461
3130.7H71100068k26617j41859P0870J57476r1017l44693k85626j17957N5313K17318
3151.1H70393276M6969l61324m45902k25663j04308r4951o2108q5592j87337k17140
$$ plain form
3006.3 874196827 874275684 874668121 875009894 875013769 874825180 874589980 874331176 874180794 874139845 874041915
3026.7 874041915 874025583 874195874 874320030 874229908 874009550 873973846 874198496 874350250 874229252 873962879
3047.1 873962879 873816192 873797655 873689830 873561144 873485327 873325646 873174369 873214722 873381257 873425782
3067.5 873425782 873249114 873042643 872965038 873121440 873488009 873669922 873513401 873302817 873092890 872857928
3087.9 872857928 872697771 872512043 872257829 872144997 872259557 872366905 872218251 872001469 872041404 872164845
3108.3 872164845 872103095 872110069 872378647 872604787 872586071 872309566 871798337 871360064 871234119 871229529 871100068
3130.7 871100068 870873451 870731592 870802462 870959938 870868921 870524228 870238602 870120645 870175958 870393276
3151.1 870393276 870440245 870078921 869633019 869407356 869303048 869208097 869145989 869060397 868873060 868655920
3171.5H68655920j43290p1466m0352n0425j14859j61886j50859j42872j75596j63197
3191.9H67441118r3222j29223k01106j55687r3877r4355r7513j04010j50263j81020
3212.3H66140842j74462j47879o2466k1756j05679j89245k13801j51575N3942J97053
3232.7H65324974o6638m36068m12046k11299q2612O8486Q2791j68383l05415j52707
3253.1H63641083o8426k07007k60114j29700r0838j27732K3126K38657R2268k44617
3273.5H62866700l73364l98755l36170j89245j16348q7440j073J56999J72972o2465
3293.9H61631811l04699m33684l51429L2962L55243J95623k86520o14285n95629l63171
3314.3H59266222j88172k12789k68757j76728q0466k14637l79979l25144k23398j38223
$$ plain form
3171.5 868655920 868512630 868441164 868400812 868350387 868235528 868073642 867922783 867779911 867604315 867441118
3191.9 867441118 867347896 867218673 867017567 866861880 866768003 866673648 866576135 866472125 866321862 866140842
3212.3 866140842 865966380 865818501 865756035 865734279 865628600 865439355 865225554 865073979 865127921 865324974
3232.7 865324974 865258336 864822268 864410222 864198923 864116311 864184797 864267588 864099205 863793790 863641083
3253.1 863641083 863572657 863365650 863105536 862975836 862884998 862757266 862780392 863019049 863111317 862866700
3273.5 862866700 862493336 862094581 861758411 861569166 861452818 861365378 861364305 861521304 861694276 861631811
3293.9 861631811 861327112 860893428 860541999 860574961 860930204 861125827 860839307 860225022 859629393 859266222
3314.3 859266222 859078050 858865261 858596504 858419776 858339310 858124673 857744694 857419550 857196152 857057929
3334.7H57057929j3173r6976l19660l52264l38792k93434o9022r7811m83573n66006
3355.1H54427218k91705j61349k23339k05755l2425M0471j52230m79460o35147m76420
3375.5H51809859k98977l01838l30686k60234j87337r1195J93297K06471k98143m65452
3395.9H49975765m173K19107k34187o56366m84645j42813j1563o1095k61962l48092
3416.3H47989976j30951m0948j91212j25051P3135J05381N1737O6936J19984k384k50995
3438.7H47665608l34859k20597n245O7115j01507j11759L0876K5749O0677J90795J22368
3461.1H47389221M4882K84553M40478P6056l68416l23356l8921K02238L17514P0691
3481.5H48094940j25527P7963J44481k8550J6391K18809K45869J56700K35677L05951
$$ plain form
3334.7 857057929 857044756 856947780 856628120 856275856 855937064 855643630 855574608 855476797 854993224 854427218
3355.1 854427218 854135513 853974164 853750825 853545070 853512645 853553116 853400886 852921426 852286279 851809859
3375.5 851809859 851510882 851209044 850878358 850618124 850430787 850339592 850532889 850739360 850441217 849975765
3395.9 849975765 849971592 850190699 849956512 849300146 848815501 848672688 848661125 848600030 848338068 847989976
3416.3 847989976 847859025 847818077 847626865 847501814 847574949 847680330 847732067 847799003 847918987 847916603 847665608
3438.7 847665608 847330749 847110152 847104907 847172022 847070515 846958756 846989632 847015381 847076058 847266853 847389221
3461.1 847389221 847434103 847718656 848159134 848235190 847866774 847543418 847504497 847706735 848024249 848094940
3481.5 848094940 847969413 848047376 848191857 848163307 848179698 848398507 848644376 848801076 849036753 849342704
3501.9H49342704p630k29060k8908R7572J49429J99616N3227K8551L16381N26607K92480
3524.4H50740969o2227q8036m7028L6776L26156L02852K7299K67148P08580N55277
3544.7H52767766l0518k46882m292O0022n6148O0916L51489N54383O41465O48081K70367
3567.2H55016649l76165n42820j85191J96397K77758K72154M90785Q54194R24886K77280
3587.6H57205927l83436j92464J66238K17020K38240J84238M9949K35021N27918M52340
3608H58700991K31921J80126K32160L77357L28362j01209k34127K71618Q77559P08223
3628.4H61572981l23415o76274l69966j12295J8537J14917M53175J069962J455784
3646.7H63203406Q73268n52177j083792n55515j13130r9361j98125j28329L38495Q53180
$$ plain form
3501.9 849342704 849335074 849106014 849077106 849174678 849324107 849523723 849576950 849605501 849921882 850448489 850740969
3524.4 850740969 850678742 850590706 850543678 850580454 850906610 851209462 851236761 851503909 852212489 852767766
3544.7 852767766 852737248 852490366 852486074 852546096 852489948 852550864 852902353 853456736 854098201 854746282 855016649
3567.2 855016649 854640484 854097664 853912473 854108870 854386628 854658782 855149567 856003761 856928647 857205927
3587.6 857205927 856822491 856630027 856796265 857013285 857251525 857435763 857485712 857720733 858248651 858700991
3608 858700991 858932912 859113038 859345198 859722555 860050917 859949708 859715581 859987199 860864758 861572981
3628.4 861572981 861249566 860573292 860203326 860091031 860109568 860224485 860677660 861747622 863203406
3646.7 863203406 864076674 863524497 862440705 861885190 861772060 861672699 861474574 861346245 861684740 862537920
3667.1H62537920Q18730M50253M04060L0101q02041q96036m75109J63794Q91149J173794
3687.5H64296615L92735p79986r12965l25739J64807K24888k8789j00911K75076P15673
3707.9H63921404O52313j75536q03351m81188J45733M75824L65734P7307j07228J2397
3728.3H64083409N05030J018167O90162m55618p56263p6175L65019J43826n8711O8486
3748.7H65527332k90573q69095o83248k34902j52409k92182k00808N7220J73927m2320
3769.1H62992942m28676m23134k2888L28243K72512j42574l41892k76208k00868j13368
3789.5H61644089R1851M21822N82576M64678L16143L0756k78235l28839m78208m59969
3809.9H62006664N9963N77628O47724M87149J97470n21779q02875l97146l3497J79231
$$ plain form
3667.1 862537920 863356650 863806903 864210963 864241064 863439023 862542987 862067878 862231672 863122821 864296615
3687.5 864296615 864689350 863909364 862996399 862670660 862835467 863060355 863031566 862930655 863205731 863921404
3707.9 863921404 864573717 864398181 863594830 863113642 863259375 863735199 864100933 864178240 864071012 864083409
3728.3 864083409 864588439 865606606 866296768 865841150 865084887 865008712 865373731 865517557 865458846 865527332
3748.7 865527332 865236759 864367664 863684416 863449514 863297105 863004923 862804115 862861335 863035262 862992942
3769.1 862992942 862564266 862141132 862118244 862446487 862718999 862576425 862234533 861958325 861757457 861644089
3789.5 861644089 861735940 862157762 862740338 863205016 863521159 863551915 863273680 862944841 862466633 862006664
3809.9 862006664 862066627 862644255 863291979 863779128 863976598 863454819 862651944 862254798 862221301 862400532
3830.3H62400532L78728O23703N46276j19090o46949o83188n75125j70231O04391J136839
3850.7H63495886N17488q95023j006246l17395K06053L35157J32263Q3745J46865j15335
3871.1H62583458m55916m47273o9499L00050K60055P5519j47164l30627j28090q4817
3891.5H61555696k64824L4869N27382O16312K13504m62115r13859p60615l36706o855
3911.9H60202789K58446L47912N2452k29120j34051m649r8765r6202J04368N8234k13027
3934.3H60248387k32399n9068P0810J19925N7697j9073m7863j12414k09987k06232
3954.7H59609783l6180P2598k086n6267m6968r8348j12176R239M0650n8174o4254k3067
3979.2H59234750j1027K7061O616j05202j45495q4639p0154n3883Q762
$$ plain form
3830.3 862400532 862779260 863402963 863949239 863830149 863183200 862500012 861924887 861754656 862359047 863495886
3850.7 863495886 864013374 863118351 862112105 861794710 862000763 862335920 862468183 862551928 862698793 862583458
3871.1 862583458 862127542 861680269 861610770 861910820 862170875 862246394 862099230 861768603 861640513 861555696
3891.5 861555696 861290872 861325741 861853123 862469435 862682939 862220824 861306965 860546350 860209644 860202789
3911.9 860202789 860461235 860809147 860861599 860632479 860498428 860493779 860395014 860298812 860403180 860461414 860248387
3934.3 860248387 860015988 859956920 860027730 860147655 860205352 860186279 860138416 860026002 859816015 859609783
3954.7 859609783 859573603 859646201 859644115 859587848 859540880 859442532 859330356 859339595 859380245 859322071 859257817 859234750
3979.2 859234750 859223723 859250784 859257400 859152198 859006703 858922064 858851910 858798027 858806789
3997.5H58806789
$$ plain form
3997.5 858806789
##END=$$ End of the data block
