##TITLE=PANI.HCl $$ Begin of the data block
##JCAMP-DX=5.00 $$ ACD/SpecManager v 10.08
##SPECTROMETER/DATA SYSTEM=Alpha
##DATE=13 Oct 2014 08:12:08
##DATA TYPE=INFRARED SPECTRUM
##DATA CLASS=XYDATA
##ORIGIN=
##OWNER=
##NPOINTS=1765
##FIRSTX=399.76428223
##LASTX=3997.64306641
##MAXX=3997.64306641
##MINX=399.76428223
##MAXY=0.32222694
##MINY=0.19887546
##XFACTOR=1.0000000000
##YFACTOR=1.000000000000000e-9
##FIRSTY=0.32222694
##DELTAX=2.03961372
##XUNITS=1/CM
##YUNITS=ARBITRARY UNITS
##XYDATA=(X++(Y..Y))
$$ plain form
399.8 322226942 321251929 320404738 319928437 320217520 320777446 320851743 320740402 320946932 321200997 321223289
420.2 321223289 321237683 321032971 320375264 319668770 319236934 318993419 318611234 317801297 316793323 315880954
440.6 315880954 314958483 313979357 312951028 311885685 310983002 310212195 309417218 308615535 307689756
458.9 307689756 306579441 305392027 304221481 303084970 302088112 301388979 300637603 299590409 298557967
477.3 298557967 297682315 296853364 295897394 294749767 293563575 292457283 291297466 289976895 288548172
495.6 288548172 287093580 285802424 284826666 284177810 283840269 283903629 284450889 285340577 286423266
514 286423266 287841946 289523721 291054517 292486727 293994993 295234680 295823991 295856625 295551121
532.3 295551121 295049548 294481069 293918937 293347716 292705387 292016774 291361481 290751129 290136665 289458215
$$ packed form
399.8C22226942r75013q47191m76301K89083N59926P4297j11341K06530K54065K2292
420.2C21223289J4394k04712o57707p06494m31836k43515l82185q09937j007974r12369
440.6C15880954r22471r79126j028329j065343r02683p70807p94977q01683r25779
458.9C07689756j110315j187414j170546j136511r96858o99133p51376j047194j032442
477.3B98557967q75652q28951r55970j147627j186192j106292j159817j320571j428723
495.6B88548172j454592j291156r75758o48856l37541O3360N47260Q89688J082689
514B86423266J418680J681775J530796J432210J508266J239687N89311L2634l05504
532.3B95551121n01573n68479n62132n71221o42329o88613o55293o10352o14464o78450
$$ plain form
552.7 289458215 288702101 287950426 287254840 286561221 285841733 285145283 284555286 284034848 283443600 282767951
573.1 282767951 282061100 281386882 280783594 280193686 279672801 279292911 279093683 279157370 279342562 279469907
593.5 279469907 279576272 279772580 280151576 280751497 281444579 281876832 281805158 281325728 280610979 279719651
613.9 279719651 278782278 278037310 277580529 277314246 277099162 276855558 276565522 276234627 275901049 275649637
634.3 275649637 275478184 275327086 275216937 275148898 275095075 275067747 275039017 274963588 274878800 274745256 274496466
656.8 274496466 274233133 274035007 273875922 273714632 273464531 273233265 273230761 273184091 272936016 272610724
677.2 272610724 272301793 272025168 271799237 271571219 271280110 270935804 270595223 270278782 269925743 269498140
697.5 269498140 269048542 268669397 268396020 268278062 268422902 268838644 269443333 270089537 270603627 270937353
$$ packed form
552.7B89458215p56114p51675o95586o93619p19488o96450n89997n20438n91248o75649
573.1B82767951p06851o74218o03288n89908n20885l79890j99228O3687J85192J27345
593.5B79469907J06365J96308L78996N99921O93082M32253p1674m79430p14749q91328
613.9B79719651r37373p44968m56781k66283k15084k43604k90036l30895l33578k51412
634.3B75649637j71453j51098j10149o8039n3823k7328k8730p5429q4788j33544k48790
656.8B74496466k63333j98126j59085j61290k50101k31266k504m6670k48075l25292
677.2B72610724l08931k76625k25931k28018k91109l44306l40581l16441l53039m27603
697.5B69498140m49598l79145k73377j17958J44840M15742O04689O46204N14090L33726
$$ plain form
717.9 270937353 271101534 271076977 270867348 270475000 269977659 269518882 269129664 268746674 268310845 267839164
738.3 267839164 267411321 267016381 266601354 266214699 265853405 265467525 265094012 264737904 264345884 263910979
758.7 263910979 263482511 263097048 262752235 262374431 261890948 261379808 260906786 260376275 259731740 259032547
779.1 259032547 258339673 257662326 256956130 256180137 255361885 254629403 254088879 253712922 253458440 253371239
799.5 253371239 253520697 253935397 254547477 255182713 255708098 256087154 256375581 256679535 257047325 257528782
819.9 257528782 258268803 259394199 260869801 262513518 264102817 265542567 266872942 268058896 269008100
838.3 269008100 269706607 270156562 270414174 270599395 270706981 270655364 270479053 270275146 270053536 269752055
858.7 269752055 269306570 268687248 267943561 267147005 266328424 265512526 264758110 264168739 263807625 263672411
$$ packed form
717.9B70937353J64181k4557k09629l92348m97341m58777l89218l82990m35829m71681
738.3B67839164m27843l94940m15027l86655l61294l85880l73513l56108l92020m34905
758.7B63910979m28468l85463l44813l77804m83483n11140m73022n30511o44535o99193
779.1B59032547o92874o77347p06196p75993q18252p32482n40524l75957k54482q7201
799.5B53371239J49458M14700O12080O35236N25385L79056K88427L03954L67790M81457
819.9B57528782P40021J125396J475602J643717J589299J439750J330375J185954R49204
838.3B69008100O98507M49955K57612J85221J07586n1617j76311k03907k21610l01481
858.7B69752055m45485o19322p43687p96556q18581q15898p54416n89371l61114j35214
$$ plain form
879.1 263672411 263801306 264222026 264857590 265516520 265930057 265924394 265514970 264877200 264206648 263549924
899.5 263549924 262901932 262308508 261766285 261223465 260668159 260097623 259533763 259039462 258598626 258152634
919.9 258152634 257711530 257298946 256942689 256673753 256438017 256144255 255764902 255334258 254907101 254504591
940.3 254504591 254109114 253709108 253322095 252983660 252683759 252354890 251990527 251645654 251341075 251044124
960.7 251044124 250711292 250361532 250017673 249662861 249275029 248828456 248337150 247827157 247310534 246791735
981.1 246791735 246252149 245701849 245201200 244825289 244607866 244528741 244543910 244555742 244455427 244198412
1001.4 244198412 243805617 243356138 242915869 242480874 242040664 241612598 241194472 240756199 240301445 239870504
1021.8 239870504 239459291 239027455 238573268 238132313 237721235 237330928 236961886 236619174 236290887 235939294
$$ packed form
879.1B63672411J28895M20720O35564O58930M13537n663m09424o37770o70552o56724
899.5B63549924o47992n93424n42223n42820n55306n70536n63860m94301m40836m45992
919.9B58152634m41104m12584l56257k68936k35736k93762l79353m30644m27157m02510
940.3B54504591l95477m00006l87013l38435k99901l28869l64363l44873l04579k96951
960.7B51044124l32832l49760l43859l54812l87832m46573m91306n09993n16623n18799
981.1B46791735n39586n50300n00649l75911k17423p9125J5169J1832j00315k57015
1001.4B44198412l92795m49479m40269m34995m40210m28066m18126m38273m54754m30941
1021.8B39870504m11213m31836m54187m40955m11078l90307l69042l42712l28287l51593
$$ plain form
1042.2 235939294 235555410 235177591 234801054 234385774 233942971 233516991 233110279 232692569 232277915 231894180
1062.6 231894180 231524125 231162608 230807468 230424315 229998901 229548559 229099572 228676260 228278741 227880210
1083 227880210 227457628 227003708 226534083 226077855 225627840 225145936 224635482 224132091 223628223 223103791
1103.4 223103791 222588301 222084776 221549302 221023783 220602348 220274016 219973177 219698951 219480708 219343007
1123.8 219343007 219305173 219368637 219514057 219700381 219899520 220140487 220474228 220882595 221363351 222004324
1144.2 222004324 222850978 223907769 225195959 226721495 228471547 230398238 232426569 234466225
1160.5 234466225 236403897 238173276 239775717 241273761 242772430 244328514 245987967 247834310
1176.9 247834310 249960929 252500445 255555809 259124488 263149679 267398983 271343410 274310261
$$ packed form
1042.2B35939294l83884l77819l76537m15280m42803m25980m06712m17710m14654l83735
1062.6B31894180l70055l61517l55140l83153m25414m50342m48987m23312l97519l98531
1083B27880210m22582m53920m69625m56228m50015m81904n10454n03391n03868n24432
1103.4B23103791n15490n03525n35474n25519m21435l28332l00839k74226k18243j37701
1123.8B19343007l7834O3464J45420J86324J99139K40967L33741M08367M80756O40973
1144.2B22004324Q46654J056791J288190J525536J750052J926691K028331K039656
1160.5B34466225J937672J769379J602441J498044J498669J556084J659453J846343
1176.9B47834310K126619K539516L055364L568679M025191M249304L944427K966851
$$ plain form
1193.2 274310261 275703996 275286406 273341864 270494789 267392039 264470965 261908352 259711087
1209.5 259711087 257814676 256144345 254631370 253218025 251849085 250497103 249173224 247872457
1225.8 247872457 246595919 245378077 244262248 243293375 242504910 241916761 241560295 241468236 241638586
1244.2 241638586 242022261 242556065 243191257 243871212 244526893 245107725 245600671 246010527 246336848 246576995
1264.6 246576995 246712402 246704534 246494949 245994627 245136991 243962988 242588356 241104186 239601701
1282.9 239601701 238184690 236871123 235632166 234489515 233486354 232667565 232086346 231784746 231802210
1301.3 231802210 232191101 232994631 234207034 235776827 237643674 239720896 241887316 244055346 246137977
1319.6 246137977 248024210 249652699 250994682 252068043 252954125 253742218 254469842 255165786 255883485
$$ packed form
1193.2B74310261J393735m17590j944542k847075l102750k921074k562613k197265
1209.5B59711087j896411j670331j512975j413345j368940j351982j323879j300767
1225.8B47872457j276538j217842j115829r68873p88465n88149l56466r2059J70350
1244.2B41638586L83675N33804O35192O79955O55681N80832M92946M09856L26321K40147
1264.6B46576995J35407p868k09585n00322q57636j174003j374632j484170j502485
1282.9B39601701j417011j313567j238957j142651j003161q18789n81219l01600J7464
1301.3B31802210L88891Q03530J212403J569793J866847K077222K166420K168030K082631
1319.6B46137977J886233J628489J341983J073361Q86082P88093P27624O95944P17699
$$ plain form
1338 255883485 256619573 257345945 258108199 258936584 259789169 260626495 261417270 262119144 262686968 263164073
1358.4 263164073 263605803 263909906 263970077 263868809 263657898 263353735 262980819 262420088 261636198 260663569
1378.8 260663569 259429276 258135468 257336080 257094681 256835639 256369561 255836010 255207658 254475117
1397.1 254475117 253658801 252882361 252287149 251741052 251146913 250557274 249981791 249477774 249134824 248824283
1417.5 248824283 248223200 247495785 246904776 246386260 245919392 245423928 244880527 244450524 244004995 243281052
1437.9 243281052 242564246 242015138 241547048 241118431 240625247 240079656 239646465 239420742 239167899 238406926
1458.3 238406926 237559557 237027034 236549348 235976666 235628918 235619769 235655114 235570237 235623837 235969231
1478.7 235969231 236629859 237595633 238836616 240314662 241893604 243310288 244509012 245772034 247039720
$$ packed form
1338B55883485P36088P26372P62254Q28385Q52585Q37326P90775P01874N67824M77105
1358.4B63164073M41730L04103O0171j01268k10911l04163l72916n60731p83890r72629
1378.8B60663569j234293j293808p99388k41399k59042m66078n33551o28352p32541
1397.1B54475117q16316p76440n95212n46097n94139n89639n75483n04017l42950l10541
1417.5B48824283o01083p27415n91009n18516m66868m95464n43401m30003m45529p23943
1437.9B43281052p16806n49108m68090m28617m93184n45591m33191k25723k52843p60973
1458.3B38406926q47369n32523m77686n72682l47748r149L5345q4877N3600L45394
1478.7B35969231O60628R65774J240983J478046J578942J416684J198724J263022J267686
$$ plain form
1497.1 247039720 247897506 248512447 249295130 250409961 251322806 251421273 251316577 251300752 251301974 251199603
1517.5 251199603 250957072 250433385 249707252 249105364 248588771 248218328 247970998 247504994 246967703 246707007
1537.9 246707007 246221945 245029479 243787855 242782265 241990104 241342470 240884408 240722194 240945861
1556.2 240945861 241327941 241117507 240777880 240792587 241034895 241372600 241598830 241817862 242354423 243132710
1576.6 243132710 243870497 244717076 245741010 246739477 247609764 248318270 248822212 249130994 249261603
1595 249261603 249215037 249075964 248941883 248832121 248798400 248994678 249598995 250780791 252693355 255685091
1615.4 255685091 259636521 262988806 265254557 266245157 265619963 263950467 261968166 260384530 259238631
1633.7 259238631 257945538 256584823 255649805 255101085 254892498 254787028 254551739 254481941 254569679 254238337
$$ packed form
1497.1B47039720Q57786O14941P82683J114831R12845R8467j04696j5825J222j02371
1517.5B51199603k42531n23687p26133o01888n16593l70443k47330m66004n37291k60696
1537.9B46707007m85062j192466j241624j005590p92161o47634m58062j62214K23667
1556.2B40945861L82080k10434l39627J4707K42308L37705K26230K19032N36561P78287
1576.6B43132710P37787Q46579J023934R98467Q70287P08506N03942L08782J30609
1595B49261603m6566j39073j34081j09762l3721J96278O04317J181796J912564K991736
1615.4B55685091L951430L352285K265751R90600o25194j669496j982301j583636j145899
1633.7B59238631j293093j360715r35018n48720k08587j05470k35289o9798Q7738l31342
$$ plain form
1654.1 254238337 253761023 253593415 253632098 253664821 253592163 253623009 253761470 253767490 253690749 253620714 253479332
1676.6 253479332 253406703 253526360 253680140 253496528 253121734 252903014 252784520 252788961 252860993 252870440 252769500
1699 252769500 252458006 252168506 251982152 251726210 251480609 251374751 251404285 251438200 251224011 250832647
1719.4 250832647 250573516 250418246 250290513 250230312 250274837 250354499 250241697 249969855 249834672 249736592
1739.8 249736592 249587923 249472305 249434456 249442428 249343961 249119118 248954356 248853534 248761669 248694450 248595715
1762.2 248595715 248482719 248419896 248392671 248362437 248228133 248017475 247866750 247767001 247677565 247586176 247469172
1784.7 247469172 247339234 247252122 247187868 247064471 246903211 246774137 246657118 246517822 246385887 246284783
1805.1 246284783 246204883 246133178 246025786 245891660 245784581 245702595 245637596 245594934 245547891 245479435 245422408
$$ packed form
1654.1B54238337m77314j67608L8683L2723p2658L0846J38461O020p6741p0035j41382
1676.6B53479332p2629J19657J53780j83612l74794k18720j18494M441P2032R447j00940
1699B52769500l11494k89500j86354k55942k45601j05858K9534L3915k14189l91364
1719.4B50832647k59131j55270j27733o0201M4525P9662j12802k71842j35183r8080
1739.8B49736592j48669j15618l7849P972r8467k24843j64762j00822r1865o7219r8735
1762.2B48595715j12996o2823k7225l0234j34304k10658j50725r9749q9436r1389j17004
1784.7B47469172j29938q7112o4254j23397j61260j29074j17019j39296j31935j01104
1805.1B46284783p9900p1705j07392j34126j07079q1986o4999m2662m7043o8456n7027
$$ plain form
1827.5 245422408 245333403 245175838 245043978 244960785 244890183 244853884 244832337 244749814 244630963 244536102 244452000
1850 244452000 244369879 244290724 244210243 244126931 244047612 243987024 243950054 243907034 243818328 243715823 243652463 243580610
1874.4 243580610 243485346 243416905 243350342 243259296 243190840 243156776 243093714 243000895 242938191 242879137 242794171
1896.9 242794171 242722377 242680848 242638245 242582902 242521882 242444202 242364034 242313623 242283121 242224574 242137715
1919.3 242137715 242070675 242008805 241946906 241912231 241875261 241808251 241731197 241670772 241628692 241584852 241518572
1941.7 241518572 241428897 241338119 241259858 241196021 241151750 241118327 241069973 241001382 240927622 240861028 240819171
1964.2 240819171 240788519 240736857 240668222 240595579 240532547 240493670 240481317 240472034 240437508 240399837 240391359 240401864
1988.7 240401864 240388334 240337685 240293503 240261108 240209311 240148768 240101337 240063772 240023375 239963353 239891559
$$ packed form
1827.5B45422408q9005j57565j31860q3193p0602l6299k1547q2523j18851r4861q4102
1850B44452000q2121p9155q0481q3312p9319o0588l6970m3020q8706j02505o3360p1853
1874.4B43580610r5264o8441o6563r1046o8456l4064o3062r2819o2704n9054q4966
1896.9B42794171p1794m1529m2603n5343o1020p7680q0168n0411l0502n8547q6859
1919.3B42137715o7040o1870o1899l4675l6970o7010p7054o0425m2080m3840o6280
1941.7B41518572q9675r0778p8261o3837m4271l3423m8354o8591p3760o6594m1857
1964.2B40819171l0652n1662o8635p2643o3032l8877j2353r283l4526l7671q478J0505
1988.7B40401864j3530n0649m4182l2395n1797o0543m7431l7565m0397o0022p1794
$$ plain form
2011.1 239891559 239831164 239769176 239692494 239619419 239558861 239511669 239472046 239426881 239374682 239315614 239260256
2033.5 239260256 239213556 239159137 239100635 239053816 239018798 238990083 238949597 238889635 238838598 238809243 238783553
2056 238783553 238753870 238719672 238677636 238642663 238623261 238592386 238540903 238493040 238468021 238460377 238450244 238429308
2080.4 238429308 238392964 238341510 238295719 238272309 238253146 238212943 238158882 238124162 238108277 238069519 238012239
2102.9 238012239 237981021 237977773 237968236 237942085 237911552 237881705 237854525 237834260 237824738 237809882 237782016 237765193
2127.3 237765193 237757653 237742975 237737566 237741008 237723440 237687662 237663507 237664938 237674773 237665340 237626910 237582579 237557068
2153.9 237557068 237543061 237538651 237538084 237512887 237463534 237419054 237391636 237369686 237342790 237315044 237294361 237274438
2178.3 237274438 237243757 237201139 237147212 237094477 237075403 237087876 237086236 237052083 237003237 236967370 236955374 236943468
$$ packed form
2011.1B39891559o0395o1988p6682p3075o0558m7192l9623m5165n2199n9068n5358
2033.5B39260256m6700n4419n8502m6819l5018k8715m0486n9962n1037k9355k5690
2056B38783553k9683l4198m2036l4973j9402l0875n1483m7863k5019p644j0133k0936
2080.4B38429308l6344n1454m5791k3410j9163m0203n4061l4720j5885l8758n7280
2102.9B38012239l1218l248r537k6151l0533k9847k7180k0265r522j4856k7866j6823
2127.3B37765193p540j4678n409L442j7568l5778k4155J431R835r433l8430m4331k5511
2153.9B37557068j4007m410n67k5197m9353m4480k7418k1950k6896k7746k0683j9923
2178.3B37274438l0681m2618n3927n2735j9074J2473j640l4153m8846l5867j1996j1906
$$ plain form
2202.8 236943468 236918673 236893356 236871138 236846671 236809954 236759484 236713916 236690924 236689806 236680046 236641228 236601323
2227.3 236601323 236577705 236556888 236537963 236526683 236511171 236479014 236444697 236420795 236394212 236369282 236357734
2249.7 236357734 236355647 236354411 236337245 236301884 236261636 236227661 236212820 236216933 236209050 236164108 236113846 236082450
2274.2 236082450 236045390 236019254 236022234 236017838 235998467 235981703 235963196 235942796 235926479 235903785 235872522 235836685
2298.7 235836685 235788897 235748082 235722914 235684812 235625446 235558718 235499948 235456601 235411748 235336035 235241622
2321.1 235241622 235169575 235119000 235074103 235036865 234987810 234901473 234771639 234638900 234578386 234539613 234431162
2343.5 234431162 234373003 234477580 234600455 234592423 234483361 234371245 234241664 234119862 234056443 234024003
2363.9 234024003 234053358 234136403 234178275 234176829 234201372 234282330 234396890 234512582 234607324 234670341 234699264
$$ packed form
2202.8B36943468k4795k5317k2218k4467l6717n0470m5568k2992j118r760l8818l9905
2227.3B36601323k3618k0817j8925j1280j5512l2157l4317k3902k6583k4930j1548
2249.7B36357734k087j236j7166l5361m0248l3975j4841M113p883m4942n0262l1396
2274.2B36082450l7060k6136K980m396j9371j6764j8507k0400j6317k2694l1263l5837
2298.7B35836685m7788m0815k5168l8102n9366o6728n8770m3347m4853p5713r4413
2321.1B35241622p2047n0575m4897l7238m9055q6337j29834j32739o0514l8773j08451
2343.5B34431162n8159J04577J22875q032j09062j12116j29581j21802o3419l2440
2363.9B34024003K9355Q3045M1872j446K4543Q0958J14560J15692R4742O3017K8923
$$ plain form
2386.4 234699264 234705254 234700978 234681085 234666213 234680727 234685749 234648794 234593868 234548137 234530926 234531119 234513670
2410.8 234513670 234491989 234488249 234470338 234422952 234389797 234384164 234374449 234354287 234326079 234280124 234226480 234184772
2435.3 234184772 234161317 234149739 234138161 234115928 234077930 234042406 234021738 233995885 233955964 233927444 233926609 233923510 233905673
2461.8 233905673 233891711 233880863 233878925 233881339 233859777 233828589 233810186 233801082 233804926 233809158 233794361 233773440
2486.3 233773440 233772710 233783498 233785465 233776838 233762071 233760804 233771980 233778149 233776867 233760536 233738318 233723283 233693600
2512.8 233693600 233651221 233627558 233613953 233590677 233557239 233504787 233428836 233352810 233300313 233271763 233246788
2535.3 233246788 233197942 233122095 233052433 233024493 233016729 232976586 232896268 232826680 232799172 232779711 232749388 232727513
2559.7 232727513 232710719 232674241 232625380 232591510 232584640 232590944 232580572 232551143 232524872 232515574 232514054 232518137
$$ packed form
2386.4B34699264N990m276j9893j4872J4514N022l6955n4926m5731j7211J93j7449
2410.8B34513670k1681l740j7911m7386l3155n633r715k0162k8208m5955n3644m1708
2435.3B34184772k3455j1578Tk2233l7998l5524k0668k5853l9921k8520q35l099j7837
2461.8B33905673j3962j0848j938K414k1562l1188j8403r104L844M232j4797k0921
2486.3B33773440p30J0788J967q627j4767j267J1176O169j282j6331k2218j5035k9683
2512.8B33693600m2379k3663j3605k3276l3438n2452p5951p6026n2497k8550k4975
2535.3B33246788m8846p5847o9662k7940p764m0143q0318o9588k7508j9461l0323k1875
2559.7B32727513j6794l6478m8861l3870o870O304j0372k9429k6271r298j520M083
$$ plain form
2584.2 232518137 232541531 232579291 232609227 232610762 232594952 232574254 232546136 232531026 232531592 232521549 232499018 232491314
2608.7 232491314 232507959 232516214 232496470 232473403 232458115 232431307 232394964 232357830 232312217 232279778 232265458 232237265
2633.2 232237265 232201517 232172504 232154012 232135400 232084081 232017621 231971368 231933057 231897399 231874123 231831968
2655.6 231831968 231765151 231732994 231732160 231708422 231670901 231633991 231575191 231522650 231512338 231494024 231434867 231377438
2680.1 231377438 231345102 231321841 231297016 231273189 231251046 231210634 231143713 231099591 231100023 231093630 231053650 231002182
2704.5 231002182 230958223 230917349 230873108 230831742 230807275 230803117 230792910 230764315 230730772 230694577 230654895 230605140
2729 230605140 230556980 230527952 230480418 230401069 230351940 230355948 230359912 230337098 230313316 230273515 230199799 230149150
2753.5 230149150 230146885 230133444 230073601 230015188 229999214 229983628 229928896 229871541 229845151 229829520 229804859 229766682
$$ packed form
2584.2B32518137K3394L7760K9936J535j5810k0698k8118j5110N66j0043k2531p704
2608.7B32491314J6645Q255j9744k3067j5288k6808l6343l7134m5613l2439j4320k8193
2633.2B32237265l5748k9013j8492j8612n1319o6460m6253l8311l5658k3276m2155
2655.6B31831968o6817l2157q34k3738l7521l6910n8800n2541j0312j8314n9157n7429
2680.1B31377438l2336k3261k4825k3827k2143m0412o6921m4122M32o393l9980n1468
2704.5B31002182m3959m0874m4241m1366k4467m158j0207k8595l3543l6195l9682m9755
2729B30605140m8160k9028m7534p9349m9129M008L964k2814k3782l9801p3716n0649
2753.5B30149150k265j3441n9843n8413j5974j5586n4732n7355k6390j5631k4661l8177
$$ plain form
2778 229766682 229711592 229661301 229632869 229599565 229556233 229526415 229514122 229522020 229537293 229542196 229537994 229516089
2802.4 229516089 229484618 229465738 229446337 229420945 229400203 229381964 229373530 229365543 229341730 229322702 229328528 229353562
2826.9 229353562 229384318 229418963 229453757 229472786 229494289 229523152 229518533 229489461 229475021 229478717 229477942 229467914
2851.4 229467914 229471192 229496494 229536861 229565293 229554936 229520574 229495421 229479909 229448289 229404300 229366347 229312390
2875.9 229312390 229234308 229164988 229109019 229063451 229027316 228973001 228894815 228819236 228762671 228715241 228662267
2898.3 228662267 228624135 228606045 228567988 228513420 228479430 228463754 228449255 228434920 228413135 228387147 228382334 228394613
2922.8 228394613 228393570 228399321 228464082 228560537 228640467 228717253 228800967 228889763 228999093 229128048 229251072
2945.2 229251072 229353368 229437247 229507476 229566768 229615062 229647636 229691997 229790926 229920998 230029672 230115041
$$ packed form
2778B29766682n5090n0291k8432l3304m3332k9818j2293P898J5273M903m202k1905
2802.4B29516089l1471j8880j9401k5392k0742j8239q434p987k3813j9028N826K5034
2826.9B29353562L0756L4645L4794J9029K1503K8863m619k9072j4440L696p75j0028
2851.4B29467914L278K5302M0367K8432j0357l4362k5153j5512l1620m3989l7953n3957
2875.9B29312390p8082o9320n5969m5568l6135n4315p8186p5579n6565m7430n2974
2898.3B28662267l8132j8090l8057n4568l3990j5676j4499j4335k1785k5988m813J2279
2922.8B28394613j043N751O4761R6455P9930P6786Q3714Q8796J09330J28955J23024
2945.2B29251072J02296Q3879P0229N9292M8294L2574M4361R8929J30072J08674Q5369
$$ plain form
2967.6 230115041 230203018 230315834 230446592 230558485 230665326 230786741 230880111 230944574 231040910 231166795
2988 231166795 231275797 231382638 231501326 231607571 231695071 231770813 231828794 231880352 231956214 232027620 232047930
3010.5 232047930 232037842 232017279 231970415 231920287 231890798 231847882 231787547 231735006 231693313 231670246 231652692
3032.9 231652692 231612816 231550127 231483847 231438294 231415093 231377304 231304720 231232822 231202617 231219634 231257081
3055.3 231257081 231268004 231246039 231245786 231263310 231254190 231235296 231208682 231167376 231138617 231117889 231093094 231079727
3079.8 231079727 231064841 231027707 230991080 230967954 230941102 230906099 230872706 230844066 230813473 230766162 230685115
3102.2 230685115 230585441 230507106 230446726 230378911 230308443 230230063 230135515 230042368 229959950 229878485 229799077
3124.7 229799077 229724541 229650661 229585409 229520619 229434326 229341313 229271665 229211390 229132324 229050547 228984192
$$ packed form
2967.6B30115041Q7977J12816J30758J11893J06841J21415R3370O4463R6336J25885
2988B31166795J09002J06841J18688J06245Q7500P5742N7981N1558P5862P1406K0310
3010.5B32047930j0088k0563m6864n0128k9489m2916o0335n2541m1693k3067j7554
3032.9B31652692l9876o2689o6280m5553k3201l7789p2584p1898l0205J7017L7447
3055.3B31257081J0923k1965k53J7524r120j8894k6614m1306k8759k0728k4795j3367
3079.8B31079727j4886l7134l6627k3126k6852l5003l3393k8640l0593m7311q1047
3102.2B30685115r9674p8335o0380o7815p0468p8380r4548r3147q2418q1465p9408
3124.7B29799077p4536p3880o5252o4790q6293r3013o9648o0275p9066q1777o6355
$$ plain form
3147.1 228984192 228896305 228776902 228661612 228540003 228417113 228319868 228215933 228073671 227915630 227760538
3167.5 227760538 227590874 227408350 227236077 227073863 226907343 226718754 226509795 226323113 226175085 226039663
3187.9 226039663 225904152 225756556 225561097 225314572 225077480 224891752 224758849 224651411 224527657 224394083
3208.3 224394083 224268392 224149182 224042624 223930836 223792583 223661035 223561853 223459631 223339632 223231494
3228.7 223231494 223133355 223022550 222909495 222811982 222715527 222612128 222510338 222390637 222249389 222118258
3249.1 222118258 222027808 221966237 221877754 221765205 221655652 221528754 221381292 221247464 221156374 221080348
3269.5 221080348 220964283 220810831 220661491 220517948 220342278 220125705 219916120 219734117 219544306 219353616
3289.9 219353616 219168469 218957543 218726650 218484700 218235508 217999130 217787534 217580765 217331290 217019424
$$ packed form
3147.1B28984192q7887j19403j15290j21609j22890r7245j03935j42262j58041j55092
3167.5B27760538j69664j82524j72273j62214j66520j88589k08959j86682j48028j35422
3187.9B26039663j35511j47596j95459k46525k37092j85728j32903j07438j23754j33574
3208.3B24394083j25691j19210j06558j11788j38253j31548r9182j02222j19999j08138
3228.7B23231494r8139j10805j13055r7513r6455j03399j01790j19701j41248j31131
3249.1B22118258r0450o1571q8483j12549j09553j26898j47462j33828r1090p6026
3269.5B21080348j16065j53452j49340j43543j75670k16573k09585j82003j89811j90690
3289.9B19353616j85147k10926k30893k41950k49192k36378k11596k06769k49475l11866
$$ plain form
3310.3 217019424 216680467 216358259 216044202 215709254 215370581 215053394 214720085 214334875 213942617 213578835
3330.7 213578835 213224396 212875098 212542474 212194324 211785018 211349756 210946575 210567459 210204110 209840834
3351.1 209840834 209418029 208944187 208516657 208163694 207828626 207490265 207139134 206765577 206385270 205991521
3371.5 205991521 205579832 205174401 204797730 204462677 204163209 203873813 203587204 203319445 203079268 202831119
3391.9 202831119 202527657 202220991 201993689 201818630 201606020 201332450 201053634 200802311 200579464 200374633
3412.3 200374633 200170964 199990630 199849501 199703857 199536845 199399799 199307039 199233949 199172765 199129939
3432.7 199129939 199102923 199035212 198927000 198875457 198898047 198949084 198996499 199009284 199028298 199110016 199225336
3455.1 199225336 199338034 199455842 199547768 199606925 199746758 200000435 200235724 200388655 200509593 200631142
$$ packed form
3310.3B17019424l38957l22208l14057l34948l38673l17187l33309l85210l92258l63782
3330.7B13578835l54439l49298l32624l48150m09306m35262m03181l79116l63349l63276
3351.1B09840834m22805m73842m27530l52963l35068l38361l51131l73557l80307l93749
3371.5B05991521m11689m05431l76671l35053k99468k89396k86609k67759k40177k48149
3391.9B02831119l03462l06666k27302j75059k12610k73570k78816k51323k22847k04831
3412.3B00374633k03669j80334j41129j45644j67012j37046r2760p3090o1184m2826
3432.7A99129939k7016o7711j08212n1543K2590N1037M7415J2785J9014Q1718J15320
3455.1A99225336J12698J17808R1926N9157J39833K53677K35289J52931J20938J21549
$$ plain form
3475.5 200631142 200777367 200963736 201149642 201319620 201523736 201742902 201960564 202250332 202569038 202823669
3495.9 202823669 203052968 203297988 203537017 203763008 203998581 204250559 204500422 204761386 205036923 205295861
3516.3 205295861 205552131 205838844 206162497 206504241 206843480 207146525 207396105 207649931 207956105 208295837
3536.7 208295837 208630979 208961383 209300324 209646434 209981173 210284904 210580811 210895672 211239070 211608976
3557.1 211608976 211982280 212340847 212699950 213102698 213543177 213912159 214190781 214472696 214806333 215206698
3577.5 215206698 215636253 216044933 216485456 216967478 217374861 217686266 218023106 218427345 218843192 219238847
3597.9 219238847 219649613 220075339 220473453 220871717 221298948 221720487 222151071 222582132 222971261 223367706
3618.3 223367706 223732069 224018350 224315360 224681318 225108460 225412905 225604638 225855246 226118878 226343498
$$ packed form
3475.5B00631142J46225J86369J85906J69978K04116K19166K17662K89768L18706K54631
3495.9B02823669K29299K45020K39029K25991K35573K51978K49863K60964K75537K58938
3516.3B05295861K56270K86713L23653L41744L39239L03045K49580K53826L06174L39732
3536.7B08295837L35142L30404L38941L46110L34739L03731K95907L14861L43398L69906
3557.1B11608976L73304L58567L59103M02748M40479L68982K78622K81915L33637M00365
3577.5B15206698M29555M08680M40523M82022M07383L11405L36840M04239M15847L95655
3597.9B19238847M10766M25726L98114L98264M27231M21539M30584M31061L89129L96445
3618.3B23367706L64363K86281K97010L65958M27142L04445J91733K50608K63632K24620
$$ plain form
3638.7 226343498 226595044 226908669 227279276 227733269 228141889 228261128 228211895 228231505 228309602 228352934
3659 228352934 228428394 228573188 228764042 229045600 229411557 229621157 229663238 229713783 229619905 229434475 229368925
3681.5 229368925 229427174 229570433 229808837 229968056 229871005 229717761 229656309 229692206 229807585 229902893
3701.9 229902893 229894310 229908660 230050474 230202198 230192855 230051532 229934439 229918018 230009809 230093375 230057269
3724.3 230057269 229952544 229878545 229947612 230186477 230395257 230335101 230127215 230036899 230166703 230406374
3744.7 230406374 230501726 230519518 230469212 230262578 230082169 229995579 229952991 229891285 229804322 229760051 229766920
3767.1 229766920 229781955 229747906 229702100 229726598 229814753 229876637 229805559 229676872 229589611 229504585 229442731
3789.6 229442731 229472160 229587674 229771584 229941860 230042368 230020106 229810342 229643688 229562312 229441017
$$ packed form
3638.7B26343498K51546L13625L70607M53993M08620J19239m9233J9610P8097M3332
3659B28352934P5460J44794J90854K81558L65957K09600M2081N0545r3878j85430o5550
3681.5B29368925N8249J43259K38404J59219r7051j53244o1452L5897J15379R5308
3701.9B29902893q583J4350J41814J51724r343j41323j17093j6421R1791Q3566l6106
3724.3B30057269j04725p3999O9067K38865K08780o0156k07886r0316J29804K39671
3744.7B30406374R5352J7792n0306k06634j80409q6590m2588o1706q6963m4271O869
3767.1B29766920J5035l4049m5806K4498Q8155O1884p1078j28687q7261q5026o1854
3789.6B29442731K9429J15514J83910J70276J00508k2262k09764j66654q1376j21295
$$ plain form
3810 229441017 229400188 229520634 229663506 229668215 229676694 229679450 229537964 229386851 229300529 229301915 229387835 229485124
3834.4 229485124 229576692 229599297 229469061 229269922 229070455 228967220 229069993 229287520 229413673 229279548
3854.8 229279548 229075730 229035348 229103461 229126036 229052231 228952885 228932902 228954658 228942946 228891090 228806764
3877.3 228806764 228817925 228880718 228866398 228824556 228724465 228640154 228619203 228530198 228452310 228519499 228644967
3899.7 228644967 228682339 228611246 228484392 228357434 228277534 228256240 228255227 228242248 228214458 228198990 228213012
3922.1 228213012 228230834 228225321 228201270 228193134 228180707 228102356 228005335 227982804 228021204 228024721 227973536 227937549
3946.6 227937549 227929890 227902457 227858350 227841049 227831841 227782473 227712288 227664784 227653012 227664083 227668360 227651179
3971.1 227651179 227619290 227594703 227574483 227522567 227468327 227456108 227463290 227479964 227485970 227442995 227380320 227337956
$$ packed form
3810B29441017m0829J20446J42872M709Q479K756j41486j51113q6322J386Q5920R7289
3834.4B29485124R1568K2605j30236j99139j99467j03235J02773K17527J26153j34125
3854.8B29279548k03818m0382O8113K2575p3805r9346j9983K1756j1712n1856q4326
3877.3B28806764J1161O2793j4320m1842j00091q4311k0951q9005p7888O7189J25468
3899.7B28644967L7372p1093j26854j26958p9900k1294j013j2979k7790j5468J4022
3922.1B28213012J7822n513k4051q136j2427p8351r7021k2531L8400L517n1185l5987
3946.6B27937549p659k7433m4107j7301r208m9368p0185m7504j1772J1071M277j7181
3971.1B27651179l1889k4587k0220n1916n4240j2219P182J6674O006m2975o2675m2364
$$ plain form
3995.6 227337956 227310985
3997.6 227310985
$$ packed form
3995.6B27337956k6971
3997.6B27310985
##END=$$ End of the data block
