##TITLE=PANI HNO3 $$ Begin of the data block
##JCAMP-DX=5.00 $$ ACD/SpecManager v 10.08
##SPECTROMETER/DATA SYSTEM=Alpha
##DATE=07 Aug 2014 08:24:00
##DATA TYPE=INFRARED SPECTRUM
##DATA CLASS=XYDATA
##ORIGIN=
##OWNER=
##NPOINTS=1765
##FIRSTX=399.75695801
##LASTX=3997.56933594
##MAXX=3997.56933594
##MINX=399.75695801
##MAXY=0.43926883
##MINY=0.16047227
##XFACTOR=1.0000000000
##YFACTOR=1.000000000000000e-9
##FIRSTY=0.43904173
##DELTAX=2.03957629
##XUNITS=1/CM
##YUNITS=ARBITRARY UNITS
##XYDATA=(X++(Y..Y))
399.8D39041734j436353j075208l31164J33783K64317O69986J087338O43551j00374
418.1D38897610J2427L58790r059l04223l5256l17812r66936o56277k59548q94577
438.5D35825139j524597j359731j110941j299382j185804o93917r86785j581907j311630
456.9D24770445r84967j453877j777887j276910r77725j449823j497984r01968j042753
475.2D13406551j836687j724184r66579j237780j937300j632809j331747j942634k331704
493.6C98465127j938552j747548j794160j320928n24372p9870K34067R41813J602560
511.9C93838137J700461J857341K493202K708584K095938J686245J807362J347959
528.3D09535229K59519m07100o83665j143634j473755j188636p92384r66728j240045
$$ y = [439041734, 437605381, 436530173, 436199009, 436332792, 436597109, 437267095, 438354433, 438997984, 438897610, 438910037, 439268827, 439259768, 438955545, 438920289, 438602477, 437635541, 436979264, 436719716, 435825139, 434300542, 432940811, 431829870, 430530488, 429344684, 428650767, 427663982, 426082075, 424770445, 423785478, 422331601, 420553714, 419276804, 418299079, 416849256, 415351272, 414449304, 413406551, 411569864, 409845680, 408879101, 407641321, 405704021, 404071212, 402739465, 400796831, 398465127, 396526575, 394779027, 392984867, 391663939, 391139567, 391059697, 391293764, 392235577, 393838137, 395538598, 397395939, 399889141, 402597725, 404693663, 406379908, 408187270, 409535229, 409794748, 409387648, 408703983, 407560349, 406086594, 404897958, 404105574, 403138846, 401898801]
546.6D01898801r93997q05676j077950j205027r73314r51141j192391j145333q34793
565C92719179q81016j255840j243353r20117q98510j052886q59559n68449o88166o74098
585.4C83677185l7760M93258M38929L69906O17475P61747O95169R55611J405567J090080
605.8C90467167J31696n26517q43764j213669j349152q73565k95758k40922k77490
624.1C84978026K7418M7624l71337l97384N3257J58489q6516R1403M88192L80665J18405
646.5C85488242L19302M51118M8667k47866n1945L1113l28243l72886L74347J106530
666.9C86818379O7175j043350m47452j81586m46647k65390Q5891k52277o62208m10229
687.3C83262306l23236p84933q56638m23968m09067p99775o69777j03057M0591K4528
$$ y = [401898801, 400904804, 400099128, 399021178, 397816151, 396842837, 395891696, 394699305, 393553972, 392719179, 391838163, 390582323, 389338970, 388418853, 387520343, 386467457, 385607898, 385039449, 384351283, 383677185, 383639425, 384132683, 384571612, 384941518, 385558993, 386320740, 387015909, 387971520, 389377087, 390467167, 390598863, 390072346, 389228582, 388014913, 386665761, 385792196, 385496438, 385255516, 384978026, 385005444, 385053068, 384681731, 384284347, 384337604, 384496093, 384409577, 384500980, 384989172, 385369837, 385488242, 385807544, 386258662, 386307329, 386059463, 386007518, 386038631, 385710388, 385337502, 385711849, 386818379, 386885554, 385842204, 385394752, 385213166, 384766519, 384501129, 384587020, 384334743, 383672535, 383262306, 382939070, 382154137, 381297499, 380873531, 380464464, 379664689, 378994912, 378891855, 378932446, 378956974]
707.7C78956974N90801J204043J091928P89493Q73059O54817k01643o80148m71831
726.1C82807493m88370r02445q86082m58688m95076q42690p03693m03762n71489p53343
746.5C76301855m93914l17663o10441p65145m57108l66241p07835p66515m55588n28038
766.9C70833367q87960q24273n99056p98404j072377r59009q09074r97811j185567
785.2C62699836j015931q75026r86367q56132m18603j49995q464L90321Q63731R24170
805.6C60567540P39336P58886P48635M20630K24143N07563Q62271J051366J386374
824C67266744J828611J903415J609981J560092J751721J331776P73281J405657K252161
842.3C81683439J812577Q01355K38210K4378k05040l84390l56943l54081n83649q38101
$$ y = [378956974, 379547775, 380751818, 381843746, 382633239, 383506298, 384161115, 383959472, 383279324, 382807493, 382319123, 381416678, 380530596, 380071908, 379576832, 378734142, 378030449, 377626687, 377055198, 376301855, 375807941, 375490278, 374879837, 374114692, 373657584, 373291343, 372583508, 371816993, 371361405, 370833367, 369945407, 369121134, 368522078, 367723674, 366651297, 365692288, 364883214, 363885403, 362699836, 361683905, 360808879, 359822512, 358966380, 358547777, 358397782, 358389318, 358779639, 359643370, 360567540, 361306876, 362065762, 362814397, 363235027, 363459170, 363966733, 364829004, 365880370, 367266744, 369095355, 370998770, 372608751, 374168843, 375920564, 377252340, 378025621, 379431278, 381683439, 383496016, 384297371, 384535581, 384559959, 384354919, 383970529, 383613586, 383259505, 382675856, 381837755]
862.7C81837755r10878r70840j154125j230448j038880p78704n58436k39313K03222
881.1C75159353O52164R84848J033306O85990N8591n48333q80718r73195j001418j001030
901.5C74169558r40591q56638q19295q21293p72625p08133p46399q05140p49319o78123
921.9C66272002p49349q34167p41631o61880p58856p88957o61761o04570o64472o59228
942.3C59147131n47349n06938n68479n50955m79073n18709n89401n30839m41908m95553
962.7C53917927n74410n18263m82261n90622o57976n72473n75095p71582q52853p21068
983.1C47601324o68078p18743n93811l17306j56760j15037n8859j25349m37081o88791
1003.5C43721509o26534n21392o08355o60360n47528n35339o92099p25717o15179o62416
$$ y = [381837755, 380926877, 379956037, 378801912, 377571464, 376532584, 375753880, 375195444, 374956131, 375159353, 375811517, 376796365, 377829671, 378515661, 378574252, 378025919, 377145201, 376172006, 375170588, 374169558, 373228967, 372372329, 371553034, 370731741, 369959116, 369250983, 368504584, 367699444, 366950125, 366272002, 365522653, 364688486, 363946855, 363284975, 362526119, 361737162, 361075401, 360470831, 359806359, 359147131, 358599782, 358092844, 357524365, 356973410, 356494337, 355975628, 355386227, 354855388, 354413480, 353917927, 353343517, 352825254, 352342993, 351752371, 351094395, 350521922, 349946827, 349175245, 348322392, 347601324, 346933246, 346214503, 345620692, 345303386, 345146626, 345031589, 344972730, 344847381, 344410300, 343721509, 343094975, 342573583, 341965228, 341304868, 340757340, 340222001, 339529902, 338804185, 338189006, 337526590]
1023.9C37526590q22246p66993o08236o57588p51972o31452m94986n69195o60539n81562
1044.3C30981821n19693o09398o28233n12838n12511o38991o70076o09577o37948p26968
1064.7C24915588o85990n98937o78182p88182p41273o68794o96003o90908n85109n58287
1085C18223923o86943p48903o55561o46413p53969p51972o70761p32153q72106q21411
1105.4C10883731o63221o81341p44939o15269m49568m07070l66330k44260j22308o6102
1125.8C06523323J401J33812J98752J93536L09855N19723O54965P68364J009375J322686
1146.2C11635792J584232J861602K217531K522588K690852K811581K929985K911270
1162.6C31165433K699137K496332K445697K420843K402574K559632K871871L211349
$$ y = [337526590, 336704344, 335937351, 335329115, 334671527, 333919555, 333288103, 332793117, 332223922, 331563383, 330981821, 330462128, 329852730, 329224497, 328711659, 328199148, 327560157, 326890081, 326280504, 325642556, 324915588, 324229598, 323630661, 322952479, 322164297, 321423024, 320754230, 320058227, 319367319, 318782210, 318223923, 317536980, 316788077, 316132516, 315486103, 314732134, 313980162, 313309401, 312577248, 311705142, 310883731, 310220510, 309539169, 308794230, 308178961, 307729393, 307322323, 306955993, 306711733, 306589425, 306523323, 306524724, 306658536, 306857288, 307050824, 307360679, 307880402, 308535367, 309303731, 310313106, 311635792, 313220024, 315081626, 317299157, 319821745, 322512597, 325324178, 328254163, 331165433, 333864570, 336360902, 338806599, 341227442, 343630016, 346189648, 349061519, 352272868]
1178.9C52272868L621191M197836M791260N144298N183428M800529L640115J616627
1195.2C85268152o97553k612353l815859m291237m169792l782272l434062l146023
1211.5C59319001k822816k519786k358258k265722k109080j938641j841814j729518
1227.8C41733366j551181j380294j220465r81033o51270l33428o0022K16514M77105
1246.2C36249292O29783O84350P03484O96212O31809N36621M75556M08172K72721Q9974
1266.6C41377974j06216l85880q09819j321614j788765k141178k325147k301991k152830
1284.9C28044534k001673j852840j606822j328469j057058p07716k36094K91347Q09819
1303.3C20355028J346230J875103K295673K567738K727747K753198K676904K449751
$$ y = [352272868, 355894059, 360091895, 364883155, 370027453, 375210881, 380011410, 383651525, 385268152, 384570599, 381958246, 378142387, 373851150, 369681358, 365899086, 362465024, 359319001, 356496185, 353976399, 351618141, 349352419, 347243339, 345304698, 343462884, 341733366, 340182185, 338801891, 337581426, 336600393, 335949123, 335615695, 335555673, 335772187, 336249292, 336879075, 337563425, 338266909, 338963121, 339594930, 340131551, 340607107, 341015279, 341288000, 341377974, 341271758, 340885878, 340076059, 338754445, 336965680, 334824502, 332499355, 330197364, 328044534, 326042861, 324190021, 322583199, 321254730, 320197672, 319489956, 319253862, 319545209, 320355028, 321701258, 323576361, 325872034, 328439772, 331167519, 333920717, 336597621, 339047372]
1319.6C39047372K073616J676917J305282R86070P11202M69357K59012J09702j05381
1338C46533149m72933q57651j144349j432330j647740j559258j191109r43601j203776
1356.3C36080402j726121k319425l114283l856868m524320n817950p418602r543002
1372.6B97759831j2473404j5350908k3057923l7644029l9378434r382859L2475233
1386.9A92947507M6342447L2291368J9905299J3717234R049922O091029M450261L435731
1403.2C28230798K905071K279162J776755J473755J209170J068264R11474M62562K8700
1421.6C40345711q9318k26319l50058n64843o30677k71559n5730l73453n47767m84705
1442C36751282m68313m52698n59330o40988m78000j70886k96474j094698j127840o81847
$$ y = [339047372, 341120988, 342797905, 344103187, 345089257, 345800459, 346269816, 346528828, 346638530, 346533149, 346060216, 345202565, 344058216, 342625886, 340978146, 339418888, 338227779, 337284178, 336080402, 334354281, 332034856, 328920573, 325063705, 320539385, 314721435, 307302833, 297759831, 285286427, 269935519, 246877596, 209233567, 169855133, 160472274, 192947507, 239289954, 271581322, 291486621, 305203855, 314253777, 320344806, 324795067, 328230798, 331135869, 333415031, 335191786, 336665541, 337874711, 338942975, 339854449, 340317011, 340345711, 340256393, 340030074, 339680016, 339115173, 338484496, 338212937, 338157207, 337783754, 337235987, 336751282, 336282969, 335830271, 335270941, 334629953, 334151953, 333981067, 333684593, 332589895, 331462055, 330780208]
1462.4C30780208o85602q73477n39302r0987j26749l94762k10225K27093P22528J198709
1482.8C30007434J647740K095581K326965K088010J747281J898974K068698J652271
1499.1C45532954J316637J459181J849711J535862K86371q3596L6866P8767r8049l65645
1519.5C51549059q04126j065582q68112p94858o08533m11392p28100q02100m02480
1537.8C45063776p62344j728594j789302j480817j109183q91715o87331k85000K56389
1556.2C36585879L65109m42088l49462J89960M28796M39197J87099J57117N00054O65634
1576.6C38727295O44833Q98063J178444J213968J085251Q18521M49151J35124j28389
1594.9C45022261m14550n72592n73695n39303m12494p7337M25577J047552J850754
$$ y = [330780208, 330094606, 329221129, 328681827, 328590840, 328464091, 328069329, 327859104, 328086197, 328808725, 330007434, 331655174, 333750755, 336077720, 338165730, 339913011, 341811985, 343880683, 345532954, 346849591, 348308772, 350158483, 351694345, 351980716, 351897120, 351933986, 352012753, 351914704, 351549059, 350744933, 349679351, 348811239, 348016381, 347407848, 346996456, 346268356, 345466256, 345063776, 344301432, 342572838, 340783536, 339302719, 338193536, 337301821, 336614490, 336329490, 336585879, 336950988, 336508900, 336159438, 336349398, 336778194, 337217391, 337404490, 337561607, 338061661, 338727295, 339372128, 340270191, 341448635, 342662603, 343747854, 344566375, 345015526, 345150650, 345022261, 344607711, 344035119, 343461424, 342922121, 342509627, 342432290, 342857867, 343905419, 345756173]
1613.3C45756173L083676M208625L622561K452135R22025j032859k347500k757310
1629.6C53907526k047331j246601j321673j399219p92832k11298K93881N68837M57286
1648C48208576N14299P61539L50207o4403K13772N01007N50121L79145L88056M57049
1668.4C52259368K47240P3164L636j18792M024K82019K72661l38018o00486l44575
1688.8C51740241k28375l0220P2927k8491k03699n44995m89712l91334n32091m46826
1709.2C48917425k05696k1845j4186l90410o92338m67807k63810j84298o0677J09016
1729.5C46725374J90765n7340k94774j06961l1203r8258o6817M0472O8843j80274m17352
1752C45772475k89798j80334k02089k19077l47048l88742k33501o139J99974Q0645
$$ y = [345756173, 348839849, 353048474, 356671035, 359123170, 360045195, 359012336, 356664836, 353907526, 351860195, 350613594, 349291921, 347892702, 347099870, 346888572, 347182453, 347751290, 348208576, 348722875, 349484414, 349834621, 349770218, 349983990, 350484997, 351035118, 351414263, 351802319, 352259368, 352506608, 352579772, 352583408, 352464616, 352468640, 352750659, 353023320, 352685302, 352084816, 351740241, 351511866, 351481646, 351554573, 351526082, 351322383, 350777388, 350287676, 349896342, 349364251, 348917425, 348711729, 348689884, 348675698, 348285288, 347592950, 347125143, 346861333, 346677035, 346616358, 346725374, 346916139, 346858799, 346564025, 346457064, 346425861, 346327603, 346260786, 346301258, 346370101, 346189827, 345772475, 345482677, 345302343, 345100254, 344881177, 344534129, 344145387, 343911886, 343905747, 344105721, 344186366]
1772.4C44186366j63645j23054l5584q4340j85490k38240j99794o9827k0355j65224
1792.8C42900813k51264j96576j95831k40177k34455j70469q7202n9634j70261k72095
1813.2C41022849k13832j21176r0092o5208n2452q0436p3701j36525k52962k18600
1833.6C39717865j53780j38998p5191n693r9599k27690j95831j48952j39475j26212
1854C38406444j06067j15692j52767j57893p8022P212p0781k19345j96427j33783j38998
1876.4C37043881j28805j30356j70230j41740m9234o3806j33992j08540j10209j71780
1896.8C35835189j61708r5635o8099p9155q3863r2954j11580r5337n6863p5191j11998
1919.2C34802806j11252j56521j85699j30355r4593j07914j23352j09464q0406o8933
$$ y = [344186366, 344022721, 343899667, 343864083, 343779743, 343594253, 343356013, 343156219, 343086392, 343066037, 342900813, 342649549, 342452973, 342257142, 342016965, 341782510, 341612041, 341524839, 341465205, 341294944, 341022849, 340809017, 340687841, 340597749, 340532541, 340480089, 340399653, 340325952, 340189427, 339936465, 339717865, 339564085, 339425087, 339349896, 339344203, 339244604, 339016914, 338821083, 338672131, 338532656, 338406444, 338300377, 338184685, 338031918, 337874025, 337796003, 337803215, 337732434, 337513089, 337316662, 337182879, 337043881, 336915076, 336784720, 336614490, 336472750, 336423516, 336359710, 336225718, 336117178, 336006969, 335835189, 335673481, 335577846, 335509747, 335430592, 335346729, 335253775, 335142195, 335046858, 334989995, 334914804, 334802806, 334691554, 334535033, 334349334, 334218979, 334124386, 334016472, 333893120, 333783656, 333703250, 333634317]
1939.6C33634317r2328j30266j39027j33545j15662r7454j21981j50621j31816j00702
1960C32420915r6202p9721m9531p5013j22308j21922j09791j13756r4890n8443m0144
1982.5C31459194m2945n4657m1008l4034p8977j03205p2986n4657p7695j09345j14560
2004.9C30675125r8199r4383r1583o4909p1735j38610j71840j35541r5457q9228r3311
2027.3C29530329q3805q8542j06812j01477q1837o8009n3853m7862o7413r9957j00464
2049.8C28630298o4283n1409p8529r1225o4880n3644p7874r0152p0214m3809m4704
2072.2C27899575n9455n7549n6564o4880o0111n9367q2641j03415j00344p3880l1918
2094.6C27149451J2547L1471P301k3782k2620j0133j8447l2813k4259j490p361l1948
$$ y = [333634317, 333541989, 333411723, 333272696, 333139151, 333023489, 332926035, 332804054, 332653433, 332521617, 332420915, 332324713, 332244992, 332195461, 332120448, 331998140, 331876218, 331766427, 331652671, 331557781, 331499338, 331459194, 331416249, 331361592, 331320584, 331286550, 331207573, 331104368, 331031382, 330976725, 330899030, 330789685, 330675125, 330576926, 330482543, 330390960, 330326051, 330254316, 330115706, 329943866, 329808325, 329712868, 329623640, 329530329, 329446524, 329357982, 329251170, 329149693, 329067856, 328999847, 328945994, 328898132, 328830719, 328730762, 328630298, 328566015, 328514606, 328436077, 328344852, 328279972, 328226328, 328148454, 328058302, 327988088, 327944279, 327899575, 327840120, 327782571, 327726007, 327661127, 327601016, 327541649, 327459008, 327355593, 327255249, 327181369, 327149451, 327161998, 327193469, 327200770, 327176988, 327154368, 327144235, 327125788, 327092975, 327068716, 327067226, 327059865, 327027917]
2119.1C27027917k1935p569j7196j8001j8835l2544k9147m709N305j3947l5197k9534
2143.6C26804608k0027k9445l3557k6405l1978n1945n2005j8835P599q464m6760m7981
2168C26444805j4663k7925q2135q5592m5657l2425l3439j9848j4305k7865m2856m1306
2192.5C25976789l5971l8743l7581l9011n5433o3002l9756k5362m3124n2005k5600
2215C25521201o706m2259p8082n7042j1683J073l4243p0095p0005m3422q226O825j6659
2241.5C25090677m9621n2512k2709P271n841l7432l4958k0474j6391o318L457K473
2265.9C24857622r387l0220m9174o5237o4373m3809l7343l8862o56O5744P9155M9025
2290.4C24712485N9754R7543J06781J03534J23560J56015J88113K27242K69950K87294
$$ y = [327027917, 327005982, 326998413, 326981217, 326963216, 326944381, 326911837, 326882690, 326877981, 326883286, 326869339, 326834142, 326804608, 326784581, 326755136, 326721579, 326695174, 326663196, 326611251, 326559246, 326540411, 326548010, 326539546, 326492786, 326444805, 326430142, 326402217, 326320082, 326234490, 326188833, 326156408, 326122969, 326103121, 326088816, 326060951, 326018095, 325976789, 325940818, 325902075, 325864494, 325825483, 325770050, 325707048, 325667292, 325641930, 325598806, 325546801, 325521201, 325514495, 325472236, 325394154, 325337112, 325325429, 325326502, 325292259, 325222164, 325152159, 325108737, 325100511, 325107336, 325090677, 325041056, 324988544, 324965835, 324973106, 324967265, 324929833, 324894875, 324874401, 324858010, 324851692, 324855149, 324857622, 324848235, 324818015, 324768841, 324703604, 324639231, 324595422, 324558079, 324519217, 324518561, 324584305, 324663460, 324712485, 324772239, 324869782, 324976563, 325080097, 325203657, 325359672, 325547785, 325775027, 326044977, 326332271]
2310.8C26332271K46614K13206K95371M15474M16219L12657K43037K61158K52545J24484
2331.2C29113036K0564N9724Q5860M3840m8727l63976q06630o83725P5311Q16762J083315
2353.6C29395354R26316N90145J22845k63929m76778o26504q29905r92924r84311r04888
2374C25955421q56668q09848p36028o20544m55231k75314j41561r6410j11580r9629
2394.4C21752608n3793m2379o0112o6071o3539o9439r6560j35809j69098j88828j97500
2416.9C20609480k62081m70579p71105p73102j34796O51568Q56727N88983L24548J69545
2437.3C20789188P2479N1946N2273K1994L875K741L606Q136K683k236K593j3858l3974
2463.8C20961446k8581j9103n961O140K920j251j0372k1517n960J8060K1189K0027
$$ y = [326332271, 326578885, 326792091, 327087462, 327502936, 327919155, 328231812, 328474849, 328736007, 328988552, 329113036, 329133600, 329193324, 329279184, 329323024, 329274297, 328910321, 328103691, 327419966, 327495277, 328312039, 329395354, 330321670, 330911815, 331034660, 330770731, 330293953, 329667449, 328837544, 327844620, 326860309, 325955421, 325098753, 324288905, 323552877, 322932333, 322477102, 322201788, 322060227, 321963817, 321852237, 321752608, 321698815, 321656436, 321596324, 321530253, 321466714, 321397275, 321300715, 321164906, 320995808, 320806980, 320609480, 320347399, 319876820, 319105715, 318332613, 318197817, 318849385, 319706112, 320295095, 320619643, 320789188, 320861667, 320913613, 320965886, 320987880, 320991755, 320994496, 320998102, 321006238, 321008921, 321006685, 321009278, 320995420, 320961446, 320932865, 320913762, 320907801, 320913941, 320916861, 320915610, 320905238, 320883721, 320877761, 320895821, 320917010, 320937037]
2488.3C20937037J5140n513k0594k1368j4514n603j0788j9610k7806m0978l3557k4319
2512.7C20727527l9101n4270n9723n7459m8310n5700o5864n1349o7621j05113q5414
2535.2C20037603n0693o5625r6232q8125n4449m7594n6625l3736j3024n1140r2686
2557.6C19387674p0631m6432p0811o7383j192M3810K1308o109p719p391k444M918J1146
2584.1C19188744J162k4497j9282J7136M1962L5256N483k8103m8429l4750J997L696
2608.6C19140375l8833n8353k5987j5527o4284o5714o855p689m2915l7283l0517n0664
2633.1C18695754o1900n3346n7637p4536o9559l1769j8030n4211n3108j1861k5570
2655.5C18184227p0364n2183j9968n6684q9228o1602k3692k0415m0263k9951j4633
$$ y = [320937037, 320952177, 320946664, 320926070, 320904702, 320890188, 320884585, 320873797, 320854187, 320826381, 320785403, 320751846, 320727527, 320688426, 320634156, 320574433, 320516974, 320468664, 320412964, 320347100, 320295751, 320228130, 320123017, 320037603, 319986910, 319921285, 319825053, 319736928, 319682479, 319634885, 319578260, 319544524, 319531500, 319480360, 319387674, 319317043, 319270611, 319199800, 319132417, 319131225, 319175035, 319196343, 319190234, 319182515, 319175124, 319172680, 319177598, 319188744, 319189906, 319165409, 319146127, 319163263, 319205225, 319240481, 319245964, 319217861, 319169432, 319134682, 319136679, 319140375, 319101542, 319043189, 319017202, 319001675, 318937391, 318871677, 318864822, 318857133, 318814218, 318776935, 318746418, 318695754, 318633854, 318580508, 318522871, 318448335, 318378776, 318347007, 318328977, 318274766, 318221658, 318209797, 318184227, 318113863, 318061680, 318041712, 317985028, 317895800, 317834198, 317810506, 317790091, 317749828, 317719877, 317705244]
2677.9C17705244m4793n0157j8418m5151q1837m8190j5170k9325m9174m5598k8848
2700.4C17248583l1740m0233j9371p16j5109m0174l1173J0073l0n7488o1542k7657
2724.8C16933423k1547k7478k3424l9339p2062n8651j4335p451m0382n9783o3628j03265
2749.3C16402078j27912p9542m4406r5755j60068j40339m0561O9857J24037J09076
2769.7C16016465N4867N245Q970L1948l636m9263k8878Q076j3709n2988j6541M6432
2794.2C16006988L5107j3947k2262J19k593k7061j9103J5915K4378J7106K0564J3352
2818.7C16048563l726R954M8071N4419K8789J5498J5705J0550K0415L2961O706l6985
2843.1C16250920p1019p8499p4446q0794n0634Q136L7670K5362j0252k0296k4676q0168
$$ y = [317705244, 317660451, 317610294, 317591876, 317546725, 317464888, 317416698, 317401528, 317372203, 317323029, 317277431, 317248583, 317216843, 317176610, 317157239, 317156523, 317141414, 317101240, 317070067, 317080140, 317080110, 317022622, 316961080, 316933423, 316911876, 316884398, 316860974, 316821635, 316749573, 316690922, 316676587, 316669136, 316628754, 316568971, 316505343, 316402078, 316274166, 316194624, 316150218, 316054463, 315894395, 315754056, 315713495, 315783352, 315907389, 316016465, 316071332, 316076577, 316085547, 316117495, 316113859, 316064596, 316035718, 316043794, 316030085, 315977097, 315960556, 316006988, 316042095, 316028148, 316005886, 316006005, 316003412, 315976351, 315957248, 315973163, 315997541, 316014647, 316035211, 316048563, 316044837, 316054791, 316102862, 316157281, 316186070, 316201568, 316217273, 316227823, 316248238, 316281199, 316287905, 316250920, 316179901, 316101402, 316026956, 315946162, 315895528, 315903664, 315941334, 315966696, 315956444, 315936148, 315911472, 315831304]
2867.6C15831304j06216o3926n8532p7903n2214k3990l5942o1959m9919l5703p6592
2890.1C15188408j00821n7638k7806n0753o8575n5403l5673k1487q375R120R924k8968
2914.5C14751953n2661k5302o735j2726k98L9816R6202J45078J75505K00034J89095
2937C15499961J54049J56313J68264J42425J09345J07944J00344O4284N4240P4655
2957.4C16631824Q6725R7304J45078J96993J88977J92254K47032K61635K20119J93865
2977.8C18461806J92493J72704J63019J78009J76788J65373J31726J03593J26213J21772
2998.1C19993496P6592P7933R9719R0599P7307M5031j4782m4673m1157l3021l7253
3020.6C20289791o6370o5267j6064j758l3021n7816p1764o5417m0471l9488n4866n3287
$$ y = [315831304, 315725088, 315661162, 315602630, 315524727, 315472513, 315448523, 315412581, 315350622, 315300703, 315265000, 315188408, 315087587, 315029949, 315002143, 314951390, 314882815, 314827412, 314791739, 314770252, 314761877, 314770997, 314780921, 314751953, 314699292, 314673990, 314667255, 314654529, 314654231, 314694047, 314790249, 314935327, 315110832, 315310866, 315499961, 315654010, 315810323, 315978587, 316121012, 316230357, 316338301, 316438645, 316502929, 316557169, 316631824, 316718549, 316815853, 316960931, 317157924, 317346901, 317539155, 317786187, 318047822, 318267941, 318461806, 318654299, 318827003, 318990022, 319168031, 319344819, 319510192, 319641918, 319745511, 319871724, 319993496, 320070088, 320148021, 320247740, 320338339, 320415646, 320460677, 320445895, 320401222, 320360065, 320327044, 320289791, 320223421, 320158154, 320142090, 320140332, 320107311, 320049495, 319977731, 319912314, 319871843, 319832355, 319777489, 319724202]
3045.1C19724202m4942k4587L130K68o259K1249M0621J3441j7554k205R239k0028k7775
3071.6C19668800l726k38k6017n9039o9380n6594n1201m1306j7166q017l3706n1826
3096C19250584l5704m2080o9172p3105q3476j11192r7484m6372l7372q8483j44184
3118.5C18421960j58578j40488j13666r5368j01298j24753j33842j17928r6887r6053
3138.9C17243099j23024j31845j28776j45763j28061q2910r7930j72705k20060k20627
3159.3C15791398k30998k23308j82927j91033k37316k57015k49237k48521k63185k78920
3179.7C13428938l06129l18646l07143k98053k86192k82198k86848l06636l46422l66986
3200.1C10323685l37630k69473k28792k51591k89679k90185k49356k35915k65301k56955
$$ y = [319724202, 319679260, 319654673, 319657803, 319658071, 319651812, 319673061, 319713682, 319727123, 319709569, 319707364, 319716603, 319696575, 319668800, 319665074, 319664836, 319638819, 319579780, 319510400, 319453806, 319402605, 319361299, 319344133, 319336116, 319302410, 319250584, 319214880, 319172800, 319103628, 319030523, 318947047, 318835855, 318738371, 318691999, 318654627, 318566144, 318421960, 318263382, 318122894, 318009228, 317913860, 317812562, 317687809, 317553967, 317436039, 317339152, 317243099, 317120075, 316988230, 316859454, 316713691, 316585630, 316502720, 316404790, 316232085, 316012025, 315791398, 315560400, 315337092, 315154165, 314963132, 314725816, 314468801, 314219564, 313971043, 313707858, 313428938, 313122809, 312804163, 312497020, 312198967, 311912775, 311630577, 311343729, 311037093, 310690671, 310323685, 309986055, 309716582, 309487790, 309236199, 308946520, 308656335, 308406979, 308171064, 307905763, 307648808]
3220.5C07648808k46734l02732l15308k39521k16991k68370l04937l05832k91288k81453
3240.9C04875642k46793k18451k50489k86102k66582k29060k38896k60800k50011k30462
3261.2C02397996k17497k04712j85728j70797k02090k89142l40641l25829l16768l31432
3281.6B99813360l40194l37779l26246l11554l39359m24027m97609n16862n00679m74870
3302B95744181m74066n31584o13779o68525o99968p00265o88612p20740p59095p39157
3322.4B89148390p26312p96735q56162q55594q83431r37432r50277r54717r95845j015394
3342.8B80176491r92984r73970j006275j099557j159787j134485j104057j124412j152426
3361.2B70428538j156538j155377j167089j183480j178383j142085j103342j038253
$$ y = [307648808, 307402074, 307099342, 306784034, 306544513, 306327522, 306059152, 305754215, 305448383, 305157095, 304875642, 304628849, 304410398, 304159909, 303873807, 303607225, 303378165, 303139269, 302878469, 302628458, 302397996, 302180499, 301975787, 301790059, 301619262, 301417172, 301128030, 300787389, 300461560, 300144792, 299813360, 299473166, 299135387, 298809141, 298497587, 298158228, 297734201, 297236592, 296719730, 296219051, 295744181, 295270115, 294738531, 294124752, 293456227, 292756259, 292055994, 291367382, 290646642, 289887547, 289148390, 288422078, 287625343, 286769181, 285913587, 285030156, 284092724, 283142447, 282187730, 281191885, 280176491, 279183507, 278209537, 277203262, 276103705, 274943918, 273809433, 272705376, 271580964, 270428538, 269272000, 268116623, 266949534, 265766054, 264587671, 263445586, 262342244, 261303991]
3377.5B61303991r40770q82923q55864q31842p93636p54297p53313p54803p32124o85871
3397.9B53318548o47068o68168o94334o51479n94527n54800n23314n09828m64752l99784
3418.3B47610494l94940m25026l82974k77028k08050j77085j26824p5922o1139m6849
3438.7B45434657J7568J13920J98215K25380J98007J93342K18406K74763L56957M04895
3459.1B47636110M16427M37051M78715M88743M42267M12539M40180M82470N40614N48362
3479.5B52323478M57824M31537N23955N75751N48989N37276N42521N28694N14865N42640
3499.9B57527530N79685N58406N33402N83261O45012O55770O51181O39796O22869O31243
3520.3B63628155O43969O40153O46621O53774O64085O87301P11769O91742O73979P65533
$$ y = [261303991, 260363221, 259480298, 258624434, 257792592, 256998956, 256244659, 255491346, 254736543, 254004419, 253318548, 252671480, 252003312, 251308978, 250657499, 250062972, 249508172, 248984858, 248475030, 248010278, 247610494, 247215554, 246790528, 246407554, 246130526, 245922476, 245745391, 245618567, 245542645, 245481506, 245434657, 245452225, 245566145, 245764360, 245989740, 246187747, 246381089, 246599495, 246874258, 247231215, 247636110, 248052537, 248489588, 248968303, 249457046, 249899313, 250311852, 250752032, 251234502, 251775116, 252323478, 252781302, 253212839, 253736794, 254312545, 254861534, 255398810, 255941331, 256470025, 256984890, 257527530, 258107215, 258665621, 259199023, 259782284, 260427296, 261083066, 261734247, 262374043, 262996912, 263628155, 264272124, 264912277, 265558898, 266212672, 266876757, 267564058, 268275827, 268967569, 269641548, 270407081]
3540.7B70407081Q60572Q34614P29411O82861P16716P51019P64817P85082Q18581Q69095
3561.1B78219849R33140R31859Q21233P30366Q03768R24468R71288R73433J015872
3579.4B86325276J105517J154244J105964J020909J030474J092077J108050J072198
3595.7B95014709J033038J008004J024932J067519J055419J022905J002640R99600
3612.1C03228766J021772J009256R27836Q43584Q47876R50873R72569P76470N55396
3630.4C11134398M65423M54753M90845M94212N10513O43552Q15123P98166M28677N9872
3650.8C16295534J18196K21968K22951K28137K01613K01523L59058M95315L39180J68979
3671.2C18852454J87993K683j83493q9526P3582L09199N03957M41015J22994m7118
$$ y = [270407081, 271267653, 272102267, 272831678, 273514539, 274231255, 274982274, 275747091, 276532173, 277350754, 278219849, 279152989, 280084848, 280906081, 281636447, 282440215, 283364683, 284335971, 285309404, 286325276, 287430793, 288585037, 289691001, 290711910, 291742384, 292834461, 293942511, 295014709, 296047747, 297055751, 298080683, 299148202, 300203621, 301226526, 302229166, 303228766, 304250538, 305259794, 306187630, 307031214, 307879090, 308829963, 309802532, 310579002, 311134398, 311599821, 312054574, 312545419, 313039631, 313550144, 314193696, 315008819, 315806985, 316235662, 316295534, 316413730, 316635698, 316858649, 317086786, 317288399, 317489922, 317848980, 318344295, 318683475, 318852454, 319040447, 319043130, 318859637, 318770111, 318843693, 319152892, 319656849, 320097864, 320220858, 320173740]
3691.6C20173740J6004R1225J74880J98484J20550J11938K11477K75582J02967k28494
3712C21248353j99318N1111J85996K24173K01225J05679K9564J17213K80559K98768
3732.4C22543323m560l65555k44886R8199J11908p0602P2122Q0168l02613l69906k3753
3754.8C21523845J07259l6270j17153l3944N1379Q6367N841j30385r2328R4057J54703
3777.3C21613371l010j22219j10149j08660j06215l8833J16528K31653K35975K43723
3797.7C21952164J06692j51574j70559j74492k25068k8491K19614K33531J15782R1105
3818C21968704o1214k29537j21266j8090K6346Q7320J61171K16186J41532n0187j80156
3840.5C21940809k40117k27213N544L38345L81798j47045n62429j81377J19746J54018
$$ y = [320173740, 320189744, 320280969, 320455849, 320654333, 320774883, 320886821, 321098298, 321373880, 321476847, 321248353, 321049035, 321100146, 321286142, 321510315, 321711540, 321817219, 321846783, 321963996, 322244555, 322543323, 322538763, 322173208, 321928322, 322026521, 322138429, 322067827, 322139949, 322220117, 321917504, 321547598, 321523845, 321631104, 321594834, 321477681, 321443737, 321495116, 321581483, 321587324, 321456939, 321364611, 321458668, 321613371, 321610361, 321488142, 321377993, 321269333, 321163118, 321124285, 321240813, 321472466, 321708441, 321952164, 322058856, 321907282, 321736723, 321562231, 321337163, 321308672, 321528286, 321761817, 321877599, 321968704, 321907490, 321677953, 321556687, 321538597, 321564943, 321652263, 321813434, 322029620, 322171152, 322120965, 321940809, 321700692, 321473479, 321479023, 321817368, 322199166, 322052121, 321489692, 321308315, 321428061, 321582079]
3860.9C21582079N4896k39K9147m2796j21147j13904l1501P4387L8474l069m4823j59293
3885.4C21262211l8237J12385p630m9173J39415K45362J39177p9185k47031k24710
3905.7C21252584q8363j669M5389O8217O7473M2796J1354q314m1843l3557N513N871
3930.2C21325451k2948n3078l5643M5538J00165M2588k861J4424m3392r9808m1008
3952.7C21229428J8597J8000n66l2216m0561Q94M2200L6448Q64j2338o26K2680L6299
3979.2C21319103N3942Q1301L5823m4287l0189K5034R626k1994N602
3997.5C21433961
$$ y = [321582079, 321636975, 321636736, 321665883, 321623087, 321501940, 321388036, 321356535, 321430922, 321469396, 321466327, 321421504, 321262211, 321223974, 321336359, 321328729, 321279556, 321418971, 321664333, 321803510, 321724325, 321477294, 321252584, 321164221, 321162552, 321207941, 321276158, 321343631, 321386427, 321397781, 321389467, 321347624, 321314067, 321319580, 321325451, 321302503, 321249425, 321213782, 321259320, 321359485, 321402073, 321399212, 321413636, 321370244, 321270436, 321229428, 321248025, 321266025, 321265459, 321233243, 321192682, 321193576, 321235776, 321272224, 321273088, 321260750, 321260124, 321282804, 321319103, 321373045, 321454346, 321490169, 321445882, 321415693, 321440727, 321450353, 321428359, 321433961]
##END=$$ End of the data block
