##TITLE=PANI HCl $$ Begin of the data block
##JCAMP-DX=5.00 $$ ACD/SpecManager v 10.08
##SPECTROMETER/DATA SYSTEM=Alpha
##DATE=07 Aug 2014 08:24:00
##DATA TYPE=INFRARED SPECTRUM
##DATA CLASS=XYDATA
##ORIGIN=
##OWNER=
##NPOINTS=1765
##FIRSTX=399.75695801
##LASTX=3997.56933594
##MAXX=3997.56933594
##MINX=399.75695801
##MAXY=0.54242277
##MINY=0.34915745
##XFACTOR=1.0000000000
##YFACTOR=1.000000000000000e-9
##FIRSTY=0.54120713
##DELTAX=2.03957629
##XUNITS=1/CM
##YUNITS=ARBITRARY UNITS
##XYDATA=(X++(Y..Y))
399.8E41207135j626730K52127r44912r55582J350105N30779l40819J702666J248002
418.1E42422771j239180n8413j04606j415253j013J85251j347720l05474j28090j845956
438.5E36162317p36296J09076j688897j152874n8293j517534j213193M68254p70867
456.9E29601693j708209o24538j626372k068699j57713l59476j311302j00434n06759
475.2E21138191j749992l89278K6226j582146j075029l61681j600444j177073l50833
493.6E12877941j901567j808226Q9169m54724r90629O68525P18236J20819J503229
511.9E10822773J722038Q27133J815141K022445O61373J240134J665890k09152l70920
530.3E20196855M17709r92417j288116J15812n79357j241565k6166n12004j689017
$$ plain form
399.8 541207135 539580405 539832532 538887620 537932038 539282143 539812922 539472103 541174769 542422771
418.1 542422771 541183591 541125178 541020572 539605319 539604306 539789557 538441837 538136363 538008273 536162317
438.5 536162317 535426021 535535097 533846200 532693326 532635033 531117499 529904306 530372560 529601693
456.9 529601693 527893484 527268946 525642574 523573875 523416162 523056686 521745384 521644950 521138191
475.2 521138191 519388199 518998921 519025147 517443001 516367972 516006291 514405847 513228774 512877941
493.6 512877941 510976374 509168148 509257317 508802593 507811964 508480489 509198725 509319544 510822773
511.9 510822773 512544811 513371944 515187085 517209530 517870903 519111037 520776927 520567775 520196855
530.3 520196855 520614564 519622147 518334031 518449843 517870486 516628921 516602755 516090751 514401734
548.6E14401734n44191j22785j159489o13272k44081j267136p55429O6161r42707q95262
569E07923543J59979n97179j044392p7427m16457r82285j3172K0623p03454K71141
589.4E04540920Q13306k03073K16305J071632L36110N16534J477301N97775j64032
607.8E09202778L71516m05252j388132m59135m1008m59909M42385Q37445j61945J11520
628.2E08050263P24614j79351k70903O09398J41263j76847P47919O03140p0870O00040
648.6E10778666O85334j79231K53617O20067k31444m5300O20782k16245r09746J77622
669E11554122L05414j41561M70698L78847k90930K26080L60310m27007j16170L13640
689.4E12633443m04775l73066K53976l18289o15537J96635J48476j81973O18875R11951
$$ plain form
548.6 514401734 513857543 513734758 512575269 511961997 511717916 510450780 509695351 509761512 508818805 507923543
569 507923543 508083522 507486343 506441951 506364524 505948067 504965782 504952610 504973233 504269779 504540920
589.4 504540920 505354226 505151153 505367458 506439090 506775200 507291734 508769035 509366810 509202778
607.8 509202778 509574294 509169042 507780910 507321775 507280767 506820858 507263243 508100688 507938743 508050263
628.2 508050263 508774877 508595526 508324623 508934021 509075284 508898437 509646356 510249496 510178626 510778666
648.6 510778666 511464000 511284769 511538386 512158453 511927009 511881709 512502491 512286246 511376500 511554122
669 511554122 511859536 511717975 512188673 512567520 512276590 512502670 512862980 512435973 512319803 512633443
689.4 512633443 512228668 511855602 512109578 511791289 511175752 511372387 511520863 511338890 511957765 512869716
709.8E12869716N06878J012325J226246L11792J35481M24743k67386n24938l219m12285
730.2E15279353p99895j17540j12057o73413k73347j04606o93560l90529J17242l84390
750.6E11847258m82381k1696l49700n67496o7532k49505o79791k47896j94669p31945
771E08254647m62174j69873p15435p66575l52919o40393p88390l48091m96924p53522
791.4E02760351k31803k6762k17617L47495Q60453N93543O87540R78231N89132M45783
811.7E06786346P63536N31852L85523R41098J123309J025259J542926J808107J397967
830.1E16305923J426220J621724J160323Q57175R56237O15239K55466L74496J70707
848.5E23743510k40862j01566q8156m53591l58522k31087o64890q37803o73234r51052
$$ plain form
709.8 512869716 513376594 514388919 515615165 515926957 516062438 516487181 516219795 515694857 515691638 515279353
730.2 515279353 514479458 514361918 514249861 513576448 513303101 513198495 512504935 512114406 512231648 511847258
750.6 511847258 511364877 511343181 510993481 510425985 510358453 510108948 509429157 509181261 508986592 508254647
771 508254647 507792473 507622600 506907165 506140590 505787671 505147278 504358888 504010797 503513873 502760351
791.4 502760351 502528548 502501786 502284169 502631664 503492117 504085660 504773200 505751431 506340563 506786346
811.7 506786346 507549882 508081734 508467257 509408355 510531664 511556923 513099849 514907956 516305923
830.1 516305923 517732143 519353867 520514190 521371365 522327602 522942841 523198307 523572803 523743510
848.5 523743510 523502648 523401082 523312926 522859335 522500813 522269726 521604836 520767033 520093799 519142747
868.9E19142747j112104o92725n13792m67658L2664L51905L58403P20382Q93533L15785
889.3E19029140j66177l32058p45117r19640o36340o84201q45135o00993n57244p77722
909.6E12764513o42716n02229o92725o25968m05312n72502o15657l40640m09186n90325
930E07367253m35233m63724o92725n64814m40299o25849n92709m08291n24223n87106
950.4E02032280m17352m72784n99146m57108m43607n93424m63098l73245n91963o14643
970.8D97005910m97461o66052p84397o73830p50035q59946o73235n84006o57201m46439
991.2D90413308k01970k31177k15202k20448n07087p07179o77168p68125q42810o83040
1011.6D85359102o64174q36343p82847o30438o32555n60045m41968n21452n57392m17233
$$ plain form
868.9 519142747 518030643 517337918 516824126 516356468 516389132 516741037 517099440 517819822 518713355 519029140
889.3 519029140 518862963 518530905 517785788 516866148 516229808 515545607 514700472 514099479 513542235 512764513
909.6 512764513 512121797 511619568 510926843 510300875 509895563 509323061 508707404 508366764 507957578 507367253
930 507367253 506932020 506468296 505775571 505210757 504770458 504144609 503551900 503143609 502619386 502032280
950.4 502032280 501614928 501142144 500542998 500085890 499642283 499048859 498585761 498212516 497620553 497005910
970.8 497005910 496508449 495842397 495058000 494384170 493634135 492774189 492100954 491516948 490859747 490413308
991.2 490413308 490211338 489980161 489764959 489544511 489037424 488330245 487653077 486884952 486042142 485359102
1011.6 485359102 484694928 483858585 483075738 482445300 481812745 481252700 480810732 480289280 479731888 479314655
1032D79314655m10527m76003l92168l78073m76867m32074l70502m63367m72337m07427
1052.4D75035310n23985o29663n67943n77837o51062o04689n62340o14911o00726n77211
1072.8D69124943o52492o11126m62354m54962m94867m40300m53800n27412n06192n37247
1093.2D63984191o47813o28829n88506o82414p31051o80059p02113p25448o21289n63741
1113.6D57412928n64843m06683k31295k06083j04785P5996J18404K04206L95715M12643
1134D57106203L82364N26368O34402O74457Q80688J141548J327813J620948J968444
1152.4D66263235K181112K387494K614469K648681K565533K529234K402693K236545
1168.7D85828996K303898K473086K562255K798587L202319L517121L834903M199505
$$ plain form
1032 479314655 478904128 478428125 478035957 477657884 477181017 476748943 476378441 475915074 475442737 475035310
1052.4 475035310 474511325 473881662 473313719 472735882 472084820 471480131 470917791 470302880 469702154 469124943
1072.8 469124943 468472451 467861325 467398971 466944009 466449142 466008842 465555042 465027630 464521438 463984191
1093.2 463984191 463336378 462707549 462119043 461436629 460705578 460025519 459323406 458597958 457976669 457412928
1113.6 457412928 456848085 456441402 456210107 456004024 455899239 455975235 456093639 456297845 456693560 457106203
1134 457106203 457488567 458014935 458649337 459323794 460204482 461346030 462673843 464294791 466263235
1152.4 466263235 468444347 470831841 473446310 476094991 478660524 481189758 483592451 485828996
1168.7 485828996 488132894 490605980 493168235 495966822 499169141 502686262 506521165 510720670
1185E10720670M257322L954470L391504K232313M86314j191556k474964l279626l374517
1203.3E14721930l021955k732635k430260k038777j877010j840174j647353j550645
1219.7D97583121j608461j511961j392305j416803j315116j087606r83835q28057n03361
1238D86935616k80709q6605K78592N16921N52178O81340P57069O14375N67883O39677
1258.4D91176337N15759L61383L68178K24948l4899j82450n21868j076907j430482
1276.8D89399999j660466j901358j862824j630753j580954j535326j288325j098752
1293.1D76841241r09865m85271p0333K64197Q02606J366556J688957K053112K485484
1311.4D84036684K591670K532094K588034K407551K009034J839012J655489J295298
$$ plain form
1185 510720670 514977992 518932462 522323966 524556279 525042593 523851037 521376073 518096447 514721930
1203.3 514721930 511699975 508967340 506537080 504498303 502621293 500781119 499133766 497583121
1219.7 497583121 495974660 494462699 493070394 491653591 490338475 489250869 488267034 487438977 486935616
1238 486935616 486654907 486568302 486846894 487363815 487915993 488597333 489354402 489968777 490536660 491176337
1258.4 491176337 491692096 492053479 492421657 492646605 492611706 492429256 491907388 490830481 489399999
1276.8 489399999 487739533 485838175 483975351 482344598 480763644 479228318 477939993 476841241
1293.1 476841241 475931376 475446105 475375772 475639969 476442575 477809131 479498088 481551200 484036684
1311.4 484036684 486628354 489160448 491748482 494156033 496165067 498004079 499659568 500954866
1327.8E00954866J129866J081109R35793J001298J207471J013637P25448Q35300Q97884
1346.1E09782672Q04484Q98659Q96633O66499N77271N82576M46975K41935n5194l67462
1366.5E14475048m83215l91126m16100p96437j017034j094997j454592j458406p49529
1384.9E06613612k78830m71831n45442n07057o98685q38161j022339j171290q49307
1403.2E00230670o81818q97407q20965o52849o87808m53323j38223o49512j119107
1421.6D94129658q31336p30276p35462n92798o13779n87910m46797p54684j044690
1439.9D87791926q00819m49508l94285n74469n88268m25577j39118J52678o27935j413614
1460.3D82531011q95858m18007o74158n44310K23428M50224j15097j93149J23650N26369
$$ plain form
1327.8 500954866 502084732 503165841 504101634 505102932 506310403 507324040 508049488 508884788 509782672
1346.1 509782672 510587156 511485815 512382448 513048947 513626218 514208794 514655769 514897704 514842510 514475048
1366.5 514475048 513991833 513600707 513184607 512388170 511371136 510276139 508821547 507363141 506613612
1384.9 506613612 506334782 505862951 505317509 504810452 504111767 503273606 502251267 501079977 500230670
1403.2 500230670 499548852 498651445 497830480 497177631 496489823 496036500 495898277 495248765 494129658
1421.6 494129658 493298322 492568046 491832584 491239786 490626007 490038097 489591300 488836616 487791926
1439.9 487791926 486991107 486541599 486147314 485572845 484984577 484559000 484419882 484572560 483944625 482531011
1460.3 482531011 481635153 481217146 480542988 479998678 480222106 480672330 480557233 480364084 480487734 481014103
1480.7D81014103J084506J596362J946181K156198J839459J294732J640022K189457
1497D94761020J513988Q45581J238287K130419J788318j05322n62012k90513Q6188
1515.4E01405954K06888r1016n04494q69632r59992r89854o81371k78264n80102p43330
1535.8D95914787o7800m9979j362979j889557j770466j276613p25776n10364k70963
1554.1D87990290M34756R66639m20690r65685k21163J46419L19392J46359j95146J94371
1574.5D88395542N55396Q3983O5774N56975O84053M22031K26318j2338m27514p13706
1594.9D89836514q81135j099378j174063j069248r88096p83741l28690J40190O98149
1613.3D84350502J733482K452284J702399R29117j33395j741887k562135k501369j738756
$$ plain form
1480.7 481014103 482098609 483694971 485641152 487797350 489636809 490931541 492571563 494761020
1497 494761020 496275008 497120589 498358876 500489295 502277613 502172291 501610279 501319766 501405954
1515.4 501405954 501612842 501521826 501017332 500147700 499187708 498197854 497516483 497238219 496658117 495914787
1535.8 495914787 495846987 495797008 494434029 492544472 490774006 489497393 488771617 488261253 487990290
1554.1 487990290 488425046 489391685 488970995 488005310 487784147 487930566 488249958 488396317 488201171 488395542
1574.5 488395542 488950938 489034921 489100695 489657670 490341723 490763754 490990072 490977734 490550220 489836514
1594.9 489836514 488955379 487856001 486681938 485612690 484624594 483840853 483512163 483652353 484350502
1613.3 484350502 486083984 488536268 490238667 491167784 491034389 489292502 486730367 484228998 482490242
1631.6D82490242p27386k56896o67989n51373K56002J172751J869858J623928J179129
1650D86388266J954764J919121L01480L69847J088112J492888J181543Q82775J213014
1668.4D96791810J111507M57525L95895L77953K09212M82797R48936N23746m94122
1686.7E00805259m18067j29283O5565M72367N95391K33769l37183n65410m00006m87149
1707.1D99835253m81963j56433J68383L77596N8800p31230p48128l47405j92523n3108
1727.5D97729242K54541M54814K98023k39164k69949k6137J9908R7245K33948L28690
1747.9D98881161J92017k19256k83033K0147J12831L2634k504r4145l3438J77294L02046
1770.3D99085754L1650m26739l79920j23978q9198j63377j75446j67399Q910K49803
$$ plain form
1631.6 482490242 481762856 481505960 480837971 480286598 480542600 481715351 483585209 485209137 486388266
1650 486388266 488343030 490262151 490563631 490933478 492021590 493514478 494696021 495578796 496791810
1668.4 496791810 497903317 498360842 498756737 499134690 499343902 499826699 500775635 501299381 500805259
1686.7 500805259 500387192 500257909 500323474 500795841 501391232 501625001 501287818 500722408 500322402 499835253
1707.1 499835253 499353290 499196857 499365240 499742836 499801636 499070406 498322278 497974873 497782350 497729242
1727.5 497729242 497983783 498438597 498736620 498497456 498227507 498201370 498221278 498318523 498552471 498881161
1747.9 498881161 499073178 498853922 498570889 498591036 498703867 498736501 498733997 498639852 498606414 498783708 499085754
1770.3 499085754 499117404 498690665 498310745 498186767 498097569 497934192 497758746 497591347 497600257 497850060
1790.7D97850060J8865l69727k44439l6657j15305k44528k27153j40310j1921k6613
1811.1D96452272k11358k00272q0585j17004r5040Q3119Q6427q524k2083k33472l64721
1833.6D95288759j92791o8217o8158P2121J83493j25974l73632k63184j54078j44124
1854D94154215r0659n9813j39296j32352K3782J43856O4879k15500l66986k82705j32203
1876.4D92967218o2287j07675j11998n9574m7476m1753p8559j40637j48713j39177
1896.8D92029369j52171j57803r2864k7239m0383p0214j07169j68383j10299L3141
1917.2D91135985l4482j58667j41144j74761k17527j43111o5893r6559j13964o8814
1937.6D89921063o6548q7768j14948j66118j92553j39028q6009j23859j25139p9841
$$ plain form
1790.7 497850060 497868925 497499198 497254759 497218102 497102797 496858269 496631116 496490806 496478885 496452272
1811.1 496452272 496240914 496040642 495960057 495843053 495748013 495831132 495917559 495909035 495886952 495653480 495288759
1833.6 495288759 495095968 495027751 494959593 495031714 495215207 495089233 494715601 494452417 494298339 494154215
1854 494154215 494063556 494003743 493864447 493732095 493755877 493899733 493964612 493749112 493382126 493099421 492967218
1876.4 492967218 492904931 492797256 492685258 492625684 492578208 492536455 492457896 492317259 492168546 492029369
1896.8 492029369 491877198 491719395 491626531 491599292 491558909 491488695 491381526 491213143 491102844 491135985
1917.2 491135985 491101503 490942836 490801692 490626931 490409404 490266293 490200400 490103841 489989877 489921063
1937.6 489921063 489854515 489766747 489651799 489485681 489293128 489154100 489068091 488944232 488819093 488739252
1958D88739252j26630j44273l6627j8925j28865j40428j07140j35123r2060l7342r6768
1980.4D87675071j05411k2501k0683k9295J5437p8618k00033j23561n7638j05738q5712
2002.8D86861318m5418j11908j46717q7082o9678p1585m4048j09673j84595r7543l7968
2025.3D85855103j13786j10268m8489q9496j12236n1766n3525q4520m8339n6982j14381
2047.7D84971315p8112k7955n8681n2779j4127n1498o4254k0832o9469r8288q077q195
2072.2D84419048p8648j9610M0292k1130l5256J3888j6153m2438K116j2726m5180J460
2096.7D84205663Q613m1068r864L8862j4424l7462N871k1338l5256K4557K1577j9521
2121.1D84126210O86L963l3557J907N5105J1444k0564J2219n930l2694J6779L2902
$$ plain form
1958 488739252 488612622 488468349 488431722 488412797 488283932 488143504 488036364 487901241 487809181 487771839 487675071
1980.4 487675071 487569660 487547159 487526476 487497181 487512618 487434000 487233967 487110406 487052768 486947030 486861318
2002.8 486861318 486815900 486703992 486557275 486470193 486400515 486328930 486284882 486175209 485990614 485893071 485855103
2025.3 485855103 485741317 485631049 485582560 485493064 485380828 485329062 485275537 485191017 485142678 485085696 484971315
2047.7 484971315 484893203 484865248 484806567 484753788 484739661 484688163 484623909 484603077 484533608 484435320 484427243 484419048
2072.2 484419048 484340400 484320790 484361082 484339952 484304696 484318584 484302431 484259993 484262109 484249383 484204203 484205663
2096.7 484205663 484214276 484173208 484163344 484202206 484187782 484150320 484156191 484134853 484099597 484124154 484145731 484126210
2121.1 484126210 484126896 484130859 484097302 484099209 484154314 484165758 484145194 484157413 484151483 484118789 484135568 484168470
2145.6D84168470q553k39k622n3555j9580N2571J4931l8475k6703m9859o3598J3798
2170.1D83986586M6164j4007l9488l1382n0217l3825K1517Q821l1858m590q34m3333
2194.6D83813554j1831J6748l9219m5956q046l6866l9667J9551l040o0380j8179K861
2219D83589530n1528k5392Q404m4167l8385L219l5823m6730J0580j4394p0006k6226
2243.5D83259082k414m6075k7805P391l0220m1753j3679m0323m0769L4004J2845q6307
2268D82983977o9827j1623k8819j7136K2739m977k0623k385m9531r4384o1005p1913
2292.5D82574493j19657p7903q2105j69069j37657q8662j87754k53857k01851j94966
2312.9D81061012k30104k45869l09378l49134k47866j75208k42740k28673r5189r2357
$$ plain form
2145.6 484168470 484159917 484159678 484157056 484103501 484083921 484136492 484151423 484112948 484086245 484036386 483972788 483986586
2170.1 483986586 484032750 484018743 483979255 483947873 483897656 483863831 483885348 483894169 483862311 483857721 483856887 483813554
2194.6 483813554 483801723 483818471 483779252 483733296 483725250 483688384 483648717 483668268 483665228 483604848 483586669 483589530
2219 483589530 483538002 483512610 483521014 483476847 483438462 483441681 483405858 483359128 483369708 483355314 483285308 483259082
2243.5 483259082 483256668 483210593 483182788 483190179 483159959 483118206 483104527 483064204 483023435 483057439 483070284 482983977
2268 482983977 482914150 482902527 482873708 482856572 482879311 482874334 482853711 482851326 482801795 482707411 482646406 482574493
2292.5 482574493 482454836 482376933 482294828 482125759 481988102 481899440 481711686 481457829 481255978 481061012
2312.9 481061012 480830908 480585039 480275661 479926527 479678661 479503453 479260713 479032040 478936851 478844494
2333.3D78844494j89364k23369k43574j84804J07050M68731M22477m2319n44190q12591
2353.6D77602541o68853k95609j03474k4497J97708L81470M57525N40018N28634M43160
2374D79058623M58747M75288L98815L57389L10391J36942q315q702k4438o3062N245
2396.5D81096923N1111j7255m7267l0100n7071m2528J0967k0921n5701k6137m3302
2418.9D80818719o9529p123J5855n6803n8830j1295m7118n8949R239r537p1972k5183
2443.4D80427474n096n9784k8878O735n6386o4164p868k8640l7343K5034J1176n4180
2467.9D80128080l5256k1756n5373n96N7042n365l4809q9l5703m6254K8670J5825n2392
2494.4D79942024j7524J3471k8253j0520K1428l2544m7863l874l3498n5522j281k1458
$$ plain form
2333.3 478844494 478655130 478431761 478188187 478003383 478110433 478579164 479001641 478959322 478415132 477602541
2353.6 477602541 476933688 476638079 476534605 476510108 476707816 477089286 477546811 478086829 478615463 479058623
2374 479058623 479517370 479992658 480391473 480748862 481059253 481196195 481187880 481179178 481154740 481091678 481096923
2396.5 481096923 481148034 481130779 481083512 481053412 480996341 480953813 480964780 480943859 480888158 480862021 480818719
2418.9 480818719 480749190 480742067 480757922 480701119 480642289 480630994 480583876 480524927 480534166 480524629 480452657 480427474
2443.4 480427474 480422378 480362594 480333716 480340451 480284065 480219901 480212033 480183393 480146050 480171084 480182260 480128080
2467.9 480128080 480092824 480071068 480015695 480015099 480072141 480066776 480031967 480031878 479996175 479949921 479978591 479994416 479942024
2494.4 479942024 479924500 479937971 479909718 479899198 479920626 479888082 479840219 479836345 479802847 479747325 479746044 479724586
2518.9D79724586q6904n7518m6730j19418j11431l6627l8981n3972l7939q1658r5576
2541.3D78957832p808o378q4192p0750m0502o4671m5001q35l6150o1870k8163m8756
2565.8D78462756n8860K5302L9846l8236k3723J8537k3901j6094L9339K593l4690J1593
2590.2D78404462J1951k4736P719J6659k9653j8149j0878o0350k0325N8710L606n3912
2614.7D78285104j4842l8564r1284k8670J2070m1872m8966l9875p1228n0127m769l5047
2639.2D77831930p2986m9442m5151o4790k2828J877o2585p8588l5733m6134l7641Q524
2663.7D77326453j9729o7532m6403m7862n7340K504N66p3701n9188j6391n5611n4062
2688.1D76831704J1087k0325p6682l9607m6462p8976n275K6166m2140m9472l0815p7695
$$ plain form
2518.9 479724586 479637682 479580164 479533434 479414016 479302585 479265958 479226977 479173005 479135066 479053408 478957832
2541.3 478957832 478950024 478943646 478859454 478788704 478748202 478683531 478638530 478637695 478601545 478539675 478511512 478462756
2565.8 478462756 478403896 478429198 478469044 478430808 478407085 478425622 478401721 478385627 478424966 478427559 478392869 478404462
2590.2 478404462 478416413 478391677 478399396 478416055 478386402 478368253 478357375 478297025 478276700 478335410 478339016 478285104
2614.7 478285104 478270262 478231698 478140414 478111744 478123814 478081942 478032976 477993101 477921873 477871746 477866977 477831930
2639.2 477831930 477758944 477709502 477664351 477599561 477576733 477578610 477516025 477437437 477401704 477355570 477317929 477326453
2663.7 477326453 477306724 477239192 477192789 477144927 477087587 477090091 477090657 477016956 476957768 476941377 476885766 476831704
2688.1 476831704 476842791 476822466 476745784 476706177 476659715 476580739 476575464 476601630 476559490 476510018 476479203 476401508
2712.6D76401508n9962L3229J9700m6194k7835j5140m5985k4050k534m8697n6207l6716
2737.1D76091117o4731k4259N6416J0133o1810n0098o0708q5741k6792O944p0810q4848
2761.6D75634813o318j7255m6403J1921J5915m6462n0753l1263m7594l1233j3650n9306
2786D75312412m2171J5766l2693n7280L3349L2603o2585m8965j5259n0395j3143K4676
2810.5D75096315n2959p2300l189o556j9342J8477k3812r2655m2945J698m9233n2094
2835D74701405k1488j04755j97321j94222k00510k12848j76728j57684j17689J4334
2855.4D73332494R0957L3319K682J3143n0157r5636m1216j0103m2796n6178o5923q6933
2879.9D73023653n8085m6611r4145p3463m8309j24157j27613n0605p9989j22786p0005
$$ plain form
2712.6 476401508 476341546 476374775 476394475 476348281 476320446 476305306 476259321 476235271 476232737 476184040 476127833 476091117
2737.1 476091117 476026386 476002127 476058543 476068676 476006866 475956768 475896060 475810319 475783527 475790471 475719661 475634813
2761.6 475634813 475628495 475611240 475564837 475576758 475592673 475546211 475495458 475464195 475416601 475385368 475371718 475312412
2786 475312412 475270241 475286007 475253314 475196034 475229383 475261986 475199401 475150436 475135177 475084782 475071639 475096315
2810.5 475096315 475043356 474971056 474967867 474961311 474941969 474960446 474936634 474843979 474801034 474802732 474753499 474701405
2835 474701405 474679917 474575162 474377841 474183619 473983109 473770261 473593533 473435849 473318160 473332494
2855.4 473332494 473423451 473456770 473459452 473472595 473422438 473326802 473285586 473275483 473232687 473176509 473110586 473023653
2879.9 473023653 472965568 472918957 472824812 472751349 472703040 472578883 472451270 472400665 472320676 472197890 472127885
2902.3D72127885o5416j16736q8722p2807j41442j69098j53154j74105j54078l6806
2922.7D70955521M6253R9778K11567K44111J76906J92017K47568K35289K60144L07441
2943.1D72976595K19822Q8900Q0020R7304N3972M9949P3761Q7887J50770J80751J41620
2965.5D74201351J88202K82765K70694K24411K06709J55509J28210J66773J62304R8675
2985.9D76085603R3311J48803J42753J12921J21952N1856k1071K6077L0220o527N8800
3008.3D76844698R4861j818q6725j09702j47700j47105p9870p1257j05232o9827k5302
3030.8D76095021l9399q1777j25856j16646l7581k0086j15693j36644l5912l7014j20610
3053.2D75227803p6026m3362j11699o2615K3097k8104q8662j06543j48028j28239p540
$$ plain form
2902.3 472127885 472062469 471945733 471857011 471784204 471642762 471473664 471320510 471146405 470992327 470955521
2922.7 470955521 471001774 471101552 471313119 471557230 471734136 471926153 472173721 472409010 472669154 472976595
2943.1 472976595 473196417 473285317 473365337 473462641 473516613 473566562 473640323 473728210 473878980 474059731 474201351
2965.5 474201351 474389553 474672318 474943012 475167423 475374132 475529641 475657851 475824624 475986928 476085603
2985.9 476085603 476178914 476327717 476470470 476583391 476705343 476757199 476736128 476762205 476792425 476785898 476844698
3008.3 476844698 476939559 476937741 476851016 476741314 476593614 476446509 476366639 476295382 476190150 476120323 476095021
3030.8 476095021 476055622 475973845 475847989 475731343 475693762 475673676 475557983 475421339 475385427 475348413 475227803
3053.2 475227803 475151777 475108415 474996716 474934101 474957198 474929094 474840432 474733889 474585861 474457622 474450082
3075.6D74450082L2812n5462j09166j26302j52350j08599q1510j61886j91838j29550
3096D73366231j07736j14828j24335j87636k02864j33276j44214j74641q6814p2152
3116.4D72017735j98543k58684k67774k98560k50250j62184j81198k46674k32786j99139
3136.8D69721943k13414k28375k50549l13371l25114k50488k16007k53767l00765l68327
3157.2D67001766m05222l60370l48210l90589l73871l51309m10140m40270m18752m65930
3177.6D63037103n03867m55499m46141m99695n23538n24491n38528n28991n21243n69254
3198D57925856n78135n26875n42730n50092m77969m85182n43028n25922n29855n71162
3218.4D52594906n46157n35041o01828o13213n37187m83125m92216n56796o17862o08653
$$ plain form
3075.6 474450082 474482894 474427432 474318266 474191964 474039614 473931015 473849505 473687619 473495781 473366231
3096 473366231 473258495 473143667 473019332 472831696 472628832 472495556 472351342 472176701 472089887 472017735
3116.4 472017735 471819192 471560508 471292734 470994174 470743924 470581740 470400542 470153868 469921082 469721943
3136.8 469721943 469508529 469280154 469029605 468716234 468391120 468140632 467924625 467670858 467370093 467001766
3157.2 467001766 466596544 466236174 465887964 465497375 465123504 464772195 464362055 463921785 463503033 463037103
3177.6 463037103 462533236 462077737 461631596 461131901 460608363 460083872 459545344 459016353 458495110 457925856
3198 457925856 457347721 456820846 456278116 455728024 455250055 454764873 454221845 453695923 453166068 452594906
3218.4 452594906 452048749 451513708 450911880 450298667 449761480 449278355 448786139 448229343 447611481 447002828
3238.8D47002828n59300n23716n02378m83364n01931n41120n15342m57257m48167m38989
3259.2D42031264m01824m18872m48614l84421l11315l69429m74572n10455n49554n83649
3279.6D37578559n75334n97834o26565n87821n27799n61177o78897p87854q66056q63314
3300D30905908p62075p05391q13872j005828j137882j175195j146794j149177j214743
3318.4D21794951j234829j209110j251251j353502j409352j440734j482635j463652
3334.7D10949886j432628j506567j619309j682639j740485j756132j705229j733512
3351C97773385j865208j934975j897991j875490j905203j886874j798541j755863j838804
3369.3C81014436j960814j921415j752585j636535j553923j497775j463592j358211
$$ plain form
3238.8 447002828 446443528 445919812 445417434 444934070 444432139 443891019 443375677 442918420 442470253 442031264
3259.2 442031264 441629440 441210568 440761954 440377533 440066218 439696789 439222217 438711762 438162208 437578559
3279.6 437578559 437003225 436405391 435778826 435191005 434663206 434102029 433423132 432635278 431769222 430905908
3300 430905908 430143833 429438442 428624570 427618742 426480860 425305665 424158871 423009694 421794951
3318.4 421794951 420560122 419351012 418099761 416746259 415336907 413896173 412413538 410949886
3334.7 410949886 409517258 408010691 406391382 404708743 402968258 401212126 399506897 397773385
3351 397773385 395908177 393973202 392075211 390199721 388294518 386407644 384609103 382853240 381014436
3369.3 381014436 379053622 377132207 375379622 373743087 372189164 370691389 369227797 367869586
3385.7C67869586j188159j043529j062184j215428j221627j032502r15646j025737
3402C59164774j170039j083225r05990q61079q69065q29608p56591o57737n63980n46217
3422.4C50921243n36799m00722k36362k08438j59502k0623k5660j21712n3972J27375
3442.8C49284828K89410L83586L36736L12537M44323N56588N86867O65576P26461P13021
3463.2C54299933Q05229R06676P85827O30260O67721P87586Q59350Q65161Q14766P90447
3483.6C62212956Q66115Q94547Q10027Q17299R38892J011699R74834R71973J052857
3501.9C70551199R67622P98404Q85039J024992J000821R86219J027375J061052J127482
3520.3C79430205J230716J222581J155794J138180J081646J058072J175433J244992
$$ plain form
3385.7 367869586 366681427 365637898 364575714 363360286 362138659 361106157 360190511 359164774
3402 359164774 357994735 356911510 356005520 355144441 354275376 353445768 352689177 352031440 351467460 350921243
3422.4 350921243 350384444 349983722 349747360 349538922 349379420 349358797 349333137 349211425 349157453 349284828
3442.8 349284828 349574238 349957824 350294560 350607097 351051420 351608008 352194875 352860451 353586912 354299933
3463.2 354299933 355105162 356011838 356797665 357427925 358095646 358883232 359742582 360607743 361422509 362212956
3483.6 362212956 363079071 363973618 364783645 365600944 366539836 367551535 368526369 369498342 370551199
3501.9 370551199 371518821 372317225 373202264 374227256 375228077 376214296 377241671 378302723 379430205
3520.3 379430205 380660921 381883502 383039296 384177476 385259122 386317194 387492627 388737619
3536.6C88737619J167446J206100J404047J494825J294673J062333J157880J340747
3552.9C98865670J276165J212895J358420J465559J453757J627177J819849J471222
3569.2D10550714J155436J315265J526207J623273J715422J738369J735926J935691
3585.5D23296303K070456J701564J497179J785994J901477J746565J734078J728595
3601.9D37462211J642227J779049K038211J932502J718134J633942J530975J660675
3618.2D51397926J594215J097799R67443J369148J932025J521438P47234P72893Q88378
3636.5D62288499Q61317Q96483R18657J032621J406401J549512O57231j47343R2179
3654.9D69555557M79907L24785K23011L08305L70175N58138Q07106N38439J93804K86609
$$ plain form
3536.6 388737619 389905065 391111165 392515212 394010037 395304710 396367043 397524923 398865670
3552.9 398865670 400141835 401354730 402713150 404178709 405632466 407259643 409079492 410550714
3569.2 410550714 411706150 413021415 414547622 416170895 417886317 419624686 421360612 423296303
3585.5 423296303 425366759 427068323 428565502 430351496 432252973 433999538 435733616 437462211
3601.9 437462211 439104438 440883487 442921698 444854200 446572334 448206276 449737251 451397926
3618.2 451397926 452992141 454089940 455057383 456426531 458358556 459879994 460627228 461400121 462288499
3636.5 462288499 463149816 464046299 464964956 465997577 467403978 468953490 469610721 469463378 469555557
3654.9 469555557 470035464 470360249 470583260 470891565 471261740 471819878 472626984 473165423 473359227 473645836
3675.3D73645836n5611l24428p7576J61380M30316Q84622Q54999M8786k87056p6770
3695.7D75204498J36226L35246M04716J17361J4753L66091O65188L99143k12551l34382
3716.1D77096289m3362J75953J77979Q9944m5002j30176J68621O75470P19130J07616
3736.5D78992462m19348l22968K52902O08832J13130l3915J46091l06189n20617j96070
3756.9D78314310K1726j26153j87188L6984J36853R6708o1899k41161j11758J59055
3777.3D78037477K09420n2094j60813o9231q4132p0512p093J06781L11554K73824K10285
3799.7D78705466K15053j86979k38985r4354k82258k12670J78665M19349K36988K39700
3820.1D78979975Q9675l92914l60727j48326M9353K45511K77370L35932K21402k23727
$$ plain form
3675.3 473645836 473590225 473265797 473188221 473349601 473779917 474664539 475519538 475568324 475281268 475204498
3695.7 475204498 475340724 475675970 476080686 476198047 476212800 476578891 477244079 477643222 477430671 477096289
3716.1 477096289 477052927 477228880 477406859 477496803 477451801 477321625 477490246 478165716 478884846 478992462
3736.5 478992462 478573114 478250146 478503048 479111880 479225010 479191095 479337186 479030997 478510380 478314310
3756.9 478314310 478336036 478209883 478022695 478059679 478196532 478293240 478231341 477990180 477878422 478037477
3777.3 478037477 478246897 478194803 478033990 477964759 477880627 477810115 477803022 477909803 478221357 478495181 478705466
3799.7 478705466 478920519 478733540 478494555 478400201 478117943 477905273 478083938 478503287 478740275 478979975
3820.1 478979975 479069650 478676736 478316009 478167683 478217036 478462547 478739917 479075849 479297251 479073524
3840.5D79073524m27365l91453k76119m768L73482P08163J81228n86152m62264l2693
3860.9D78155583J92791O6698j09613M7237Q9436j29848k11895j73628J18822K39640
3881.3D78285223K2292l039j01895j20878J8150j50055j98990J65433M16577K57045
3901.7D78589863p1675l94970m74721k22803l784O2257J89691J84626m8578j15484
3922.1D77694422L1829P7367K4199M9174K4229j12921j44958l0458R0241R5785k5660
3944.5D77773249o1422m441k5719p7784p4506j5944N2481R6172N8383j9848j7434R387
3969D77692574j7822k3126K3246L0517K146R418L2842J8716l88K3604K4497q047j0103
3995.5D77798074k1815
$$ plain form
3840.5 479073524 478646159 478254706 477978587 477973819 478347301 479055464 479236692 478650540 478188276 478155583
3860.9 478155583 478348374 478415072 478305459 478352696 478442132 478312284 478100389 477926761 478045583 478285223
3881.3 478285223 478307515 478304476 478202581 478081703 478099853 477949798 477750808 477916241 478332818 478589863
3901.7 478589863 478518188 478123218 477648497 477425694 477421910 477484167 477673858 477858484 477809906 477694422
3922.1 477694422 477726251 477803618 477827817 477876991 477901220 477788299 477643341 477612883 477703124 477798909 477773249
3944.5 477773249 477711827 477707386 477681667 477603883 477529377 477513433 477565914 477662086 477720469 477700621 477683187 477692574
3969 477692574 477674752 477651626 477674872 477705389 477707535 477716953 477749795 477768511 477768123 477791727 477816224 477808177 477798074
3995.5 477798074 477776259
3997.5D77776259
$$ plain form
3997.5 477776259
##END=$$ End of the data block
