##TITLE=PANI HCl $$ Begin of the data block
##JCAMP-DX=5.00 $$ ACD/SpecManager v 10.08
##SPECTROMETER/DATA SYSTEM=Alpha
##DATE=07 Aug 2014 08:24:00
##DATA TYPE=INFRARED SPECTRUM
##DATA CLASS=XYDATA
##ORIGIN=
##OWNER=
##NPOINTS=1765
##FIRSTX=399.75695801
##LASTX=3997.56933594
##MAXX=3997.56933594
##MINX=399.75695801
##MAXY=0.23019493
##MINY=0.15727364
##XFACTOR=1.0000000000
##YFACTOR=1.000000000000000e-9
##FIRSTY=0.22941495
##DELTAX=2.03957629
##XUNITS=1/CM
##YUNITS=ARBITRARY UNITS
##XYDATA=(X++(Y..Y))
399.8B29414955m73559m18216J17630M01139J23456k3380L40372N94885J17644k64674
$$ 229414955 228941396 228523180 228640810 229041949 229165405 229142025 229482397 230077282 230194926 229930252
420.2B29930252N6982L7819k86818n72785o59004l92884k81960p04229j067191q75563
$$ 229930252 229987234 230025053 229738235 229165450 228506446 228113562 227831602 227127373 226060182 225184619
440.5B25184619n99160q16659j214802j135051o79404m24355m49836o33255r61005
$$ 225184619 224585459 223768800 222553998 221418947 220739543 220315188 219865352 219232097 218271092
458.9B18271092j137570j087755r15423p17819n93081m91440m20869n20959p24986
$$ 218271092 217133522 216045767 215130344 214412525 213819444 213328004 212907135 212386176 211661190
477.3B11661190q33348p59408o39468o85200q26970q98510r17926q97170r34511j036286
$$ 211661190 210827842 210068434 209428966 208743766 207916796 207018286 206100360 205203190 204268679 203232393
497.7B03232393r56461o20216j25349K60964M50924P31215J166672J474008J554235
$$ 203232393 202275932 201655716 201530367 201791331 202242255 202973470 204140142 205614150 207168385
516B07168385J516894J481324J450703J191750P28488L60072N6028l54290p38248r04009
$$ 207168385 208685279 210166603 211617306 212809056 213537544 213897616 213953644 213599354 212861106 211957097
536.4B11957097p70271m95270m39062o15642p13840o80432o31019n57929n89818o85051
$$ 211957097 211186826 210691556 210252494 209636852 208923012 208242580 207611561 207053632 206463814 205778763
556.8B05778763n97775m61996m60908n60552o56321n58302l00884k55510m72114o60375
$$ 205778763 205180988 204718992 204258084 203697532 203041211 202482909 202182025 201926515 201454401 200794026
577.2B00794026o01247l38942k31370l01793k12207R9703L39419K81900J46523K18034
$$ 200794026 200192779 199853837 199622467 199320674 199108467 199208170 199547589 199829489 199976012 200194046
597.6B00194046M96000O81445M82827J22026q0064k47583n36218q67963r68277o41287
$$ 200194046 200690046 201371491 201854318 201976344 201896280 201648697 201112479 200244516 199276239 198634952
618A98634952j80289j1295j36062k39775j94654j63019k29582k61262j74388l0369
$$ 198634952 198454663 198443368 198307306 198067531 197872877 197709858 197480276 197219014 197044626 197014257
638.4A97014257P9632K1145j46926j28015J01417J79157k549j50486j20774o3524j07378
$$ 197014257 197093889 197115034 196968108 196840093 196941510 197120667 197118118 196967632 196846858 196783334 196675956
660.8A96675956j91107k67655l95283k57581O4954n6073j87129m6790M4883q1778k52441
$$ 196675956 196484849 196217194 195821911 195564330 195629284 195573211 195386082 195339292 195384175 195302397 195049956
683.3A95049956k87041j98543j52513k05398k75224k94104k40222k10479k54825k28554
$$ 195049956 194762915 194564372 194411859 194206461 193931237 193637133 193396911 193186432 192931607 192703053
703.7A92703053j8507K96220N04479N14731M98503N53221M61310J53691j46345l20032
$$ 192703053 192684546 192980766 193485245 193999976 194498479 195051700 195513010 195666701 195520356 195200324
724A95200324l86685l99277m30911m63531m23998l27155k96339l68476m30614l86774
$$ 195200324 194813639 194414362 193983451 193519920 193095922 192768767 192472428 192103952 191673338 191286564
744.4A91286564k19926j43156k91437l97294l36126k42636k17571l13849m13596l56183
$$ 191286564 191066638 190923482 190632045 190234751 189898625 189655989 189438418 189124569 188710973 188354790
764.8A88354790k59205l19347m37007m37632m13313m55723n16980n92947o37517o04376
$$ 188354790 188095585 187776238 187339231 186901599 186488286 186032563 185515583 184922636 184285119 183680743
785.2A83680743n75349n90890n58392m17053k19986l3513J60322L84807N68420O39156
$$ 183680743 183105394 182514504 181956112 181539059 181319073 181285560 181445882 181830689 182399109 183038265
805.6A83038265O24656N20289L35947K38061K88665M19408O15969Q44405J080676J332209
$$ 183038265 183662921 184183210 184519157 184757218 185045883 185465291 186081260 186925665 188006341 189338550
826A89338550J496419J464501J294464J130328R94816Q13455N98952L62068J28031
$$ 189338550 190834969 192299470 193593934 194724262 195719078 196532533 197131485 197493553 197621584
844.4A97621584P585j3918r3594k21119k56195k65464l58329m80249n75125o45668
$$ 197621584 197629169 197615251 197521657 197300538 197044343 196778879 196420550 195940301 195365176 194719508
864.8A94719508p13080p73877p98166p32615n21526k29239K6732K34545M40582O08474
$$ 194719508 194006428 193232551 192434385 191701770 191180244 190951005 190977737 191212282 191652864 192261338
885.2A92261338O04436L49760q1658m49732n84632n88611n89401n84989n42626m67837
$$ 192261338 192865774 193215534 193133876 192684144 192099512 191510901 190921500 190336511 189793885 189326048
905.6A89326048m11555m20600m70996m74915l89412l34174l87594m01601l06204k11805
$$ 189326048 188914493 188493893 188022897 187547982 187158570 186824396 186436802 186035201 185728997 185517192
926A85517192j86741k46078l50267l70681l01272k87399l59609m04254l40938k40878
$$ 185517192 185330451 185084373 184734106 184363425 184062153 183774754 183415145 183010891 182669953 182429075
946.4A82429075k34663l06845l27036k70694k33904k65255l08544k95877k34813k15500
$$ 182429075 182194412 181887567 181560531 181289837 181055933 180790678 180482134 180186257 179951444 179735944
966.8A79735944k95610l85105l83794l25785l27140m22984n09515m80906l66538k98649
$$ 179735944 179440334 179055229 178671435 178345650 178018510 177595526 177086011 176605105 176238567 175939918
987.1A75939918k99678k70381j48043J2204L7133j41531l49641m24727m22031m67181
$$ 175939918 175640240 175369859 175221816 175234020 175271153 175129622 174779981 174355254 173933223 173466042
1007.5A73466042n52252n67198n04077m40716m14804m08798l47078k36333j71974j95905
$$ 173466042 172913790 172346592 171842515 171401799 170986995 170578197 170231119 169994786 169822812 169626907
1027.9A69626907k53901k62753k28300j94803j94669k37420k50205j81020j25780j82033
$$ 169626907 169373006 169110253 168881953 168687150 168492481 168255061 168004856 167823836 167698056 167516023
1048.3A67516023k60279k53647k33084k63319l21120l68535l36513k79084k98500l33220
$$ 167516023 167255744 167002097 166769013 166505694 166184574 165816039 165479526 165200442 164901942 164568722
1068.7A64568722l13997k68012k36899k44528k82168k71231j84164j33842j90288k70203
$$ 164568722 164254725 163986713 163749814 163505286 163223118 162951887 162767723 162633881 162443593 162173390
1089.1A62173390k95445k78458k68549l16411l70964l77909l70487l59759l78668m22791
$$ 162173390 161877945 161599487 161330938 161014527 160643563 160265654 159895167 159535408 159156740 158733949
1109.5A58733949m03479l20807k50980k10375j72108j02565L368Q7470J20267J64539
$$ 158733949 158330470 158009663 157758683 157548308 157376200 157273635 157277003 157364473 157484740 157649279
1129.9A57649279K54362L19347L48509L82036M19214N09247O60822Q10712R61260J121684
$$ 157649279 157903641 158222988 158571497 158953533 159372747 159881994 160542816 161353528 162314788 163436472
1150.3A63436472J300067J513988J664117J700148J692936J643941J536503J378313
$$ 163436472 164736539 166250527 167914644 169614792 171307728 172951669 174488172 175866485
1166.6A75866485J237720J212761J317247J500354J693740J959607K413377K959669
$$ 175866485 177104205 178316966 179634213 181134567 182828307 184787914 187201291 190160960
1182.9A90160960L405556L647551L596440L122032K114012O28576r73925k201632k785697
$$ 190160960 193566516 197214067 200810507 203932539 206046551 206675127 205701202 203499570 200713873
1201.3B00713873k818957k581313k278090j976341j682013j429722j291469j226350
$$ 200713873 197894916 195313603 193035513 191059172 189377159 187947437 186655968 185429618
1217.6A85429618j171842j125098j063287j020893j002789r38535q07062o44728n19797
$$ 185429618 184257776 183132678 182069391 181048498 180045709 179107174 178300112 177655384 177135587
1236A77135587m01005j99393K5660K02283L34621M16413M73678N15297M93228M05550
$$ 177135587 176734582 176535189 176560849 176763132 177097753 177514166 177987844 178503141 178996369 179401919
1256.4A79401919L20390K84255K63586K02835R3400m9278k20775m44889p45461j037150
$$ 179401919 179722309 180006564 180270150 180472985 180566385 180517107 180296332 179851443 179105982 178068832
1276.8A78068832j199007j217634j148656j070887r96545q73089p31617o08042m57674
$$ 178068832 176869825 175652191 174503535 173432648 172436103 171563014 170831397 170223355 169765681
1295.1A69765681k60234k5511K53365N67779Q78587J157686J404390J625031J784906
$$ 169765681 169505447 169479936 169733301 170301080 171179667 172337353 173741743 175366774 177151680
1313.5A77151680J813352J752600J671121J525923J315087J090303R01953P80284O94946
$$ 177151680 178965032 180717632 182388753 183914676 185229763 186320066 187222019 188002303 188697249
1331.8A88697249O04704N51998N88194O81773P31900P22259P16523P18727O97911O22586
$$ 188697249 189301953 189853951 190442145 191123918 191855818 192578077 193294600 194013327 194711238 195333824
1352.2A95333824N19529M04745K82705J66267N0023p1600j99616l27736m02838m69714
$$ 195333824 195853353 196258098 196540803 196707070 196757093 196685493 196485877 196158141 195755303 195285589
1372.6A95285589o08355o99029p51212q32975q37415o83934n41746n23985n24595n91710
$$ 195285589 194677234 193978205 193226993 192394018 191556603 190872669 190330923 189806938 189282343 188690633
1393A88690633o78704o41003n92530n53578n13583n34252n09411m64066m71697m51937
$$ 188690633 188011929 187370926 186778396 186224818 185711235 185176983 184667572 184203506 183731809 183279872
1413.4A83279872l92929m24474n38439m68418l97205m18216l99009m10050m15787l72037
$$ 183279872 182886943 182462469 181924030 181455612 181058407 180640191 180241182 179831132 179415345 179043308
1433.8A79043308m26769m93870l77014l21492l47942l52353l76508l72842l06815k50637
$$ 179043308 178616539 178122669 177745655 177424163 177076221 176723868 176347360 175974518 175667703 175417066
1454.2A75417066l74928n61178l86998k61650l57747l85448j92359m5106k9653L5747
$$ 175417066 175042138 174480960 174093962 173832312 173474565 173089117 172896758 172851652 172821999 172857746
1474.6A72857746K17766M08888O18681Q48532J010403J102373J220122J291469J146927
$$ 172857746 173075512 173484400 174103081 174951613 175962016 177064389 178284511 179575980 180722907
1493A80722907J063988J072809Q79362O69584O26072O95348O48409L15562J32397M9114
$$ 180722907 181786895 182859704 183739066 184408650 185034722 185730070 186378479 186694041 186826438 186875552
1513.4A86875552m9889j57058k75761m98414n54264l88145l06517k23369k36198m49628
$$ 186875552 186825663 186668605 186392844 185894430 185340166 184952021 184645504 184422135 184185937 183736309
1533.7A83736309m80830l84614o18115q36030o71238n20721m53949m50059l62173j90601
$$ 183736309 183255479 182870865 182252750 181416720 180745482 180224761 179770812 179320753 178958580 178767979
1554.1A78767979J4484J71319J54853J72600K59652L12165L21954K60905K46584L74392
$$ 178767979 178782463 178953782 179108635 179281235 179540887 179853052 180175006 180435911 180682495 181056887
1574.5A81056887N62712O61865P50140Q68544Q92296Q20682O74188M84183L39449K62156
$$ 181056887 181619599 182281464 183031604 183900148 184792444 185613126 186287314 186771497 187110946 187373102
1594.9A87373102J68457Q6591P5325J35586L00437N83083R65595J427516J938060K783135
$$ 187373102 187541559 187628150 187703475 187839061 188139498 188722581 189688176 191115692 193053752 195836887
1615.3A95836887L678664L068209J846239N78105p48202j558125j770049j437426j239136
$$ 195836887 199515551 202583760 204429999 205008104 204259902 202701777 200931728 199494302 198255166
1633.7A98255166j437082j143575o20216m67703m26754m99472m33088j46270k23055
$$ 198255166 196818084 195674509 195054293 194586590 194159836 193660364 193227276 193081006 192857951
1652A92857951m60863j78218l1471r6128j88768j75207p8083j23933j83239j02699
$$ 192857951 192397088 192218870 192187399 192091271 191902503 191727296 191649213 191525280 191342041 191239342
1672.4A91239342j15394j61291j08063q9422j91644l09169j54301o3926r8557j05947
$$ 191239342 191123948 190962657 190854594 190765172 190573528 190264359 190110058 190046132 189947575 189841628
1692.8A89841628k28330l24622l03209k67565j06529j22130k04801j65031j48117j92657
$$ 189841628 189613298 189288676 188985467 188717902 188611373 188489243 188284442 188119411 187971294 187778637
1713.2A87778637k91959l58745j65254k8178j25974j98231j74090j44809j53989k20001
$$ 187778637 187486678 187127933 186962679 186934501 186808527 186610296 186436206 186291397 186137408 185917407
1733.6A85917407q1226M8786j6957l219N5582M1306K3812K8401Q9377J28180N1201
$$ 185917407 185836181 185884967 185868010 185864791 185920373 185961679 185985491 186013892 186103269 186231449 186282650
1756.1A86282650j1951k1741j4841L4332o840r6023j34706j32129j4245O4685l054
$$ 186282650 186270699 186248958 186234117 186268449 186261609 186165586 186030880 185898751 185884506 185949191 185946137
1778.5A85946137p0483o8947q7455r6545r3117j37106j22607l9190m1336r5069r6902
$$ 185946137 185875654 185806707 185719252 185622707 185529590 185392484 185269877 185230687 185189351 185094282 184997380
1800.9A84997380l5897q047k9817m8265o8277q6755q4370n4940j4574k6107j06915
$$ 184997380 184961483 184953436 184923619 184875354 184807077 184720322 184635952 184581012 184566438 184540331 184433416
1823.4A84433416j31503p5564n8219j0222K9102k3350n5790l0384p1734j44034o2988
$$ 184433416 184301913 184226349 184168130 184157908 184187010 184163660 184107870 184077486 184005752 183861718 183798730
1845.8A83798730K9073J2651k6167m8920m8906l8281k4632k1249n9083j43811j59770
$$ 183798730 183827803 183840454 183814287 183765367 183716461 183678180 183653548 183632299 183573216 183429405 183269635
1868.2A83269635j7286Q2851J6198n9709m4242l2663o1304o3926n6147o8158k9504
$$ 183269635 183252349 183335200 183351398 183291689 183247447 183214784 183153480 183089554 183033407 182965249 182935745
1890.7A82935745J4200j2248l7507l8281l4347l3945m2230m8935l0190O288r119p0587
$$ 182935745 182949945 182937697 182900190 182861909 182827562 182793617 182751387 182702452 182672262 182678550 182669431 182598844
1915.1A82598844q6367l2544l740p302R447L592k6718m2901m7877m3601l8042n5239
$$ 182598844 182512477 182479933 182476193 182468891 182478338 182481930 182455212 182412311 182364434 182320833 182282791 182227552
1939.6A82227552q0764o0499j6481k116R477J1161l4317o9022l8773q240j8582l1263
$$ 182227552 182146788 182086289 182069808 182067692 182077169 182088330 182054013 181984991 181946218 181937978 181919396 181888133
1964.1A81888133m0516k4304N424k4542o9559n1334P212M1694K1368k4066l5867n275
$$ 181888133 181847617 181823313 181828737 181804195 181734636 181683302 181690514 181732208 181753576 181729510 181693643 181688368
1988.6A81688368N707r387j8358k8179k0012N365j133l5882m3943k0385o259j5825
$$ 181688368 181694075 181684688 181666330 181638151 181618139 181623504 181622371 181586489 181542546 181522161 181515902 181500077
2013A81500077m6283o5788m8370l9503n0663m3527k8923k6390j7792j0982l2097n3361
$$ 181500077 181453794 181388006 181339636 181300133 181249470 181205943 181177020 181150630 181132838 181121856 181089759 181036398
2037.5A81036398l7044m322K623j7271l2290k2024p481o422j3769k2888j6689j5572
$$ 181036398 180999354 180995032 180997655 180980384 180948094 180926070 180918589 180912167 180898398 180875510 180858821 180843249
2062A80843249l3975l1277n81J7002n126l3960k5868k414M604p421k9474l9101k4020
$$ 180843249 180809274 180777997 180777416 180794418 180789292 180755332 180729464 180727050 180731654 180724233 180694759 180655658 180631638
2088.5A80631638J609o26l2067l5510L815K5675j1683n2213l1516J9490K9147j7017
$$ 180631638 180633247 180632621 180600554 180565044 180568859 180594534 180582851 180530638 180499122 180518612 180547759 180530742
2113A80530742m7475k2814J8775L3647K280k6449p049K5198K3946n021k2829k1532
$$ 180530742 180483267 180460453 180479228 180512875 180515155 180488706 180481657 180506855 180530801 180525780 180502951 180481419
2137.5A80481419n692J0386p197k5928L606L0696N66m2945l7894R805M3944K1517l2946
$$ 180481419 180475727 180486113 180478916 180452988 180456594 180487290 180487856 180444911 180407017 180416822 180460766 180482283 180449337
2164A80449337n6744k9489Q657j49l6940l4094q106l293k2024l2157k384K7150J2443
$$ 180449337 180392593 180363104 180371761 180371612 180334672 180300578 180292472 180289179 180267155 180234998 180232614 180259764 180272207
2190.5A80272207k0311l1232j5066N961K146k7448l3453j937L0547K9921j6182m8891
$$ 180272207 180251896 180220664 180205598 180211559 180213705 180186257 180152804 180150867 180181414 180211335 180195153 180146262
2215A80146262k4185J625j6138l7506k2457J94l621r671j102k519n751l204j5795l5257
$$ 180146262 180122077 180123702 180107564 180070058 180047601 180047795 180044174 180034503 180033401 180030882 180025131 180021927 180006132 179970875
2243.5A79970875k3067K6778M3034p838l9294m888K3380M560l1710m8250k1025P585
$$ 179970875 179947808 179974586 180017620 180009782 179970488 179965600 179988980 179993540 179961830 179913580 179892555 179900140
2268A79900140n246j6823j6809k3752L43K8416J8284j0386k7180o720n976n0649o0290
$$ 179900140 179894894 179878071 179861262 179837510 179837853 179866269 179884553 179874167 179846987 179840267 179834291 179783642 179723352
2294.5A79723352k1159r031m4167p2568p5788p1063o9291p6338p9006p8589r4205j08481
$$ 179723352 179702193 179693162 179648995 179576427 179500639 179429576 179360285 179283947 179204941 179126352 179032147 178923666
2319A78923666j10805r2953p2151q7500p8023m7385q1763j40816j33782o2496k1860
$$ 178923666 178812861 178719908 178647757 178560257 178482234 178434849 178353086 178212270 178078488 178015992 177994132
2341.4A77994132k7955O0469J83344J03638j21251k50801k03550j52529r8958n037
$$ 177994132 177966177 178026646 178209990 178313628 178192377 177941576 177738026 177585497 177486539 177481502
2361.8A77481502M5583J10373J97396J88902J34035J43305J85430K07469K05010J66550
$$ 177481502 177527085 177637458 177834854 178023756 178157791 178301096 178486526 178693995 178899005 179065555
2382.2A79065555J12951P4372N4702M0859P346j6018r99R269n439j9148j1459K116
$$ 179065555 179178506 179252878 179307580 179348439 179355785 179339767 179338768 179348037 179342598 179323450 179311991 179314107
2406.7A79314107k683j4677j9014j3486k309O616O839K862K965o378j8686k5079l3125
$$ 179314107 179311424 179296747 179277733 179264247 179261938 179268554 179275393 179278255 179281220 179274842 179256156 179231077 179197952
2433.2A79197952j9550K935j087j1146j6779k6092j4454J7062K1249k236r208O40o556
$$ 179197952 179178402 179181337 179180250 179169104 179152325 179126233 179111779 179128841 179150090 179147854 179138646 179139286 179132730
2459.7A79132730k9296l4064j0326J8075K8938K2143J222j6034J580J8671L934N245
$$ 179132730 179103434 179069370 179059044 179077119 179106057 179128200 179129422 179113388 179114968 179133639 179137573 179142818
2484.2A79142818K3261K7805J7613j7211l6582K653L5598J7479o511r075J3530L4303
$$ 179142818 179166079 179193884 179211497 179194286 179157704 179160357 179195955 179213434 179206923 179197848 179211378 179245681
2508.7A79245681P867l7208m6983k3127l427j1981k6300k8908l6121m9323n2720k9445
$$ 179245681 179253548 179216340 179169357 179146230 179142803 179130822 179104522 179075614 179039493 178990170 178937450 178908005
2533.1A78908005K623r537m3347l8073j4126n454j3023l9965n6565l5510n81K1056
$$ 178908005 178910628 178901091 178857744 178819671 178805545 178800091 178787068 178747103 178690538 178655028 178654447 178675503
2557.6A78675503J2919j5885k4184m515m560j9103m426J2591J4544K7001L8400K5436
$$ 178675503 178688422 178672537 178648353 178643838 178639278 178620175 178615749 178628340 178642884 178669885 178708285 178733721
2582.1A78733721N454j341P704J7464R015R612Q583j6898j6883O884J6436J6719R120
$$ 178733721 178739175 178737834 178745538 178763002 178772017 178781629 178790212 178773314 178756431 178763315 178779751 178796470 178805590
2608.6A78805590l428k637J9446K8640l323l6210l0309m485k042l1784o3181n0380
$$ 178805590 178802162 178799525 178818971 178847611 178844288 178808078 178777769 178773284 178771242 178739458 178676277 178625897
2633.1A78625897N662L1486O035k9236l6299j3143j7047m3377k4170R254q971l5241
$$ 178625897 178631559 178663045 178669080 178639844 178603545 178590402 178573355 178529978 178505808 178515062 178506091 178470850
2657.5A78470850k2993j3038j6928q64Q807j4887l1396k0996j4097k6106k9371j8552
$$ 178470850 178447857 178434819 178417891 178417027 178425834 178410947 178379551 178358555 178344458 178318352 178288981 178270429
2682A78270429j7658j5541m813l338p764j0252j2621j7613l0086k8729K414K4006o482
$$ 178270429 178252771 178237230 178232417 178229079 178221315 178211063 178198442 178180829 178150743 178122014 178124428 178148434 178141952
2708.5A78141952l6747k6822j5005l398p063j4111p45j684r54m947j9476j3694k1145
$$ 178141952 178105205 178078383 178063378 178059980 178052917 178038806 178038061 178036377 178035423 178030476 178011000 177997306 177976161
2735A77976161m1619l0756n439n066j8343j5021K83j2144l8624j7807j713l3364m7147
$$ 177976161 177934542 177903786 177898347 177893281 177874938 177859917 177860200 177848056 177809432 177791625 177789912 177756548 177709401
2761.6A77709401l4497j5318J3277K5570N424j8432j4127j490k6360m7564j4753O512
$$ 177709401 177674904 177659586 177672863 177698433 177703857 177685425 177671298 177669808 177643448 177595884 177581131 177587643
2786A77587643l28J9744L8058J7375O41m158j6153j49K6539J8999o556k0579k2948
$$ 177587643 177587315 177607059 177645117 177662492 177663133 177658975 177642822 177642673 177669212 177688211 177681655 177661076 177638128
2812.5A77638128k5346j0789K3186M7744L9175L680j5363M873L4138L1591K250q851
$$ 177638128 177612782 177601993 177625179 177672923 177712098 177715778 177700415 177705288 177739426 177771017 177773267 177764416
2837A77764416l696l1218r1672j13010o7681l4824l1665k846M2006Q0973Q5875N2199
$$ 177764416 177760720 177729502 177637830 177524820 177457139 177422315 177390650 177387804 177429810 177510783 177596658 177648857
2861.5A77648857L4571J3903l5703n2527j9953m008l1412l7074q881o556k8030m7832
$$ 177648857 177683428 177697331 177661628 177609101 177589148 177585140 177553728 177516654 177507773 177501217 177473187 177425355
2886A77425355o2585o3643o6638o8799m2602k3350k7493l1367l0920k4378l1918n1350
$$ 177425355 177362770 177299127 177232489 177163690 177121088 177097738 177070245 177038878 177007958 176983580 176951662 176900312
2910.4A76900312o4134p3999p1124n0798l7998k5183K4632Q9049J26437J42261J52662
$$ 176900312 176836178 176762179 176691055 176640257 176602259 176577076 176601708 176690757 176817194 176959455 177112117
2932.9A77112117J61410J78262K00570J97932J64822J37567J10075O7830N4315O5103
$$ 177112117 177273527 177451789 177652359 177850291 178015113 178152680 178262755 178330585 178384900 178450003
2953.3A78450003N3689N2273J10001J61901J49459J41859J63018J57282J49340J66431
$$ 178450003 178503692 178555965 178665966 178827867 178977326 179119185 179282203 179439485 179588825 179755256
2973.7A79755256J63510J59979J64360J31949J06782J14367J17600J18389J23576J33633
$$ 179755256 179918766 180078745 180243105 180375054 180481836 180596203 180713803 180832192 180955768 181089401
2994.1A81089401J36614J06245P6265P0080O6459P2613P5668M9755O035j4797J923
$$ 181089401 181226015 181332260 181408525 181478605 181545064 181617677 181693345 181743100 181749135 181734338 181736261
3016.5A81736261K2024J996n7235p0989k3812P90n663r701o675j714k950o140j7896
$$ 181736261 181758285 181760281 181703046 181632057 181608245 181609035 181603372 181593671 181586996 181585282 181582332 181576192 181558296
3043A81558296l8847l1427k935Q627J4380L0011M0650L1054J3233O40O214L3707L9860
$$ 181558296 181519449 181488022 181485087 181493714 181508094 181538105 181578755 181609809 181623042 181623682 181629896 181663603 181703463
3069.5A81703463J5810L219J5646L4973K4230q345r194J2144J5855m932k6822j0699
$$ 181703463 181719273 181722492 181738138 181773111 181797341 181788996 181779802 181791946 181807801 181802869 181776047 181765348
3094A81765348K8297L2902j2994o7413o8724j3560J8239j0938m0575l6925k3604k4810
$$ 181765348 181793645 181826547 181813553 181746140 181677416 181663856 181682095 181671157 181630582 181593657 181570053 181545243
3118.5A81545243m5881n4464k2009O26l6761o1840j9476J6898M92k7105m1619m5493
$$ 181545243 181499362 181444898 181422889 181423515 181386754 181324914 181305438 181322336 181322828 181295723 181254104 181208611
3143A81208611l9995m3839n1812m7698m0204l0964k7404l8117n6371p0572q1196q4221
$$ 181208611 181168616 181124777 181072965 181025267 180985063 180954099 180926695 180888578 180832207 180761635 180680439 180596218
3167.4A80596218p4491q0213q6174p3328q0884j08212j15797q7589o2317p3001q3312
$$ 180596218 180521727 180441514 180355340 180282012 180201128 180092916 179977119 179889530 179827213 179754212 179670900
3189.9A79670900p6458r2387j20133j17093j00375p4446l6761k4036l8892n3227n3525
$$ 179670900 179594442 179502055 179381922 179264829 179164454 179090008 179053247 179029211 178990319 178937092 178883567
3212.3A78883567l8921l1665l1546j3515p928l5152n8099n9709m3527m321P123l0786
$$ 178883567 178844646 178812981 178781435 178767920 178759992 178724840 178666741 178607032 178563505 178559184 178566307 178535521
3236.8A78535521n1588n2094m4689j6138m351m1753p1987m7640o690K652m2259q0109
$$ 178535521 178483933 178431839 178387150 178371012 178366661 178324908 178252921 178205281 178198591 178201243 178158984 178078875
3261.2A78078875o3583n0798o1557o3613p4104r6261q2314n8085p2256j02162j17659
$$ 178078875 178015292 177964494 177902937 177839324 177765220 177668959 177586645 177528560 177456304 177354142 177236483
3283.7A77236483j17809j16453j07467q8215j00106j20669j13607j40592j68860j27644
$$ 177236483 177118674 177002221 176894754 176806539 176706433 176585764 176472157 176331565 176162705 176035061
3304.1A76035061j03980j43409j71572j80780j82420j71692j77681j86384j94341k21893
$$ 176035061 175931081 175787672 175616100 175435320 175252900 175081208 174903527 174717143 174522802 174300909
3324.5A74300909k50488k30477j82837j90482k26259k31176k25410k29880k19137k06232
$$ 174300909 174050421 173819944 173637107 173446625 173220366 172989190 172763780 172533900 172314763 172108531
3344.9A72108531k20537k38970k69115l03909k87816k29493k04056k28361k27734j91674
$$ 172108531 171887994 171649024 171379909 171076000 170788184 170558691 170354635 170126274 169898540 169706866
3365.3A69706866j85355k17945k49266k32667j95250j86816k04787k32249k02313j37150
$$ 169706866 169521511 169303566 169054300 168821633 168626383 168439567 168234780 168002531 167800218 167663068
3385.7A67663068j14426j21624j76117k43216k16335j25498q6874j12951j51589j67176
$$ 167663068 167548642 167427018 167250901 167007685 166791350 166665852 166578978 166466027 166314438 166147262
3406.1A66147262j41829j13994j31458j46613j09404r8154j16617o8768o274n916k8461
$$ 166147262 166005433 165891439 165759981 165613368 165503964 165405810 165289193 165220425 165214151 165208235 165179774
3428.5A65179774l5360l1069p808J7806K936j1638O810K1413L2127M5076O4790R2954
$$ 165179774 165144414 165113345 165105537 165123343 165126279 165114641 165121451 165142864 165174991 165220067 165284857 165377811
3453A65377811P9304N1111P4759R2670R4980J29893J58936J58951J32084Q1926O8278
$$ 165377811 165457115 165508226 165582985 165675655 165770635 165900528 166059464 166218415 166350499 166432425 166500703
3475.4A66500703J28045J64077J13845J08376J69858J49444J14396J55673J62139J42232
$$ 166500703 166628748 166792825 166906670 167015046 167184904 167334348 167448744 167604417 167766556 167908788
3495.8A67908788J70544J74894J24619J35675J99631J78948J41412J85445K10047J61498
$$ 167908788 168079332 168254226 168378845 168514520 168714151 168893099 169034511 169219956 169430003 169591501
3516.2A69591501J28195J59949K05681K00391J60858J80199K32995K27585K03282J81466
$$ 169591501 169719696 169879645 170085326 170285717 170446575 170626774 170859769 171087354 171290636 171472102
3536.6A71472102J67326J80199J95697K09034K08437J88157J68875J97262K27540K16514
$$ 171472102 171639428 171819627 172015324 172224358 172432795 172620952 172789827 172987089 173214629 173431143
3557A73431143K21625K20403K16082J89394J47193K29136L16381K72647K06708K17230
$$ 173431143 173652768 173873171 174089253 174278647 174425840 174654976 174971357 175244004 175450712 175667942
3577.4A75667942K52440K54959K48641J92150J37717K39387L31119K93702K40713K27108
$$ 175667942 175920382 176175341 176423982 176616132 176753849 176993236 177324355 177618057 177858770 178085878
3597.8A78085878K22147K58967L05578K70397K29865K41369K12133J95399K30730K04369
$$ 178085878 178308025 178566992 178872570 179142967 179372832 179614201 179826334 180021733 180252463 180456832
3618.2A80456832K01330K56225K52411J86816R0569J38894K48313K31981J75297J51873
$$ 180456832 180658162 180914387 181166798 181353614 181444183 181583077 181831390 182063371 182238668 182390541
3638.6A82390541J72838J97590J80810J15037K6033N0172J55553J25021M3601N5894
$$ 182390541 182563379 182760969 182941779 183056816 183082849 183133021 183288574 183413595 183457196 183513090
3659A83513090P5743P5221J05366J09717K3440J0445O900j40712l2619J83717J72257
$$ 183513090 183588833 183664054 183769420 183879137 183902577 183913022 183919922 183779210 183746591 183930308 184102565
3681.4A84102565J06454P4059M9233n558j5855L8371L6865L353j9297l0190K8566P6115
$$ 184102565 184209019 184283078 184332311 184326753 184310898 184349269 184386134 184389487 184370190 184340000 184368566 184444681
3705.9A84444681N8785J8507M77N3942P7278O1541L0131k1726m8846l5063L8713J06484
$$ 184444681 184503466 184521973 184522450 184576392 184653670 184715211 184745342 184723616 184674770 184639707 184678420 184784904
3730.3A84784904R7767L2350n2109m3601O7234R6485K7209M2022N916j73644j96084
$$ 184784904 184882671 184915021 184862912 184819311 184886545 184983030 185010239 185052261 185058177 184884533 184688449
3752.8A84688449k3767L4257m7892o2183O050K5481K4215J6972J2964N3793Q5280L2454
$$ 184688449 184664682 184698939 184651047 184588864 184594914 184620395 184644610 184661582 184674546 184728339 184813619 184846073
3777.3A84846073m7341m9963m9636l9339M902P5J6868L6717O586N1126P5921n647j3441
$$ 184846073 184798732 184748769 184699133 184659794 184664696 184664771 184681639 184718356 184724942 184776068 184851989 184846342 184832901
3803.8A84832901m2081j04725k5034Q0734M5136o4776k1740K9772L5822M8653l8043
$$ 184832901 184790820 184686095 184661061 184741795 184786931 184722155 184700415 184730187 184766009 184814662 184776619
3826.2A84776619q8468o2958L070Q3059M7475o2138q8587n5298k5004O2301J44974
$$ 184776619 184688151 184625193 184628263 184711322 184758797 184696659 184608072 184552774 184527770 184590071 184735045
3848.6A84735045N8502j41397j01313P4476J15782O2167r3877j05798L8549M2334J1757
$$ 184735045 184793547 184652150 184550837 184625313 184741095 184803262 184709385 184603587 184642136 184684470 184696227
3871.1A84696227K1518J4737n558m4987K6882P7411k3111k9147K83m2677j7077K8536
$$ 184696227 184717745 184732482 184726924 184681937 184708819 184786230 184763119 184733972 184734255 184691578 184674501 184703037
3895.5A84703037K3887K9519J6630n3585o2242M098L2276L1173J4663k5168k2680J3918
$$ 184703037 184726924 184756443 184773073 184719488 184657246 184661344 184693620 184724793 184739456 184714288 184691608 184705526
3920A84705526j699k6673J4007N2482L8028R968L711J0013r253m3035j8358N2273K2248
$$ 184705526 184703827 184677154 184691161 184743643 184781671 184791639 184795350 184805363 184796110 184753075 184734717 184786990 184809238
3946.5A84809238n0158j7792K3336J1786Q926P570j1414m575K1130P734r179j1757
$$ 184809238 184759080 184741288 184764624 184776410 184785336 184792906 184781492 184776917 184798047 184805781 184796602 184784845
3971A84784845l2306j5840K6330K0951K0266L5107p018o0380m5925n827K3499N5895
$$ 184784845 184752539 184736699 184763029 184783980 184804246 184839353 184832335 184771955 184726030 184720203 184743702 184799597
3995.5A84799597M8324
$$ 184799597 184847921
3997.5A84847921
$$ 184847921
##END=$$ End of the data block
