##TITLE=PAD $$ Begin of the data block
##JCAMP-DX=5.00 $$ ACD/SpecManager v 10.08
##SPECTROMETER/DATA SYSTEM=Alpha
##DATE=12 Mar 2014 10:59:36
##DATA TYPE=INFRARED SPECTRUM
##DATA CLASS=XYDATA
##ORIGIN=
##OWNER=
##NPOINTS=1765
##FIRSTX=399.75695801
##LASTX=3997.56933594
##MAXX=3997.56933594
##MINX=399.75695801
##MAXY=0.83637142
##MINY=0.46733195
##XFACTOR=1.0000000000
##YFACTOR=1.000000000000000e-9
##FIRSTY=0.70050073
##DELTAX=2.03957629
##XUNITS=1/CM
##YUNITS=ARBITRARY UNITS
##XYDATA=(X++(Y..Y))
$$ plain form
399.8 700500727 702296734 702901244 702040851 702199101 704116762 705335021 704897821 705150485 707514405
418.1 707514405 709190428 708207726 707208693 708188176 709763527 709626198 708470583 708664358 710140169
436.5 710140169 710475087 709249556 708991468 710623801 711612642 710625231 709624529 710332811 711564064
454.8 711564064 711215794 709741652 709480643 710330009 710379839 709258080 708743453 709675670 710168064 709017932
475.2 709017932 708042622 708637655 709619284 709350467 708336234 708401561 709516823 709801674 708833098 708416164
495.6 708416164 709304452 709992409 709269524 708248734 708589494 709389150 708837092 707700193 707753599 708626568
516 708626568 708586633 707444787 706907153 707698345 708417177 708011925 707516432 708005130 708750248 708371699
536.4 708371699 707266629 707087219 707942903 708336353 707612693 706858516 707088649 707525134 706985712 706023395
$$ packed form
399.8G00500727J796007O04510q60393J58250J917661J218259m37200K52664K363920
418.1G07514405J676023r82702r99033R79483J575351j37329j155615J93775J475811
436.5G10140169L34918j225531k58088J632333R88841r87411j000702P08282J231253
454.8G11564064l48270j474142k61009Q49366M9830j121759n14627R32217M92394j150132
475.2G09017932r75310N95033R81629k68817j014233O5327J115262K84851r68576m16934
495.6G08416164Q88288O87957p22885j020790L40760P99656n52058j136899N3406Q72969
516G08626568l9935j141846n37634P91192P18832m05252m95493M88698P45118l78549
536.4G08371699j105070j79410Q55684L93450p23660p54177K30133M36485n39422r62317
$$ plain form
556.8 706023395 705970585 706804991 707248509 706860781 706747651 707505107 708081603 707640290 706975579 707159102
577.2 707159102 707857132 707976878 707473218 707392871 708136082 708694994 708355010 708017349 708549559 709274292
597.6 709274292 709145784 708383083 708100557 708595395 708916724 708469331 707999229 708318293 708972514 709162116
618 709162116 709301949 710253656 711804926 712888300 713194311 713682711 714970648 716321528 716913700
636.3 716913700 717215896 718170643 719598889 720525682 720862329 721411645 722410679 723165214 723167062 722910643
656.7 722910643 723188579 723803043 723971188 723671556 723438501 724075019 725092113 725549400 725807011 726516187
677.1 726516187 727480888 728076398 728322685 728834629 729724169 730295479 730217695 729830623 728934407 726691008
697.5 726691008 724425972 724713624 726671040 727599323 726279259 722044647 716894150 716251075 720758080
$$ packed form
556.8G06023395n2810Q34406M43518l87728j13130P57456N76496m41313o64711J83523
577.2G07159102O98030J19746n03660q0347P43211N58912l39984l37661N32210P24733
597.6G09274292j28508p62701k82526M94838L21329m47393m70102L19064O54221J89602
618G09162116J39833R51707J551270J083374L06011M88400J287937J350880N92172
636.3G16913700L02196R54747J428246R26793L36647N49316R99034P54535J848k56419
656.7G22910643K77936O14464J68145k99632k33055O36518J017094M57287K57611P09176
677.1G26516187R64701N95510K46287N11944Q89540N71310p7784l87072q96216k243399
697.5G26691008k265036K87652J957416R28283j320064m234612n150497o43075M507005
$$ plain form
715.9 720758080 725271702 727941811 730508208 733628571 736770809 739530921 742067516 744526207
732.2 744526207 746548712 747729599 748324752 748953402 749797404 750514567 750888526 751223683 751922429
750.6 751922429 752844214 753420770 753644407 754110157 754956603 755642414 755857706 755990326 756474853 757136583
771 757136583 757460654 757423103 757609069 758227944 758712888 758772671 758933306 759572685 760244250 760393679
791.4 760393679 760211289 760339618 760839462 761014462 760550976 760096550 760175049 760265768 759650290 758635461
811.7 758635461 758144677 758246779 758161128 757695615 757580519 758187294 758864939 759041607 759147108 759862423
832.1 759862423 760851264 761093259 760171533 757962584 754998446 753237367 751574934 744425595 725209653
850.5 725209653 692599595 663939476 662390113 685042858 711140394 728937328 737926662 740350902
$$ packed form
715.9G20758080M513622K670109K566397L120363L142238K760112K536595K458691
732.2G44526207K022505J180887N95153O28650Q44002P17163L73959L35157O98746
750.6G51922429R21785N76556K23637M65750Q46446O85811K15292J32620M84527O61730
771G57136583L24071l7551J85966O18875M84944N9783J60635O39379O71565J49429
791.4G60393679j82390J28329M99844J75000m63486m54426P8499R0719o15478j014829
811.7G58635461m90784J02102q5651m65513j15096O06775O77645J76668J05501P15315
832.1G59862423R88841K41995r21726k208949k964138j761079j662433p149339j9215942
850.5G25209653l2610058k8660119j549363K2652745K6097536J7796934Q989334K424240
$$ plain form
866.8 740350902 737637818 731281102 724599183 721559584 724567473 733542919 745343626 755955935
883.1 755955935 764189780 770869076 775865138 778595924 779790521 780769825 781788647 782111645 781623244
901.5 781623244 781331837 781797707 782328844 782247365 781847298 781727910 781679153 780928493 779479504 778153121
921.9 778153121 777217805 776012063 774187028 772431254 771425009 770754218 769651353 768266439 767286599
940.2 767286599 766662657 765665770 764154136 762859166 762193620 761488080 759945095 757858038 756020665
958.6 756020665 754408062 752390683 749917865 747687459 746011913 744310141 742096543 739642680
974.9 739642680 737308800 734849632 731784523 728236735 724884093 721963644 719006836 715780020
991.2 715780020 712750793 710390210 708533466 706682980 704753637 703052580 701599300 700014055
$$ packed form
866.8G40350902k713084o356716o681919l039599L007889Q975446J1800707J0612309
883.1G55955935Q233845O679296M996062K730786J194597R79304J018822L22998m88401
901.5G81623244k91407M65870N31137q1479m00067j19388m8757p50660j448989j326383
921.9G78153121r35316j205742j825035j755774j006245o70791j102865j384914r79840
940.2G67286599o23942r96887j511634j294970o65546p05540j542985k087057j837373
958.6G56020665j612603k017379k472818k230406j675546j701772k213598k453863
974.9G39642680k333880k459168l065109l547788l352642k920449k956808l226816
991.2G15780020l029227k360583j856744j850486j929343j701057j453280j585245
$$ plain form
1007.5 700014055 698095798 696155608 694565535 693197846 691625774 689781189 687992394 686410189
1023.9 686410189 684810340 683042288 681351364 680057347 679213405 678731561 678623557 678889453 679272890
1042.2 679272890 679305077 678730130 677761555 676758170 675823390 674846768 673901618 673403382 673696220 674566984
1062.6 674566984 675571442 676552653 677526295 678370059 678832829 678851247 678611577 677792966 676218033
1081 676218033 675979316 678587675 682035029 684534788 686246336 687588513 688912392 690301001 691456676
1099.3 691456676 692192495 692715526 693274617 693751395 693849683 693696558 693874061 694610238 695422471 695869863
1119.7 695869863 696165144 696717858 697512388 698327482 699295878 700655282 702213764 703552485 704528928
1138.1 704528928 705307782 705971479 706331015 706227422 705875695 705575943 705287158 704791665 704087615 703495979
$$ packed form
1007.5G00014055j918257j940190j590073j367689j572072j844585j788795j582205
1023.9F86410189j599849j768052j690924j294017q43942m81844j08004K65896L83437
1042.2F79272890L2187n74947r68575j003385r34780r76622r45150m98236K92838Q70764
1062.6F74566984J004458R81211R73642Q43764M62770J8418k39670q18611j574933
1081F76218033k38717K608359L447354K499759J711548J342177J323879J388609J155675
1099.3F91456676P35819N23031N59091M76778R8288j53125J77503P36177Q12233M47392
1119.7F95869863K95281N52714P94530Q15094R68396J359404J558482J338721R76443
1138.1G04528928P78854O63697L59536j03593l51727k99752k88785m95493p04050n91636
$$ plain form
1158.5 703495979 703321397 703584909 704276502 705569386 707530856 709875405 712223113 714490116 716811121
1176.8 716811121 719128013 721128881 722619534 723703921 724540770 725081503 725177646 724910915 724523544
1195.2 724523544 724088073 723477185 722656250 721809864 721110284 720542431 720010042 719512820 719117701 718819022
1215.6 718819022 718501091 718088627 717670679 717330813 716948032 716353595 715574086 714795351 714138567 713528514
1236 713528514 712868154 712212443 711649358 711120963 710558712 710050762 709725499 709543884 709349215 709111750
1256.4 709111750 708956540 708959162 709017992 709039330 709088147 709272027 709531665 709723771 709853053 710047960
1276.8 710047960 710352361 710647106 710887015 711187303 711614609 711992681 712113798 712035835 711963892 711878836
1297.2 711878836 711584866 711047232 710430920 709864318 709221900 708404660 707505941 706684589 706021786 705470443
$$ packed form
1158.5G03495979j74582K63512O91593J292884J961470K344549K347708K267003K321005
1176.8G16811121K316892K000868J490653J084387Q36849N40733R6143k66731l87371
1195.2G24523544m35471o10888q20935q46386o99580n67853n32389m97222l95119k98679
1215.6G18819022l17931m12464m17948l39866l82781n94437p79509p78735o56784o10053
1236G13528514o60360o55711n63085n28395n62251n07950l25263j81615j94669k37465
1256.4G09111750j55210K622N8830K1338M8817J83880K59638J92106J29282J94907
1276.8G10047960L04401K94745K39909L00288M27306L78072J21117p7963p1943q5056
1297.2G11878836k93970n37634o16312n66602o42418q17240q98719q21352o62803n51343
$$ plain form
1317.6 705470443 704990745 704677105 704518557 704221785 703588486 702712238 701802492 700898528 699929714 698879480
1338 698879480 697890103 697120130 696460962 695709467 694854140 693962097 692899406 691547155 690020442
1356.3 690020442 688605726 687232912 685468554 683330953 681279778 679357708 677446425 675435066
1372.6 675435066 673171520 670944989 668725312 666055501 663073182 660509527 658295274 655740976
1388.9 655740976 652919650 649822891 646173954 642059684 637395084 632541180 627955556 623108625
1405.3 623108625 618056476 613089263 608194888 603686154 599767148 595906377 591687441 588439465
1421.6 588439465 586374462 584803343 583680212 582909346 582395077 582110703 581463993 580072641 578457475
1439.9 578457475 576342523 573301554 569401979 564861000 560346425 556477427 553303242 549992859
$$ packed form
1317.6G05470443m79698l13640j58548k96772o33299q76248r09746r03964r68814j050234
1338F98879480r89377p69973o59168p51495q55327q92043j062691j352251j526713
1356.3F90020442j414716j372814j764358k137601k051175j922070j911283k011359
1372.6F75435066k263546k226531k219677k669811k982319k563655k214253k554298
1388.9F55740976k821326l096759l648937m114270m664600m853904m585624m846931
1405.3F23108625n052149m967213m894375m508734l919006l860771m218936l247976
1421.6E88439465k065003j571119j123131p70866n14269k84374o46710j391352j615166
1439.9E78457475k114952l040969l899575m540979m514575l868998l174185l310383
$$ plain form
1456.2 549992859 546152651 543213010 540576100 536507905 530892849 525212586 519181132 511389554
1472.6 511389554 503133833 495973140 489538640 483525991 478140205 473960936 470881402 468581945
1488.9 468581945 467331946 467588276 469225943 471964300 475209296 478561133 481978863 485825896
1505.2 485825896 489986211 492963105 495240182 497570932 500083745 502754211 505631566 509074807
1521.5 509074807 513020277 517442226 522787869 528752506 535732150 544281960 552537620 560566068
1537.8 560566068 571100354 582015634 590765476 598619878 605874598 612903297 619477332 625443101
1554.1 625443101 630813122 636069238 640342712 642791629 644864500 647003651 649108469 651063979
1570.5 651063979 652711153 654222786 655507624 656449020 657279015 657744825 657667398 657150924 656259239
$$ packed form
1456.2E49992859l840208k939641k636910m068195n615056n680263o031454p791578
1472.6E11389554q255721p160693o434500o012649n385786m179269l079534k299457
1488.9D68581945j249999K56330J637667K738357L244996L351837L417730L847033
1505.2D85825896M160315K976894K277077K330750K512813K670466K877355L443241
1521.5E09074807L945470M421949N345643N964637O979644Q549810Q255660Q028448
1537.8E60566068J0534286J0915280Q749842P854402P254720P028699O574035N965769
1554.1F25443101N370021N256116M273474K448917K072871K139151K104818J955510
1570.5F51063979J647174J511633J284838R41396Q29995M65810p7427n16474q91685
$$ plain form
1588.8 656259239 654834330 652892828 650647163 648323119 645952582 643382549 640706718 638202786
1605.1 638202786 635885358 633401811 630853534 628724158 626708746 624191523 622163355 620878696
1621.4 620878696 619611621 618400812 617319524 616450727 616323709 616964221 617609918 617957532 618717492
1639.8 618717492 620219290 622307301 624688208 626988113 629223406 632004142 634861171 636863351
1656.1 636863351 639055252 641942501 645172238 648158014 650970697 654229879 657746136 660767496
1672.4 660767496 663652956 666739345 669951916 673313797 676832438 680440784 683682621 686828732
1688.8 686828732 690155983 693515122 697440803 701836228 705973208 709940553 713370562 716752648
1705.1 716752648 720193923 723124564 725813925 728631437 731530070 733964860 735555172 736996710
$$ packed form
1588.8F56259239j424909j941502k245665k324044k370537k570033k675831k503932
1605.1F38202786k317428k483547k548277k129376k015412k517223k028168j284659
1621.4F20878696j267075j210809j081288q68797j27018O40512O45697L47614P59960
1639.8F18717492J501798K088011K380907K299905K235293K780736K857029K002180
1656.1F36863351K191901K887249L229737K985776K812683L259182L516257L021360
1672.4F60767496K885460L086389L212571L361881L518641L608346L241837L146111
1688.8F86828732L327251L359139L925681M395425M136980L967345L430009L382086
1705.1G16752648L441275K930641K689361K817512K898633K434790J590312J441538
$$ plain form
1721.4 736996710 738748014 740646958 742504299 744431198 746485531 748537242 750208795 751732767
1737.7 751732767 753596008 755764544 758053422 760462224 763059139 765839696 768544793 770969391
1754 770969391 773327529 775726080 778066754 780219972 781964540 783558607 785309017 787008882 788049579
1772.4 788049579 788112819 787706673 787288845 786950409 786667645 786511898 786829829 788038552 790003300
1790.7 790003300 792007804 793541551 794941723 796469986 797995150 799377739 800689876 802002072
1807 802002072 803234458 804337382 805412710 806569099 807670474 808626950 809602261 810668766 811677039
1825.4 811677039 812529624 813269556 813905895 814535379 815162361 815738261 816375494 817147017 817869663 818337679
1845.8 818337679 818715274 819173992 819663882 820105135 820529997 820994556 821486235 821934402 822381020 822930813
$$ packed form
1721.4G36996710J751304J898944J857341J926899K054333K051711J671553J523972
1737.7G51732767J863241K168536K288878K408802K596915K780557K705097K424598
1754G70969391K358138K398551K340674K153218J744568J594067J750410J699865J040697
1772.4G88049579O3240m06146m17828l38436k82764j55747L17931J208723J964748
1790.7G90003300K004504J533747J400172J528263J525164J382589J312137J312196
1807H02002072J232386J102924J075328J156389J101375R56476R75311J066505J008273
1825.4H11677039Q52585P39932O36339O29484O26982N75900O37233P71523P22646M68016
1845.8H18337679L77595M58718M89890M41253M24862M64559M91679M48167M46618N49793
$$ plain form
1866.2 822930813 823471904 823781431 823948681 824212372 824588895 824956715 825237811 825499117 825841784 826253414
1886.6 826253414 826606035 826847315 827123165 827460229 827725291 827893972 828092813 828388333 828716338 828997076
1907 828997076 829230368 829449415 829668701 829911947 830149591 830339789 830527484 830684483 830749571 830841839
1927.4 830841839 831019580 831190407 831307948 831408799 831574261 831817925 832021773 832081616 832098365 832186520
1947.8 832186520 832288444 832333863 832378626 832472682 832568109 832632184 832679272 832764924 832891941 832984865 833022177
1970.2 833022177 833062530 833147287 833244264 833299637 833320439 833364904 833444238 833521962 833563089 833572507 833563209 833544016
1994.7 833544016 833533168 833514333 833477616 833476424 833529234 833543658 833481669 833433568 833471119 833525479 833492160 833408952
2019.2 833408952 833378494 833396494 833367646 833274305 833213091 833247960 833307683 833296239 833241165 833233237 833258569 833224893
$$ packed form
1866.2H22930813N41091L09527J67250K63691L76523L67820K81096K61306L42667M11630
1886.6H26253414L52621K41280K75850L37064K65062J68681J98841K95520L28005K80738
1907H28997076K33292K19047K19286K43246K37644J90198J87695J56999O5088R2268
1927.4H30841839J77741J70827J17541J00851J65462K43664K03848N9843J6749Q8155
1947.8H32186520J01924M5419M4763R4056R5427O4075M7088Q5652J27017R2924L7312
1970.2H33022177M0353Q4757R6977N5373K0802M4465P9334P7724M1127R418r298j9193
1994.7H33544016j0848j8835l6717j192N2810J4424o1989m8101L7551N4360l3319q3208
2019.2H33408952l0458J8000k8848r3341o1214L4869N9723j1444n5074p928K5332l3676
$$ plain form
2043.6 833224893 833144248 833107471 833149731 833196402 833173752 833150089 833222568 833320379 833312809 833237112 833228827 833305538
2068.1 833305538 833344340 833293319 833251059 833310723 833394110 833372474 833313644 833360612 833479047 833497405 833378136
2090.5 833378136 833291233 833356500 833433747 833363950 833251595 833254218 833319306 833288014 833158851 833097279 833164632
2113 833164632 833197594 833072901 832933605 832955480 833060384 833061635 832962215 832933664 833023071 833068252 832981527
2135.4 832981527 832912743 833012521 833152831 833123267 832994044 832989693 833131850 833214700 833146274 833114803 833268583
2157.9 833268583 833463728 833515346 833488226 833556235 833715022 833821535 833840787 833882630 834017992 834155262
2178.2 834155262 834207416 834242880 834354281 834504247 834592581 834610879 834660649 834807754 834958434 835002720 834994256
2200.7 834994256 835054934 835180163 835261047 835259795 835278809 835396409 835512042 835517466 835482717 835530281 835640609
$$ packed form
2043.6H33224893q0645l6777M2260M6671k2650k3663P2479R7811p570p5697q285P6711
2068.1H33305538L8802n1021m2260N9664Q3387k1636n8830M6968J18435J8358j19269
2090.5H33378136q6903O5267P7247o9797j12355K623O5088l1292j29163o1572O7353
2113H33164632L2962j24693j39296K1875J04904J251r9420k8551Q9407M5181q6725
2135.4H32981527o8784R9778J40310k9564j29223m351J42157Q2850o8426l1471J53780
2157.9H33268583J95145N1618k7120O8009J58787J06513J9252M1843J35362J37270
2178.2H34155262N2154L5464J11401J49966Q8334J8298M9770J47105J50680M4286q464
2200.7H34994256O0678J25229Q0884j252J9014J17600J15633N424l4749M7564J10328
$$ plain form
2223.1 835640609 835696161 835665166 835656762 835739434 835831225 835837901 835794210 835820138 835920274 835971057 835949898 835951567
2247.6 835951567 836004496 836067140 836086273 836064994 836080253 836134195 836147130 836107969 836084783 836125553 836209118
2270 836209118 836256444 836237729 836241961 836315334 836371422 836334467 836247683 836216927 836245894 836209118 836093426 836011112
2294.5 836011112 835983276 835925817 835766375 835563123 835431278 835352123 835213125 834988952 834779263 834637403
2314.9 834637403 834432364 834096074 833793044 833632112 833509684 833280861 832963228 832723558 832619488 832509220
2335.3 832509220 832301021 832096636 832036495 832141399 832415700 832737565 832776070 832400560 831767440 831090868
2355.7 831090868 830608606 830517411 830584228 830556870 830662072 831049502 831537843 831960857 832275510 832565784
2376.1 832565784 832910597 833250284 833464682 833550274 833619177 833694577 833673179 833534718 833393514 833321869
$$ packed form
2223.1H35640609N5552l0995q404Q2672R1791O676m3691K5928J00136N0783k1159J669
2247.6H35951567N2929O2644J9133k1279J5259N3942J2935l9161k3186M0770Q3565
2270H36209118M7326j8715M232P3373N6088l6955q6784l0756K8967l6776j15692q2314
2294.5H36011112k7836n7459j59442k03252j31845p9155j38998k24173k09689j41860
2314.9H34637403k05039l36290l03030j60932j22428k28823l17633k39670j04070j10268
2335.3H32509220k08199k04385o0141J04904K74301L21865L8505l75510o33120o76572
2355.7H31090868m82262r1195O6817k7358J05202L87430M88341M23014L14653K90274
2376.1H32565784L44813L39687K14398Q5592O8903P5400k1398j38461j41204p1645
$$ plain form
2396.5 833321869 833248377 833089352 832897425 832768977 832699358 832596481 832413316 832222104 832090199 831959724
2416.9 831959724 831756413 831528366 831365347 831246078 831067979 830803812 830538094 830345333 830189824 829989195
2437.3 829989195 829735935 829505801 829333365 829133332 828842163 828521132 828255713 828018606 827713728 827339590
2457.7 827339590 826985538 826663435 826282203 825815082 825341284 824911892 824451447 823857248 823151171 822447419
2478.1 822447419 821786463 821084201 820294142 819490135 818747580 818042278 817305684 816568196 815950632 815477729
2498.5 815477729 815039158 814587295 814211965 813943982 813635707 813131750 812451601 811749458 811119080 810522616
2518.9 810522616 809963524 809568763 809412420 809385598 809368134 809397519 809549034 809762716 809875131 809829652
2539.2 809829652 809717238 809585690 809428811 809306502 809304059 809430957 809576035 809621215 809589148 809562564
$$ packed form
2396.5H33321869p3492j59025j91927j28448o9619j02877j83165j91212j31905j30475
2416.9H31959724k03311k28047j63019j19269j78099k64167k65718j92761j55509k00629
2437.3H29989195k53260k30134j72436k00033k91169l21031k65419k37107l04878l74138
2457.7H27339590l54052l22103l81232m67121m73798m29392m60445n94199p06077p03752
2478.1H22447419o60956p02262p90059q04007p42555p05302p36594p37488o17564m72903
2498.5H15477729m38571m51863l75330k67983l08275n03957o80149p02143o30378n96464
2518.9H10522616n59092l94761j56343k6822j7464K9385J51515K13682J12415m5479
2539.2H09829652j12414j31548j56879j22309k443J26898J45078M5180l2067k6584
$$ plain form
2559.6 809562564 809538960 809455514 809341073 809276819 809234619 809124351 808928907 808711588 808519661 808339596
2580 808339596 808127701 807891130 807668924 807445407 807179451 806890249 806634426 806411922 806169331 805869281
2600.4 805869281 805547416 805266500 805012643 804730296 804427028 804164708 803947270 803719878 803460360 803204417
2620.8 803204417 802981853 802757561 802501261 802243531 802021921 801805377 801542163 801272213 801064372 800884068
2641.2 800884068 800656915 800397515 800169408 799964368 799720168 799429655 799137890 798883975 798646331 798362732
2661.6 798362732 798059642 797788203 797509611 797186494 796859860 796566069 796266913 795928836 795575619 795246124
2682 795246124 794945121 794643879 794324934 793997586 793674588 793368876 793091357 792820156 792523265 792201698
2702.4 792201698 791879237 791577220 791281641 790960610 790639102 790340126 790035129 789723217 789439738 789192438
$$ packed form
2559.6H09562564k3604q3446j14441o4254m2200j10268j95444k17319j91927j80065
2580H08339596k11895k36571k22206k23517k65956k89202k55823k22504k42591l00050
2600.4H05869281l21865k80916k53857k82347l03268k62320k17438k27392k59518k55943
2620.8H03204417k22564k24292k56300k57730k21610k16544k63214k69950k07841j80304
2641.2H00884068k27153k59400k28107k05040k44200k90513k91765k53915k37644k83599
2661.6G98362732l03090k71439k78592l23117l26634k93791k99156l38077l53217l29495
2682G95246124l01003l01242l18945l27348l22998l05712k77519k71201k96891l21567
2702.4G92201698l22461l02017k95579l21031l21508k98976l04997l11912k83479k47300
$$ plain form
2722.8 789192438 788951337 788665593 788329422 788033009 787789643 787527382 787259638 787037909 786849916 786630571
2743.2 786630571 786387920 786184311 786009431 785791457 785485685 785148025 784859657 784611762 784339607 784018397
2763.6 784018397 783688843 783408642 783142626 782796562 782406569 782052994 781693101 781258523 780776978 780354798
2784 780354798 780024648 779678881 779215813 778673410 778181553 777758956 777264118 776646256 776040912 775509894
2804.4 775509894 774957597 774327278 773666084 773033440 772406697 771718204 770965934 770207405 769452035 768618107
2824.8 768618107 767653465 766652882 765696347 764640510 763301075 761688769 759818971 757512212 754556715
2843.1 754556715 750968218 747226894 744245112 742717862 742520332 743067980 743919075 744733512 745195210
2861.5 745195210 745206058 744891703 744388521 743744314 743045568 742462277 742067873 741752148 741357863 740831494
$$ packed form
2722.8G89192438k41101k85744l36171k96413k43366k62261k67744k21729j87993k19345
2743.2G86630571k42651k03609j74880k17974l05772l37660k88368k47895k72155l21210
2763.6G84018397l29554k80201k66016l46064l89993l53575l59893m34578m81545m22180
2784G80354798l30150l45767m63068n42403m91857m22597m94838o17862o05344n31018
2804.4G75509894n52297o30319o61194o32644o26743o88493p52270p58529p55370q33928
2824.8G68618107r64642j000583r56535j055837j339435j612306j869798k306759k955497
2843.1G54556715l588497l741324k981782j527250j97530N47648Q51095Q14437M61698
2861.5G45195210J0848l14355n03182o44207o98746n83291l94404l15725l94285n26369
$$ plain form
2881.9 740831494 740215123 739527583 738697469 737678707 736596227 735587955 734615862 733568788 732427657
2900.2 732427657 731301963 730193079 728826165 726966321 724643409 721975267 719110966 716405928
2916.6 716405928 714399278 713430166 713393033 713935912 714805782 715947509 717319965 718779862 720182896
2934.9 720182896 721530437 722904801 724274874 725477159 726371288 726980388 727373064 727491021 727298737
2953.3 727298737 727003992 726926029 727134287 727476120 727901638 728484392 729225099 729972303 730623543 731291354
2973.7 731291354 732076228 732904613 733703732 734489381 735279799 736027122 736614645 737003744 737317324 737609386
2994.1 737609386 737760127 737706363 737551868 737405658 737239659 736964703 736592352 736241877 735974610 735713840
3014.5 735713840 735390484 735064328 734778047 734431446 733957231 733412087 732875764 732353508 731769979 731114745
$$ packed form
2881.9G40831494o16371o87540q30114j018762j082480j008272r72093j047074j141131
2900.2G32427657j125694j108884j366914j859844k322912k668142k864301k705038
2916.6G16405928k006650r69112l7133N42879Q69870J141727J372456J459897J403034
2934.9G20182896J347541J374364J370073J202285Q94129O09100L92676J17957j92284
2953.3G27298737k94745p7963K08258L41833M25518N82754P40707P47204O51240O67811
2973.7G31291354P84874Q28385P99119P85649P90418P47323N87523L89099L13580K92062
2994.1G37609386J50741n3764j54495j46210j65999k74956l72351l50475k67267k60770
3014.5G35713840l23356l26156k86281l46601m74215n45144n36323n22256n83529o55234
$$ plain form
3034.9 731114745 730467260 729871213 729264498 728580177 727878571 727226913 726566732 725833774 725080848 724372864
3055.3 724372864 723685503 722988904 722321153 721724212 721156180 720516086 719798326 719122052 718544960 718013048
3075.6 718013048 717470884 716893971 716291368 715684831 715059221 714430332 713850260 713277221 712639213 711984575
3096 711984575 711386442 710788846 710099101 709371805 708749652 708212376 707582295 706854999 706208348 705661535
3116.4 705661535 705036700 704208374 703241706 702326417 701539755 700786293 699972332 699112713 698297858 697558045
3136.8 697558045 696775317 695835233 694835961 693904400 692994773 692097247 691274762 690416992 689371765
3155.2 689371765 688219309 687138438 686185598 685247004 684215426 683125198 682062984 681045473 679998159
3173.5 679998159 678897321 677778661 676677227 675601184 674487472 673340797 672278345 671271980
$$ packed form
3034.9G31114745o47485n96047o06715o84321p01606o51658o60181p32958p52926p07984
3055.3G24372864o87361o96599o67751n96941n68032o40094p17760o76274n77092n31912
3075.6G18013048n42164n76913o02603o06537o25610o28889n80072n73039o38008o54638
3096G11984575n98133n97596o89745p27296o22153n37276o30081p27296o46651n46813
3116.4G05661535o24835q28326r66668r15289p86662p53462q13961q59619q14855p39813
3136.8F97558045p82728r40084r99272r31561r09627q97526q22485q57770j045227
3155.2F89371765j152456j080871r52840r38594j031578j090228j062214j017511j047314
3173.5F79998159j100838j118660j101434j076043j113712j146675j062452j006365
$$ plain form
3189.9 671271980 670178235 668996513 667808414 666646540 665504336 664375365 663253427 662142634
3206.2 662142634 661037266 659917653 658793032 657668352 656557918 655458927 654333472 653205752
3222.5 653205752 652106166 650997996 649885595 648833394 647840977 646776915 645588458 644400954
3238.8 644400954 643297017 642280042 641338408 640397608 639341056 638216972 637201071 636288583 635327339
3257.2 635327339 634294569 633296847 632352293 631411493 630519807 629766345 629014850 628069758 627029538
3275.5 627029538 626040637 625098526 624162555 623230457 622315168 621389091 620483339 619629920 618706107 617633462
3295.9 617633462 616499901 615408063 614419103 613510966 612492502 611223936 609829128 608408928 606946409
3314.3 606946409 605496943 604095042 602657974 601134419 599556983 597919881 596214473 594477534
$$ packed form
3189.9F71271980j093745j181722j188099j161874j142204j128971j121938j110793
3206.2F62142634j105368j119613j124621j124680j110434j098991j125455j127720
3222.5F53205752j099586j108170j112401j052201r92417j064062j188457j187504
3238.8F44400954j103937j016975r41634r40800j056552j124084j015901r12488r61244
3257.2F35327339j032770r97722r44554r40800q91686p53462p51495r45092j040220
3275.5F27029538r88901r42111r35971r32098r15289r26077r05752q53419r23813j072645
3295.9F17633462j133561j091838r88960r08137j018464j268566j394808j420200j462519
3314.3F06946409j449466j401901j437068j523555j577436j637102j705408j736939
$$ plain form
3330.6 594477534 592712104 590956092 589285254 587588906 585714340 583750367 581825137 579995513
3346.9 579995513 578273594 576466024 574421585 572333932 570387721 568517029 566609085 564716458
3363.2 564716458 562995195 561348736 559488118 557379246 555333674 553546607 551864803 550203443
3379.5 550203443 548615396 547119558 545724869 544483185 543475926 542490840 541204393 539793849
3395.9 539793849 538687348 537875056 536874473 535527647 534294784 533411503 532664180 531862199 530942261
3414.2 530942261 530026913 529344618 528838754 528322339 527880192 527659595 527602971 527524292 527466357 527607560
3434.6 527607560 527760863 527673364 527543426 527678072 528087020 528590739 529062867 529570997 530195713 530940175
3455 530940175 531799674 532736897 533622503 534524798 535718501 537084460 538187325 538933218 539673328
$$ packed form
3330.6E94477534j765430j756012j670838j696348j874566j963973j925230j829624
3346.9E79995513j721919j807570k044439k087653j946211j870692j907944j892627
3363.2E64716458j721263j646459j860618k108872k045572j787067j681804j661360
3379.5E50203443j588047j495838j394689j241684j007259r85086j286447j410544
3395.9E39793849j106501q12292j000583j346826j232863q83281p47323q01981r19938
3414.2E30942261r15348o82295n05864n16415m42147k20597n6624p8679n7935J41203
3434.6E27607560J53303q7499j29938J34646M08948N03719M72128N08130O24716P44462
3455E30940175Q59499R37223Q85606R02295J193703J365959J102865P45893P40110
$$ plain form
3473.4 539673328 540680349 541991413 543377697 544533432 545617759 546899796 548219979 549435854
3489.7 549435854 550724149 552157223 553630054 555081069 556598723 558202982 559648395 560874164
3506 560874164 562149346 563639104 565315843 566966414 568458080 570005298 571788490 573745072 575558305
3524.4 575558305 577075899 578611016 580391347 582327902 584318399 586285293 588232458 590339839
3540.7 590339839 592601478 594793618 596742630 598605037 600596607 602652192 604750872 607010663
3557 607010663 609445930 611900032 614272714 616674304 619251907 621828139 624217212 626592875 629171550
3575.3 629171550 631915152 634746790 637723446 640826583 643872619 646678329 649416625 652277648
3591.7 652277648 655226886 658217013 661272168 664390564 667508125 670600891 673654437 676784217
$$ packed form
3473.4E39673328J007021J311064J386284J155735J084327J282037J320183J215875
3489.7E49435854J288295J433074J472831J451015J517654J604259J445413J225769
3506E60874164J275182J489758J676739J650571J491666J547218J783192J956582J813233
3524.4E75558305J517594J535117J780331J936555J990497J966894J947165K107381
3540.7E90339839K261639K192140J949012J862407J991570K055585K098680K259791
3557F07010663K435267K454102K372682K401590K577603K576232K389073K375663K578675
3575.3F29171550K743602K831638K976656L103137L046036K805710K738296K861023
3591.7F52277648K949238K990127L055155L118396L117561L092766L053546L129780
$$ plain form
3608 676784217 680039287 683283567 686473072 689603865 692746401 695970953 699027061 701906323 704880714
3626.3 704880714 708160102 711549044 714554012 717393041 720316648 723267794 726228714 729210973
3642.6 729210973 732241809 735473096 738997698 742144227 744492233 746741652 749450922 752250791
3659 752250791 754734397 756999373 759227037 761536539 763942420 766240001 768238902 770157158 771934927
3677.3 771934927 773392737 774783790 776251495 777881563 779829681 781622767 782659888 783454239
3693.6 783454239 784456432 785554707 786605060 787551403 788363457 789132297 789986491 790919960 791741610
3712 791741610 792332351 792762935 793172419 793650448 794151604 794567287 794877350 795200229 795672178 796373129
3732.4 796373129 797140658 797700346 797960222 798015773 798137903 798617303 799184263 799489081 799740732 800014079
$$ packed form
3608F76784217L255070L244280L189505L130793L142536L224552L056108K879262K974391
3626.3G04880714L279388L388942L004968K839029K923607K951146K960920K982259
3642.6G29210973L030836L231287L524602L146529K348006K249419K709270K799869
3659G52250791K483606K264976K227664K309502K405881K297581J998901J918256J777769
3677.3G71934927J457810J391053J467705J630068J948118J793086J037121P94351
3693.6G83454239J002193J098275J050353R46343Q12054P68840Q54194R33469Q21650
3712G91741610N90741M30584M09484M78029N01156M15683L10063L22879M71949P00951
3732.4G96373129P67529N59688K59876N5551J22130M79400N66960L04818K51651K73347
$$ plain form
3752.8 800014079 800236821 800448895 800621510 800716519 800813496 801033735 801323950 801549494 801701128 801794171
3773.2 801794171 801929355 802249253 802589953 802686870 802642882 802620769 802668214 802823246 803027034 803207397
3793.6 803207397 803388238 803580105 803749740 803882241 803914845 803865194 803861201 803879619 803940833 804097772 804324508
3816 804324508 804595828 804765224 804729581 804546237 804411352 804424822 804501712 804661810 804961205 805239022
3836.4 805239022 805264711 805086136 804934084 804888248 804858506 804828286 804838181 804845273 804863572 804800212 804664135
3858.8 804664135 804660141 804793894 804853737 804756641 804680705 804730654 804716527 804615557 804542720 804522693 804582775
3881.3 804582775 804652572 804646552 804547727 804410517 804306209 804192483 804076433 804073274 804191649 804269016 804194808
3903.7 804194808 804015338 803819776 803669393 803571939 803542852 803580523 803573549 803499699 803474784 803499043 803467274
$$ packed form
3752.8H00014079K22742K12074J72615R5009R6977K20239K90215K25544J51634R3043
3773.2H01794171J35184L19898L40700R6917m3988k2113M7445J55032K03788J80363
3793.6H03207397J80841J91867J69635J32501L2604m9651l993J8418O1214J56939K26736
3816H04324508K71320J69396l5643j83344j34885J3470P6890J60098K99395K77817
3836.4H05239022K5689j78575j52052m5836k9742l0220R895P092J8299o3360j36077
3858.8H04664135l994J33753N9843r7096p5936M9949j4127j00970p2837k0027O0082
3881.3H04582775O9797o020r8825j37210j04308j13726j16050l159J18375P7367p4208
3903.7H04194808j79470j95562j50383r7454k9087L7671o974p3850k4915K4259l1769
$$ plain form
3926.1 803467274 803371251 803300142 803296208 803274095 803131521 802957594 802880406 802888095 802916706 802907109 802854419 802800953
3950.6 802800953 802757859 802685797 802598059 802566290 802565157 802498400 802376449 802321136 802378058 802442312 802448034 802460790
3975.1 802460790 802447736 802353263 802315593 802383780 802393198 802299917 802210271 802130640 802059591 802056849 802094758
3997.5 802094758
$$ packed form
3926.1H03467274r6023p1109l934k2113j42574j73927p7188P689K8611r597n2690n3466
3950.6H02800953m3094p2062q7738l1769j133o6757j21951n5313N6922O4254N722J2756
3975.1H02460790j3054r4473l7670O8187R418r3281q9646p9631p1049k742L7909
3997.5H02094758
##END=$$ End of the data block
