##TITLE=PABA $$ Begin of the data block
##JCAMP-DX=5.00 $$ ACD/SpecManager v 10.08
##SPECTROMETER/DATA SYSTEM=Alpha
##DATE=24 Feb 2014 12:25:22
##DATA TYPE=INFRARED SPECTRUM
##DATA CLASS=XYDATA
##ORIGIN=
##OWNER=
##NPOINTS=1765
##FIRSTX=399.75695801
##LASTX=3997.56933594
##MAXX=3997.56933594
##MINX=399.75695801
##MAXY=0.67329884
##MINY=0.24929927
##XFACTOR=1.0000000000
##YFACTOR=1.000000000000000e-9
##FIRSTY=0.59178352
##DELTAX=2.03957629
##XUNITS=1/CM
##YUNITS=ARBITRARY UNITS
##XYDATA=(X++(Y..Y))
399.8E91783524l44813q851290j5140593j5568495j1445880r711683r831190p331669
416.1E13557911k101243M862965R195864R731114O792545L000140K802491N058587
432.4E52900374O912172R095192R571254M443288l486037p475317n734980k439141
448.7E63786805J6868K921283O285310P396877M919290J784921J001537K66850k496183
467.1E85883558m298628k481937L88324Q64446R09031L159642M888237L157854L25858
485.4E92796385l99112r77278m202485q075714r905756j1995375j7743766k6251972
501.7E13244927k9148579j5910715J1113644K9343098K3175836P542968L02553L899515
518.1E43563247J1104941J1418104J980126r786844j4746130j1920452o753921m258394
$$ plain form
399.8 591783524 591438711 582587421 567446828 551878333 540432453 530720770 520889580 513557911
416.1 513557911 511456668 516319633 525515497 535246611 542039156 545039296 547841787 552900374
432.4 552900374 559812546 568907738 578478992 582922280 579436243 571960926 566225946 563786805
448.7 563786805 563803673 566724956 573010266 580407143 585326433 587111354 588112891 588379741 585883558
467.1 585883558 581584930 579102993 579491317 580355763 581264794 584424436 589312673 592470527 592796385
485.4 592796385 592397273 591419995 587217510 579141796 569236040 557240665 539496899 513244927
501.7 513244927 484096348 468185633 479299277 508642375 531818211 539361179 539663732 543563247
518.1 543563247 554668188 566086292 568066418 558279574 543533444 531612992 524859071 520600677
534.4E20600677m955233m740715j395523L886699J0376394J7975331K3720085K2861958
550.7E88329673J4880478M304648n094648j1904955j3813316o342352J0922134K6587903
567F07869565K8603077K0580590J1856199M389405j356960l065884j569986j116037
583.3F66189969l017545m056752k601623j717687l113329m139126l003239j954079
599.6F42586589l101349m339397l434479k166629l047586m414558l506660j271904
616F17304027l31163J4126K081215M638136M487395J901209L45231J94370j016319
634.3F29618227l769040n553960n747319p126152j0922790j4222979j5160144j7071426
650.6E50044417k3901522l5935253m5791983l1061918J6518504M8369318L0620873
$$ plain form
534.4 520600677 515645444 510904729 509509206 513395905 523772299 541747630 565467715 588329673
550.7 588329673 603210151 607514799 602420151 590515196 576701880 570359528 581281662 607869565
567 607869565 636472642 657053232 668909431 673298836 671941876 668875992 667306006 666189969
583.3 666189969 663172424 659115672 656514049 654796362 651683033 647543907 644540668 642586589
599.6 642586589 639485240 635145843 631711364 629544735 626497149 622082591 618575931 617304027
616 617304027 616972864 616986990 619068205 623706341 628193736 630094945 630440176 630634546 629618227
634.3 629618227 625849187 620295227 614547908 607421756 596498966 582275987 567115843 550044417
650.6 550044417 526142895 490207642 444415659 413353741 429872245 478241563 508862436
664.9E08862436J0069310L0156076M6162129L6098480K1176756N581200n302549j0861575
681.2F41942263j3951540j9518316k9493511l5986006j8685937K0568490M0376008
695.5E85251451K1862268r364963l2731175k9784262J2054264N0252796M2681634J4649987
711.8F54872000j704931o097853n930126n702913o313383o865502o981849p862211
728.1F07413232r772479j1273682j2243390j4983297k0813525k8147280l4366160l8369030
744.4D37444389m2846471n0678492n5794328l8825825J0491952N8565766O2302381
758.7C80659372L1410604J466632l807902Q761197N021811m878968J3138592M3986291
775D75757629N7425707M7098458K7469575J4407576P335007M62591o562173j1586666
$$ plain form
664.9 508862436 518931746 549087822 595249951 631348431 652525187 658106387 652803838 641942263
681.2 641942263 627990723 608472407 578978896 542992890 524306953 544875443 585251451
695.5 585251451 607113719 597748756 565017581 535233319 547287583 597540379 640222013 654872000
711.8 654872000 653167069 647069216 641139090 635436177 629122794 622257292 615275443 607413232
728.1 607413232 597640753 586367071 574123681 559140384 538326859 510179579 475813419 437444389
744.4 437444389 394597918 343919426 288125098 249299273 259791225 318356991 380659372
758.7 380659372 412069976 413536608 409728706 418489903 423511714 418632746 431771338 475757629
775 475757629 533183336 580281794 607751369 622158945 629493952 629956543 623394370 611807704
791.4F11807704j3640523j3383090q941889J28388M588127K583504O461918Q537770
807.7E98141909m110098q100271P254779J2324095Q45730p225037r434938j2206793
824E77489376j5694678j8301010k0101190k0367503j5449494l990024R659201J9178301
840.3E12422979J8472552L982842j9545138l4822046j5015454L5285205O1681449L7279308
856.6E99741697k488494k0331204p585942J7875135K6264429J3253033j652479r425581
872.9F15650594j3063609j1729360m732609k7001k990544p983982r489954q649468
889.3E56984067q374572r042680r140313q353710p950544q399427q611828q076072
905.6D89034921p820308q509189r233236r060115q448422q183062p920265o871850
$$ plain form
791.4 611807704 598167181 584784091 575842202 575970590 580558717 583142221 589604139 598141909
807.7 598141909 594031811 585931540 593186319 605510414 606356144 599131107 589696169 577489376
824 577489376 561794698 543493688 523392498 503024995 487575501 483585477 493244678 512422979
840.3 512422979 530895531 534878373 515333235 480511189 465495735 500780940 562462389 599741697
856.6 599741697 597253203 576921999 569336057 587211192 613475621 626728654 625076175 615650594
872.9 615650594 602586985 590857625 586125016 586098015 583107471 575123489 565633535 556984067
889.3 556984067 548609495 539566815 530426502 522072792 514122248 505722821 497110993 489034921
905.6 489034921 481214613 472705424 463472188 454412073 445963651 437780589 429860324 422988474
921.9D22988474n270451l853112k480597l88473K587527N820602Q882344J1999249
938.2D40285563J5112550J7250806J7645716J6793192J5350759J2725889P717431J881719
954.5E44763625M4763Q43465j306474j387417M288435P779300P098078N873979M142105
972.9E72139859K456367J274586k07365j202345o07550K35498J00971k28167l59833
991.2E73602021j057685k210378j714707L95358J046896l91126k005875k555072k207697
1009.6E62901735k146125k842366l482998l601372l855348m568457m771769l892660
1025.9E33740640k964855l098368l445626r63151M564464P116377L900707k62558k319098
1044.3E36268532l509819m607260n048216m868030m943610n467772n573988m983366
$$ plain form
921.9 422988474 417718023 413864911 411384314 410995841 413583368 419403970 428286314 440285563
938.2 440285563 455398113 472648919 490294635 507087827 522438586 535164475 542881906 544763625
954.5 544763625 544808388 545651853 544345379 542957962 547246397 555025697 562123775 567997754 572139859
972.9 572139859 574596226 575870812 575663447 574461102 573853552 574089050 574190021 573961854 573602021
991.2 573602021 572544336 570333958 568619251 569014609 570061505 569670379 567664504 565109432 562901735
1009.6 562901735 560755610 557913244 554430246 550828874 546973526 542405069 537633300 533740640
1025.9 533740640 530775785 527677417 524231791 523268640 527833104 534949481 538850188 538587630 536268532
1044.3 536268532 532758713 528151453 523103237 518235207 513291597 507823825 502249837 497266471
1060.6D97266471m612445n010099n537957n209267k828002K095998O435662O471366
1076.9D89071727L197342j93745k146482k585024k318353k388507k980083l408939
1093.2D76247936l404915l619432m348994n019962n287856n635739o330520o714373
1109.5D35886145n923480l925890j600385K74808J441002J759380J012891n87672k423197
1127.9D25913602m132092n811065p138342o919503m590869j853883j254708k784520
1144.2C91428620m444331m220307m43429M696220L351420q860409k1611392j7646283
1160.5C42250109K358138K3447812M0401667M7585756L7656814J8942326K939403o421626
1176.8E09160399r466052r256392q432627q082420q106678q323580r143681j0861903
$$ plain form
1060.6 497266471 492654026 487643927 482105970 476896703 474068701 476164699 482600361 489071727
1076.9 489071727 492269069 492075324 489928842 487343818 485025465 482636958 479656875 476247936
1093.2 476247936 472843021 469223589 464874595 459854633 454566777 448931038 442600518 435886145
1109.5 435886145 429962665 426036775 424436390 424711198 426152200 427911580 428924471 428336799 425913602
1127.9 425913602 421781510 415970445 408832103 401912600 397321731 395467848 394213140 391428620
1144.2 391428620 386984289 382763982 382320553 387016773 390368193 381507784 359896392 342250109
1160.5 342250109 344608247 368056059 408457726 456043482 493700296 512642622 515582025 509160399
1176.8 509160399 499694347 490437955 482005328 473922908 465816230 457492650 448348969 437487066
1193.1D37487066j2464136j1381447o235153j273304k100647o718009r713322j0071785
1209.5C77529263r213209p787406o326139n576909n834728o824732q214682r764225
1225.8C17987233j1053681j1645645j1451542j0912270j0190099q103103l262400L353298
1242.1B54721791Q710116J1100679J1667014J2148529J3364345J5622019J8102050
1256.4C45436543J9041062J7464280J3842821R596646N884230K841204K19256j910240
1272.7D12415802l210306l426134k264351j41859n48214o260872j2752741j4548659
1289C69262666j3183564j2140066j1554092r542733m591942L640920J3798207K0048797
1305.3C55738193J5405774K641410p933528j2382477j2966782j0507703m495323L726721
$$ plain form
1193.1 437487066 425022930 413641483 407406330 406133026 404032379 397314370 387601048 377529263
1209.5 377529263 368316054 360528648 354202509 348625600 342790872 335966140 327751458 317987233
1225.8 317987233 306933552 295287907 283836365 272924095 262733996 254630893 251368493 254721791
1242.1 254721791 263431907 274532586 286199600 298348129 311712474 327334493 345436543
1256.4 345436543 364477605 381941885 395784706 405381352 411265582 414106786 414326042 412415802
1272.7 412415802 409205496 405779362 403515011 403373152 402824938 396564066 383811325 369262666
1289 369262666 356079102 343939036 332384944 322842211 318250269 321891189 335689396 355738193
1305.3 355738193 371143967 373785377 365851849 353469372 340502590 329994887 325499564 329226285
1321.6C29226285J1750907J8128395K1617115K1591365J8942296J5318662J1825204
1335.9D48400229Q891165O606549N011887M153311L421873J803726o87212l416031
1352.2D74185497o372720r894103j3837457j8259078k2883117k4520487k1980703j6056061
1368.5C40381771n048155R637594K3459673K8526276K2908598J1078745R1613j246393
1384.9D29789722P912129J6820669J6057909J0719925O231695L336907J403957n96791
1401.2D91676122k658933l518135l446579n091190q811146j1868507j2390882j0802507
1417.5D33088243o405711J72198N322486Q631229R911746J0304511R404599O525070
1433.8D76954371M315376L695965K393782j86890l838689r104341j6289532k0466775
$$ plain form
1321.6 329226285 340977192 359105587 380722702 402314067 421256363 436575025 448400229
1335.9 448400229 457291394 463897943 468909830 473063141 476485014 478288740 477601528 474185497
1352.2 474185497 467812777 457918674 444081217 425822139 402939022 378418535 356437832 340381771
1368.5 340381771 335333616 344971210 368430883 396957159 419865757 430944502 431036115 429789722
1384.9 429789722 437701851 454522520 470580429 481300354 487532049 490868956 492272913 491676122
1401.2 491676122 489017189 485499054 482052475 476961285 468150139 456281632 443890750 433088243
1417.5 433088243 426682532 426854730 432177216 440808445 450720191 461024702 470429301 476954371
1433.8 476954371 481269747 484965712 487359494 487172604 483333915 474229574 457940042 437473267
1450.1D37473267j5200317l232926O256134O929159L929764L548085M186273M409582
1466.4D48299021L000885R25541k04355j035064m512310j1370600k0736605k7299404
1482.8C87067109k1288871k383680K1787554L7345976L4020186K6297360K2084624
1497E04930258J5496135P677733K181948k99514J550377L263175Q48651j932740l598452
1515.4E30117571l644287l173053l366352l143549l114283l632128m023015n134464
1531.7E00886440o038129n338907o343842r852171r837478q106142q969486j0668814
1548D35731471j2799949j4094204j4839172j4465630j4436066j1660636n916714m100085
1564.3C43419015j709610K644777N158693K358645l173113q592605j0324240j0833114
$$ plain form
1450.1 437473267 422272950 419040024 425296158 432225317 436155081 439703166 443889439 448299021
1466.4 448299021 451299906 452225447 452021092 450986028 446473718 435103118 414366513 387067109
1482.8 387067109 365778238 363394558 385182112 422528088 456548274 482845634 504930258
1497 504930258 520426393 528104126 530286074 529986560 531536937 534800112 535648763 533716023 530117571
1515.4 530117571 526473284 523300231 519933879 516790330 513676047 510043919 506020904 500886440
1531.7 500886440 494848311 489509404 483165562 473313391 463475913 455369771 446400285 435731471
1548 435731471 422931522 408837318 393998146 379532516 365096450 353435814 347519100 343419015
1564.3 343419015 341709405 344354182 349512875 351871520 348698407 340105802 329781562 318948448
1580.7C18948448j1819750j0271252n385637J951486J0016292J6500354K0172090K0457714
1597C60569745J6824276R605348O95884o187916r376556r707599q345783o634504m070431
1615.3C43372464L223866J2023628J8026531K3741722K4039745K0681680J7100930
1629.6D62210566J1261999N963862L544808K571791L24875k795577o380230j1056513
1645.9D65645581j3346463j1737734j6165167k2844166j6515672j4116615j6280681
1660.2C54639083j7199129j4418155r812504p485121m757017m26203L916144Q136034
1676.5C12593132J0473490J1471540J4468610K1205545K0653456J6513675J6120881
1690.8D23500329J4572501J4638842J5670299J5124053J7134726J4595807J1460602
$$ plain form
1580.7 318948448 307128698 296857446 291471809 293423295 303439587 319939941 340112031 360569745
1597 360569745 377394021 386999369 387695253 381507337 372130781 362423182 354077399 347442895 343372464
1615.3 343372464 346596330 358619958 376646489 400388211 424427956 445109636 462210566
1629.6 462210566 473472565 479436427 482981235 485553026 485877901 483082324 476702094 465645581
1645.9 465645581 452299118 440561384 424396217 401552051 385036379 370919764 354639083
1660.2 354639083 337439954 323021799 313209295 305724174 300967157 300540954 304457098 312593132
1676.5 312593132 323066622 334538162 349006772 370212317 390865773 407379448 423500329
1690.8 423500329 438072830 452711672 468381971 483506024 500640750 515236557 526697159
1705.1E26697159J1341274R684562P260263N011380L683507M872322O554723N544067
1721.4E80649257M003763L205061K310812J339197M36903Q60214K621829K408803J668274
1739.7E99504113J955450K211392J881659J442551J814366K867102K534986J392305
1756.1F15603924P98046O51896J189053J793445J288414N44190L79384J321017K804280
1774.4F26373649K861619K207636J829029J553833J242042J142978O73235j00017L32713
1792.8F38116717J355231J254022O92547P51853J175105J016498K19166n50747n90741
1811.1F43439651k94984o68764j390934j385510p08938p3850K91169J39773r5964J69397
1831.5F39421046k45571j178921j014828j73509j47820l29733O35147J437426J143694
$$ plain form
1705.1 526697159 538038433 547722995 554983258 559994638 563678145 568550467 575105190 580649257
1721.4 580649257 584653020 587858081 590168893 591508090 591944993 592805207 595427036 597835839 599504113
1739.7 599504113 601459563 603670955 605552614 606995165 608809531 611676633 614211619 615603924
1756.1 615603924 616401970 617053866 618242919 620036364 621324778 621868968 622248352 623569369 626373649
1774.4 626373649 629235268 631442904 633271933 634825766 636067808 637210786 637884021 637784004 638116717
1792.8 638116717 639471948 640725970 641418517 642170370 643345475 644361973 644581139 644030392 643439651
1811.1 643439651 643144667 642475903 641084969 639699459 638990521 638916671 639207840 639347613 639251649 639421046
1831.5 639421046 639175475 637996554 636981726 636808217 636660397 636330664 636965811 638403237 639546931
1849.9F39546931L98516j20282j84774k56539o00099r48250j220704j719594j972854
1868.2F32922351j267373n18084l88086l89754l78192l10182j99795k79188n61655
1886.6F28630042o10113p9572J56820k28227l86476k91228m67062r14872j291514j418888
1907F23098910j401305j448751j668811j920581j810729j090705k48731M89116R05097
1925.3F14903510L99649n87523j307011j723945k004147j854837j073241j9848Q06272
1943.7F07538879Q26836K75671j38402m05848p47383q86142n32329m9829M8399J7583
1964.1F05947435O01172J540423J632631Q66115K15888J847j02579m03702p77901r54926
1984.5F08566403j061260j381934j710594j272559k4378P93874O11127J31130o4254
$$ plain form
1849.9 639546931 639945447 639825165 639640391 639383852 638783753 637835503 636614799 634895205 632922351
1868.2 632922351 631654978 631136894 630748808 630359054 629980862 629670680 629470885 629191697 628630042
1886.6 628630042 628019929 627940357 628097177 627868950 627482474 627191246 626724184 625809312 624517798 623098910
1907 623098910 621697605 620248854 618580043 616659462 614848733 613758028 613509297 613998413 614903510
1925.3 614903510 615303159 614715636 613408625 611684680 609680533 607825696 606752455 606732607 607538879
1943.7 607538879 608365715 608641386 608502984 608097136 607349753 606463611 605931282 605881453 605929852 605947435
1964.1 605947435 606548607 608089030 609721661 610587776 610803664 610805511 610702932 610299230 609521329 608566403
1984.5 608566403 607505143 606123209 604412615 603140056 603115678 603909552 604520679 604651809 604587555
2002.8F04587555j20163k71797l62158k33173j39714l26395m74810k64287k2829r3639
2023.2F02278590l13043l34978j73569j41144k97844l59059k53439k76088m85778n74589
2043.6E99069059m51803l93749n14686o17563n16594l50892l81411n07950m07040r7216
2064E94830155J04309J36494K83897O74963R55045Q89302P93814R12488R72092P47502
2084.4F01300061N01334N12541N95689M07576J15574J37388L93749M51147K83718K66493
2104.8F04965270M54127M80473K55287J72913M07696O09279N21957M34757N84364O79671
2125.2F09565794M46678J58071J71244K95937J31429k28286l52502k24650j97887l54946
2145.6F09410882l96311k38896k15530m55320o32882n47648m99785p53045j027941
$$ plain form
2002.8 604587555 604467392 604195595 603833437 603600264 603460550 603134155 602659345 602395058 602372229 602278590
2023.2 602278590 601965547 601630569 601457000 601315856 601018012 600658953 600405514 600129426 599643648 599069059
2043.6 599069059 598617256 598223507 597708821 597091258 596574664 596223772 595842361 595334411 594927371 594830155
2064 594830155 594934464 595070958 595354855 596029818 596984863 597874165 598667979 599580467 600552559 601300061
2084.4 601300061 601801395 602313936 602909625 603317201 603432775 603570163 603963912 604415059 604698777 604965270
2104.8 604965270 605419397 605899870 606155157 606328070 606735766 607345045 607867002 608301759 608886123 609565794
2125.2 609565794 610012472 610170543 610341787 610637724 610769153 610540867 610188365 609963715 609765828 609410882
2145.6 609410882 609014571 608775675 608560145 608104825 607471943 606924295 606424510 605671465 604643524
2164F04643524r79424q24034r19461j096189r94683p52627p60198r65417r93609q06034
2184.4E95551848p48097r04441r88722r06110r27448j206041j440346j334488j133144
2202.7E85963011j166284j232624j029909p07805n68092n57840m15385k01881j96993
2221.1E79886198l95060n35845n55456p36356j169801j466393j375198j186788j166106
2239.4E71299195j103937q05140n16057n01394n97298n19157l41058l61979n30183
2257.8E66022992n44965m34935m33505n82754o80566o03199n55277p15196r02236r02116
2278.2E59668243q35657r13859j019537r12786o90996o35684p46369p95007p81059
2296.5E52337289q89957j091600j188099j204371j334906j579046j727641j657545
$$ plain form
2164 604643524 603664100 602840066 601920605 600824416 599829733 599077106 598316908 597351491 596357882 595551848
2184.4 595551848 594803751 593899310 592910588 592004478 591077030 589870989 588430643 587096155 585963011
2202.7 585963011 584796727 583564103 582534194 581826389 581258297 580700457 580285072 580083191 579886198
2221.1 579886198 579491138 578955293 578399837 577663481 576493680 575027287 573652089 572465301 571299195
2239.4 571299195 570195258 569390118 568874061 568372667 567775369 567256212 566915154 566553175 566022992
2257.8 566022992 565478027 565043092 564609587 564026833 563346267 562743068 562187791 561472595 560570359 559668243
2278.2 559668243 558832586 557918727 556899190 555986404 555295408 554659724 553913355 553118348 552337289
2296.5 552337289 551447332 550355732 549167633 547963262 546628356 545049310 543321669 541664124
2312.9E41664124j575709j702070j860023j813292j675010j686513j846135j845121
2329.2E27660251j573146j399994j483380j552523j492679j437187j281798q12888
2345.5E16626656m72128q84474j790344k402187k271235j888036j602889j243233p53165
2363.8E03318965l19302p8320P8499K97010N09024O16193O17563N61118M74394L12984
2384.2E06388128M7803j96755l09110l78728n27680o88433p62642q14557r16958j002967
2404.6E00838101r75520q88615q86947r77546j019329r64314r22113r68725j034111
2423D92200881j034230j027435j096308j150519j084208r97424r98438j031816j002550
2441.3D82777953r28521r11802r74774j041979j075357j124472j237988j353949j365543
$$ plain form
2312.9 541664124 540088415 538386345 536526322 534713030 533038020 531351507 529505372 527660251
2329.2 527660251 526087105 524687111 523203731 521651208 520158529 518721342 517439544 516626656
2345.5 516626656 516154528 515270054 513479710 511077523 508806288 506918252 505315363 504072130 503318965
2363.8 503318965 502999663 502921343 502999842 503296852 503805876 504422069 505039632 505600750 506075144 506388128
2384.2 506388128 506435931 506239176 505930066 505551338 505023658 504335225 503572583 502758026 501841068 500838101
2404.6 500838101 499862581 498973966 498087019 497109473 496090144 495125830 494203717 493234992 492200881
2423 492200881 491166651 490139216 489042908 487892389 486808181 485810757 484812319 483780503 482777953
2441.3 482777953 481849432 480937630 479962856 478920877 477845520 476721048 475483060 474129111 472763568
2459.7D72763568j331806j354218j364350j266777j146228j150190j199872j133680
2476D62816447r82970q61198p68721o35862m81963m22448m91262o10947p24346q37743
2496.4D55998987r93699j170963j295924j370251j437396j490921j495421j468748
2512.7D45275664j481324j525432j510978j423061j332044j271308j181662r89616
2529D34560239o75678k81841J10001M72218P55012Q48680P93457O95199N74351M28110
2549.4D38279748K69502J47194P7516R984o9052j00494q5324j19060k32786l54558
2569.8D37822670m37290n16593o16938o83487o70373n76377l90917j37776J41472M42564
2590.2D34376955P29889R33557J050890J120239J136363J064986R09418P67171P34478
$$ plain form
2459.7 472763568 471431762 470077544 468713194 467446417 466300189 465149999 463950127 462816447
2476 462816447 461833477 460972279 460203558 459567696 459085733 458663285 458172023 457561076 456836730 455998987
2496.4 455998987 455005288 453834325 452538401 451168150 449730754 448239833 446744412 445275664
2512.7 445275664 443794340 442268908 440757930 439334869 438002825 436731517 435549855 434560239
2529 434560239 433884561 433602720 433712721 434184939 434939951 435788631 436582088 437277287 437851638 438279748
2549.4 438279748 438549250 438696444 438773960 438783944 438714892 438614398 438529074 438410014 438177228 437822670
2569.8 437822670 437385380 436868787 436251849 435568362 434897989 434321612 433930695 433792919 433934391 434376955
2590.2 434376955 435106844 436040401 437091291 438211530 439347893 440412879 441322297 442089468 442823946
2608.6D42823946P94501Q98927J051366J206518J247853J149058R71198P65771N52565
2626.9D51461703L22699J56105J53571K22206K45452K62082L51101N29438P35402Q80301
2647.3D55320060R29505R19044Q74132P82311P25925Q20130R72092J017213J015782
2665.7D63376194J058340J061172R34690O85513M47303K96056R2894j90109m14789
2684.1D67347264n52863o36786o54131n68002l64244j45078j5080N5611J19448J32024
2704.5D64718163N6952r805m321M1306J07884J80483K79188M04835M35978L64960L70085
2726.9D66945708N08308O66917P57604Q08210Q46535Q00043O59108N58406N82844P12663
2747.3D73846346Q57979R41456R97483J006753Q73297O13719L48300J48654k6196k03610
$$ plain form
2608.6 442823946 443618447 444517374 445568740 446775258 448023111 449172169 450143367 450909138 451461703
2626.9 451461703 451784402 451940507 452094078 452316284 452561736 452823818 453174919 453704357 454439759 455320060
2647.3 455320060 456249565 457168609 458042741 458825052 459550977 460371107 461343199 462360412 463376194
2665.7 463376194 464434534 465495706 466430396 467115909 467563212 467859268 467952162 467762053 467347264
2684.1 467347264 466794401 466157615 465503484 464935482 464571238 464426160 464411080 464466691 464586139 464718163
2704.5 464718163 464775115 464765310 464760989 464802295 464910179 465090662 465369850 465774685 466210663 466575623 466945708
2726.9 466945708 467454016 468120933 468878537 469686747 470533282 471333325 471992433 472550839 473133683 473846346
2747.3 473846346 474704325 475645781 476643264 477650017 478523314 479137033 479485333 479633987 479607791 479404181
2767.7D79404181l07172k72602j77235r5039q643L9786n1677l20405o61432r21876
2788.1D76627886j114279j307606j421035j331895j089186q68440p49319o41078m75168
2806.4D67629880l78788m69684o41317p26789p47829p82580p53164n78910l41147j43349
2826.8D62066323K1696J48236J80304J08153j7464j55687l07709m57794n64664n88030
2847.2D60433364n21153m48019m60445n04375m80264m40687m62532m58002l49075j98633
2867.6D56110179m8458J40816L42101M89473O26683P37548P28518O53535N55664L95537
2888D60731596K56955K44886L42190M85003O43373Q51154J083404J202315J145601
2906.4D66986477J010239Q95054P54773N31823L36468K70307K90096L52889M44442
$$ plain form
2767.7 479404181 479097009 478824407 478647172 478552133 478543490 478583276 478531599 478211194 477549762 476627886
2788.1 476627886 475513607 474206001 472784966 471453071 470363885 469495445 468746126 468105048 467629880
2806.4 467629880 467251092 466781408 466140091 465413302 464665473 463882893 463129729 462550819 462209672 462066323
2826.8 462066323 462088019 462236255 462416559 462524712 462507248 462351561 462043852 461586058 461021394 460433364
2847.2 460433364 459912211 459464192 459003747 458499372 458019108 457578421 457115889 456657887 456308812 456110179
2867.6 456110179 456061721 456202537 456544638 457034111 457660794 458398342 459126860 459780395 460336059 460731596
2888 460731596 460988551 461233437 461575627 462060630 462704003 463555157 464638561 465840876 466986477
2906.4 466986477 467996716 468891770 469646543 470178366 470514834 470785141 471075237 471428126 471872568
2924.7D71872568N56350O54310O33418N23627M72665M80503M88073M98473N48691O06864
2945.1D77335542N65589M37796L49969L40700L41415L28213L44664L78102L85136M08113
2965.5D81215239N03897O27458O74457O13630N00202M08649L60280K80023J42366K7805
2985.9D85354006O378J3262p3731j81436j53482l2515Q0616K27749M49628O45160P22498
3008.3D87058133P10755N95302L61830J12086j03891k72095l59028m62801o55293p52121
3028.7D86232877n54323p4774M12434O62893O94275N43535L60816M11481O24329O71953
3049.1D89985496L50594k34574p00742q18699o44625k65449J53065L41147J93268j3053
3069.5D88346428N6803K75195L34918L37571P41959J732081K631277K601534J845836
$$ plain form
2924.7 471872568 472428918 473083228 473716646 474240273 474712938 475193441 475681514 476179987 476728678 477335542
2945.1 477335542 477901131 478338927 478688896 479029596 479371011 479699224 480043888 480421990 480807126 481215239
2965.5 481215239 481719136 482346594 483021051 483634681 484134883 484543532 484903812 485183835 485326201 485354006
2985.9 485354006 485360384 485373646 485299915 485118479 484964997 484932482 485013098 485240847 485690475 486335635 487058133
3008.3 487058133 487768888 488364190 488726020 488838106 488734215 488462120 488103092 487640291 486984998 486232877
3028.7 486232877 485678554 485603780 486016214 486679107 487373382 487916917 488277733 488689214 489313543 489985496
3049.1 489985496 490336090 490101516 489400774 488582075 487937450 487672001 487825066 488166213 488359481 488346428
3069.5 488346428 488403231 488678426 489013344 489350915 490092874 491824955 494456232 497057766 498903602
3087.9D98903602J191825R81152R74000R29057Q64864Q34882Q16822P93338Q21054
3106.2E07110596R83059J179755J248538J247049J261174J216174J057863Q70585P44105
3124.6E16918898O28888M37200J90676n246r6976j65105k41399k37465j62184j04130
3145E17163157m8756M0710J53005K39730K10643J11758R5129J40965J03474r54j2338
3167.4E18196523O4135L4928j34766k89083l69608m69327o68883q71718r92358j108169
3187.8E13391674j274348j453817j581490j676023j789272j883924j962780k088637
3204.1D99681383k262950k467215k697378k952874l231734l563046l951878m330605
3220.5D74223703m696429n081325n363793n366087n070775m438639l401011j968384
$$ plain form
3087.9 498903602 500095427 501076579 502050579 502979636 503844500 504679382 505496204 506289542 507110596
3106.2 507110596 508093655 509273410 510521948 511768997 513030171 514246345 515304208 516174793 516918898
3124.6 516918898 517547786 517984986 518175662 518170416 518073440 517908335 517666936 517429471 517267287 517163157
3145 517163157 517114401 517155111 517308116 517547846 517758489 517870247 517965376 518106341 518209815 518208861 518196523
3167.4 518196523 518260658 518295586 518160820 517871737 517502129 517032802 516363919 515492201 514499843 513391674
3187.8 513391674 512117326 510663509 509082019 507405996 505616724 503732800 501770020 499681383
3204.1 499681383 497418433 494951218 492253840 489300966 486069232 482506186 478554308 474223703
3220.5 474223703 469527274 464445949 459082156 453716069 448645294 444206655 440805644 438837260
3236.8D38837260j26302J938551L903717N665452P110685Q031666Q466214Q614838
3253.1D82442081Q538365Q139670P456303O708443N967379N162596M318357L489911
3269.4E32223105K699912K022207J461685R48965N05924J23084k85149o89387j016319
3287.8E37994027j272917j578033k012610k493203l012299l679455m472077n313396
3304.1E14160037o264031p306397q255064q935273r174854q849322p879377o141901
3320.4D51353818l674835p74562K116352M601687O554336Q012086R020954R528518
3336.7D86738354R411395Q666604P416666N867898M240752K692163J283884o9321j423180
3355.1E24825215k792656m349232o289482q721709j1688620j4826387j6552776j3766706
$$ plain form
3236.8 438837260 438710958 440649509 444553226 450218678 457329363 465361029 473827243 482442081
3253.1 482442081 490980446 499120116 506576419 513284862 519252241 524414837 528733194 532223105
3269.4 532223105 534923017 536945224 538406909 539355874 539861798 539984882 539699733 539010346 537994027
3287.8 537994027 536721110 535143077 533130467 530637264 527624965 523945510 519473433 514160037
3304.1 514160037 507896006 500589609 492334545 483399272 474224418 465375096 457495719 451353818
3320.4 451353818 447678983 446904421 449020773 453622460 460176796 468188882 477209836 486738354
3336.7 486738354 496149749 504816353 512233019 518100917 522341669 525033832 526317716 526248395 524825215
3355.1 524825215 522032559 517683327 511393845 502672136 490983516 476157129 459604353 445837647
3371.4D45837647m330218Q615672J7782152J9335300J5941679J1890769Q807719O549776
3387.7E30430496N052209M105627L182531K087533J065612K73108l32832p03871q27193
3406.1E44333220q61466q46744p74860p24197p23123p67827q35956q80301r65118j120150
3426.5E35833478j217663j282692j315177j280010j336157j532674j704871j744747
3442.8E24419487j773477j830340j870632k109706k670705l415645m362940n705238
3459.1E00680804p608324r977728j2613624j5153617j5984386j2600303m618645M240006
3475.4D26364183J0290564J4238864J7567277J8629938J6149282J1974872Q306205
3489.7E23521185N900323M597664M151106M126370M044414M067361M369259M471779
$$ plain form
3371.4 445837647 441507429 450123101 467905253 487240553 503182232 515073001 523880720 530430496
3387.7 530430496 535482705 539588332 542770863 544858396 545924008 546197116 545864284 545160413 544333220
3406.1 544333220 543471754 542625010 541850150 541125953 540402830 539635003 538799047 537918746 536953628 535833478
3426.5 535833478 534615815 533333123 532017946 530737936 529401779 527869105 526164234 524419487
3442.8 524419487 522646010 520815670 518945038 516835332 514164627 510748982 506386042 500680804
3459.1 500680804 493072480 483094752 470481128 455327511 439343125 426742822 422124177 426364183
3475.4 426364183 436654747 450893611 468460888 487090826 503240108 515214980 523521185
3489.7 523521185 529421508 534019172 538170278 542296648 546341062 550408423 554777682 559249461
3506E59249461M226684L931165L585041L121852K649904K263129J965224J805246J662433
3524.4E84460139J432658J369714J498878J493216J357496J280605J235605J156747
3540.7E95285058J034677R88364J162589J363575J351714J348556J396536J285911
3557F05216980J136482R57370N61714K27093Q60155K084196K196014J583695J336455
3575.3F16160154J355291J319170J269698J005351N64754Q47042J814425J910627J476169
3593.7F27722681J581370J876235J920999J972198J744509J083255Q72254J288772
3610F40062273J477778J427769J136840Q86201J551569J993358J093209k59996m66942
3628.4F48902059J287043K146780J600206J132667Q07285N46515K65182n12362j561940
$$ plain form
3506 559249461 563476145 567407310 570992351 574114203 576764107 579027236 580992460 582797706 584460139
3524.4 584460139 585892797 587262511 588761389 590254605 591612101 592892706 594128311 595285058
3540.7 595285058 596319735 597308099 598470688 599834263 601185977 602534533 603931069 605216980
3557 605216980 606353462 607310832 607872546 608099639 608959794 611043990 613240004 614823699 616160154
3575.3 616160154 617515445 618834615 620104313 621109664 621674418 622521460 624335885 626246512 627722681
3593.7 627722681 629304051 631180286 633101285 635073483 636817992 637901247 638773501 640062273
3610 640062273 641540051 642967820 644104660 644990861 646542430 648535788 649628997 649369001 648902059
3628.4 648902059 650189102 652335882 653936088 655068755 655876040 656422555 656687737 656175375 654613435
3646.7F54613435j166939J211106K126038J112283O71386J051784Q16524K56300k41995
3665.1F60449922j020431j439274o00338l23355n76496Q23617J735568J203358M31836
3683.4F60684407m26054j182318p16805R33229J531065R30727J52230m41194m38273
3701.8F61027014J41382K5154r08375j377344l09050J096010Q84533j38700p49290
3720.1F59691334p59721m99129j36316k5273p44283j725912j443624K30848J196445
3738.5F55784369M22298j132488j521945k12729r6082k94924R30428J275957L56555
3756.9F55511439j02878L43085L92198j67847m44114l29733K38181O27219J38045n27859
3777.3F55677736n28872m5598K2054r3937P510m768j87159o52790j147330j075446
$$ plain form
3646.7 654613435 653446496 654657602 656783640 657895923 658567309 659619093 660435617 660691917 660449922
3665.1 660449922 659429491 657990217 657389879 657066524 656490028 657313645 659049213 660252571 660684407
3683.4 660684407 660258353 659076035 658359230 659292459 660823524 661754251 661906481 661465287 661027014
3701.8 661027014 661168396 661193550 660285175 658907831 658598781 659694791 660579324 660440624 659691334
3720.1 659691334 658931613 658432484 658296168 658270895 657526612 655800700 654357076 654587924 655784369
3738.5 655784369 656206667 655074179 653552234 653339505 653243423 652948499 653878927 655154884 655511439
3756.9 655511439 655408561 655751646 656143844 655975997 655531883 655202150 655440331 656067550 656205595 655677736
3777.3 655677736 655148864 655103266 655125320 655031383 655038893 655034125 654846966 654194176 653046846 651971400
3797.7F51971400j015902p41243K20656L60132L59177O58929O9678j021981j361668
3816F49499178q63195p23242O1929J008987N33820j51456n77509q55983q66890j006126
3836.4F46059513p93755J46389P32601P52628L64542n48780j798630k217949Q8513
3854.8F42785072J851499J050413k11716q11636m65214k05756n28872k21192M56571
3873.1F43699169N97596J81496o71029p07447j57058o5804J62661l636k94983J89185
3893.5F42930150J40548q15749j309157q38339N543Q45015J042545M82678r1254m35710
3913.9F41956270o36816l93212Q2135J10686r5308l7610p1645l27230j87099K81930
3934.3F40682101L29912n8115m17232m50194j84119p9632j46329l9279J33395J76549
$$ plain form
3797.7 651971400 650955498 650214255 650434911 650795043 651154220 651813149 651882827 650860846 649499178
3816 649499178 648635983 647912741 647974670 648983657 649517477 649366021 648788512 647932529 647065639 646059513
3836.4 646059513 645265758 645412147 646144748 646897376 647261918 646713138 644914508 642696559 642785072
3854.8 642785072 644636571 645686984 645475268 644663632 644198418 643992662 643463790 643242598 643699169
3873.1 643699169 644296765 644478261 643807232 643099785 642942727 642876923 643039584 643035948 642740965 642930150
3893.5 642930150 643070698 642254949 640945792 640107453 640112996 640958011 642000556 642483234 642391980 641956270
3913.9 641956270 641319454 640926242 641008377 641119063 641023755 640986145 640914500 640587270 640400171 640682101
3934.3 640682101 641012013 640953898 640536666 640086472 639902353 639822721 639676392 639637113 639770508 639947057
3954.7F39947057Q4340l8325j10031r0301m1723j00434j90973j87039j32561j06931
3975.1F39033079j12235j27554j46568j18733n9127m8757r8765j65462j55390o1571
3995.5F37938917j3769
3997.5F37925148
$$ plain form
3954.7 639947057 640031397 639993072 639883041 639792740 639751017 639650583 639459610 639272571 639140010 639033079
3975.1 639033079 638920844 638793290 638646722 638527989 638468862 638420105 638321340 638155878 638000488 637938917
3995.5 637938917 637925148
3997.5 637925148
##END=$$ End of the data block
