##TITLE=PABA - Francielle e Mirela $$ Begin of the data block
##JCAMP-DX=5.00 $$ ACD/SpecManager v 10.08
##SPECTROMETER/DATA SYSTEM=Alpha
##DATE=14 Apr 2015 08:11:20
##DATA TYPE=INFRARED SPECTRUM
##DATA CLASS=XYDATA
##ORIGIN=
##OWNER=
##NPOINTS=1765
##FIRSTX=399.76428223
##LASTX=3997.64306641
##MAXX=3997.64306641
##MINX=399.76428223
##MAXY=0.81254542
##MINY=0.35821378
##XFACTOR=1.0000000000
##YFACTOR=1.000000000000000e-9
##FIRSTY=0.68534201
##DELTAX=2.03961372
##XUNITS=1/CM
##YUNITS=ARBITRARY UNITS
##XYDATA=(X++(Y..Y))
399.8F85342014K365827J935244P31051L900528P456899M592597j50382Q78930N372107
418.1G12424815L997087p73072Q98898L721118J242816j965582J1325L209412J205265
436.5G23972082k281308k28107L510416J601934k163291n10991L075958J643002j825452
454.8G26794243m29511K653837J18792l601909j633823K418161J040518l008127k300024
473.2G22052157Q58962o90877m587531l959894r77695l436864r628415j2084365j2358665
491.5F75186813j5912771j8948257j2175978L796757J6767800J9018054J8408060J9823253
507.9G05963731J5248895N487322N88835K138495J946569k515316l650308K49147J595438
526.2G27052808k406120m458249k000094j480639o279051j0674357j1487127j4276147
$$ plain form
399.8 685342014 687707841 689643085 690374136 694274664 701731563 706324160 706173778 707052708 712424815
418.1 712424815 716421902 715648830 716547728 720268846 721511662 719546080 719557405 722766817 723972082
436.5 723972082 721690774 721462667 724973083 726575017 724411726 723900735 726976693 728619695 726794243
454.8 726794243 726364732 729018569 729137361 725535452 723901629 726319790 727360308 724352181 722052157
473.2 722052157 722911119 722220242 717632711 713672817 712695122 709258258 699629843 687545478 675186813
491.5 675186813 659274042 640325785 628149807 631946564 648714364 667732418 686140478 705963731
507.9 705963731 721212626 726699948 727288783 729427278 731373847 728858531 725208223 725457370 727052808
526.2 727052808 724646688 720188439 718188345 716707706 710428655 699754298 688267171 673991024
542.5F73991024k1586239k6297211k2166491j2284517j344085J0148525K0742595K5390268
558.9F46593869K1853804J5284539J2231946J1088490O777227J819193J786590M328966
575.2G21764624L058434n94378m00424K420366J660764j810908j937270P91371K49028
593.5G25201607l506720m489005k440810k897918o411076p127881m485071n283355
609.8F88559771j2332976j8789232j7607629j0829568J12772K3752868N2021801N3635657
626.2G58523464K6439846J848459o508648j1526287j5765250n972683R020269J1730790
642.5G67789960M764795j810431k144099Q29876L94583k450347j827836J669526J931131
660.8G69147158j030922j529038J684487L112793p77722j500845J171172J927555j075507
$$ plain form
542.5 673991024 652404785 626107574 603941083 591656566 590312481 600461006 621203601 646593869
558.9 646593869 668447673 683732212 695964158 707052648 713829875 715649068 717435658 721764624
575.2 721764624 724823058 724228680 723828256 726248622 727909386 726098478 724161208 724952579 725201607
593.5 725201607 721694887 717205882 714765072 711867154 705456078 698328197 693843126 688559771
609.8 688559771 676226795 657437563 639829934 629000366 629113138 652866006 704887807 758523464
626.2 758523464 784963310 786811769 780303121 768776834 753011584 747038901 756059170 767789960
642.5 767789960 772554755 770744324 768600225 769430101 769824684 767374337 765546501 767216027 769147158
660.8 769147158 768116236 766587198 768271685 771384478 770606756 769105911 770277083 772204638 771129131
679.2G71129131k671539n64695J70887l499031p160604q036972j0833621j7097115
695.5G21436441j6840935o61254K1326065K7489066J6665757O844461M125178J674473
711.8G82059252j516878j140654J430332R52006j953960j930833Q29161R82761j922190
730.2G77788997k553463L2246O33836k084852l212988r40681L756k709449m692316
748.5G62265086l290236k515137n521059r227276j0783672j3132274k1088183l5366237
764.9F61341012n0608218n3381324k6960135K1187127N2454651M6730577K5402666
779.1F76166356J2744903J2040973J4612853J2821734P232368L626764L732503L392040
795.4G46370494O23703j066029L08693J253545o68704k552212k164006k219439l950655
$$ plain form
679.2 771129131 768457592 767892897 768063784 764564753 757404149 749367177 738533556 721436441
695.5 721436441 704595506 703934252 725260317 752749383 769415140 776259601 780384779 782059252
711.8 782059252 780542374 779401720 780832052 781784058 779830098 777899265 778728426 779711187 777788997
730.2 777788997 775235534 775267780 775901616 773816764 770603776 769663095 769666851 766957402 762265086
748.5 762265086 758974850 756459713 750938654 741711378 730927706 717795432 696707249 661341012
764.9 661341012 610732794 557351470 530391335 551578462 604033113 650763690 676166356
779.1 676166356 688911259 700952232 715565085 728386819 735619187 739245951 742978454 746370494
795.4 746370494 746994197 745928168 746236861 747490406 746821702 744269490 742105484 739886045 735935390
813.8G35935390l489256L13342K536893O49809j487553j303434j747489n667865j1428237
832.2G14311600j6763211k3602545l2947123l5253644j9635677M928589K0688116K7085781
848.5F38811886L1566978L2528519K6224673J5712142P545471M314304K764106k00749
864.8G59267330k828657k842308k219617l529847n214333m682899l329277l961622
881.1G30658770n595386n387307l770828l280997l729284k725005l95239N40674m88162
899.5G05827236j070797k85268j64270j555563k270221j075149N126n78999j188517
917.8F97643578j29878J239895J111925O79195J885772L713488L946245L207147L691137
936.2G16988504M984736M827023L357291K883017L563345K988994Q68499L79622K070606
$$ plain form
813.8 735935390 732446134 732759476 735296369 735946178 734458625 733155191 731407702 725739837 714311600
832.2 714311600 697548389 673945844 640998721 605745077 586109400 591037989 611726105 638811886
848.5 638811886 670378864 702907383 729132056 744844198 752389669 756703973 759468079 759267330
864.8 759267330 756438673 753596365 751376748 747846901 742632568 737949669 734620392 730658770
881.1 730658770 725063384 719676077 715905249 712624252 708894968 706169963 705774724 706315398 705827236
899.5 705827236 704756439 704471171 704306901 702751338 700481117 699405968 699411094 698832095 697643578
917.8 697643578 697513700 698753595 699865520 700544715 702430487 706143975 710090220 713297367 716988504
936.2 716988504 721973240 726800263 730157554 733040571 736603916 739592910 740461409 740841031 742911637
954.5G42911637J816451j831531m548729k821803J682878N480707O693959N670309
970.9G55053878L739834J362145m63307k34783Q58724M77374p80225o98567L96550
989.2G59711623L24726q36432r03189K73466M66764q08716j508653r45389j021445
1007.6G54752755k270937k245426K9564J804769J070738l23534k28226L44574l57568
1025.9G52576709j413942j103758k35737n47349j508057j376868m54127n45860j618922
1044.3G43772089j883327j135886j118243k250135k906382k539575k667844l855706
1060.6G25414991m498064l714502k885759k997696k846659j319289M42565Q63135M90486
1079G08949208O95229J100123M66466p07507r17674l66628n72860j638591k142310
$$ plain form
954.5 742911637 744728088 742896557 738347828 735526025 737208903 742689610 749383569 755053878
970.9 755053878 758793712 760155857 759692550 759457767 760316491 760793865 760013640 759315073 759711623
989.2 759711623 760036349 759199917 758296728 758570194 759036958 758228242 756719589 755774200 754752755
1007.6 754752755 752481818 750236392 750265956 752070725 753141463 752817929 752589703 752934277 752576709
1025.9 752576709 751162767 750059009 749823272 749275923 747767866 746390998 745936871 745391011 743772089
1044.3 743772089 741888762 740752876 739634633 737384498 734478116 731938541 729270697 725414991
1060.6 725414991 720916927 717202425 714316666 711318970 708472311 707153022 707595587 708458722 708949208
1079 708949208 709644437 710744560 711211026 710503519 709585845 709219217 708646357 707007766 704865456
1097.3G04865456j906932k321124l600061m291415l938317l861010m642845n134701
1113.6F75169051m956723n240142o445169q313179j1319161j4474928j1723757K054870
1129.9F14750862J9012153K3782552J4673709M476905L58284j017809l219545n862951
1146.3F66954160p492543q372664r645224j1076927j1955857j3350785j7049849k3234725
1162.6E64775586l0686796l8271904m4551104m4727772l0058265L394604M5843482
1176.9D25717831P9170346R0907812Q1634939O0235739L5737574J5007555J827479
1191.1G90239275m693926q025110r790718r333611o991029m911899m223466m112661
1207.5G38156855m130185m994332o671787p716179p443845o925225p012308o971061
$$ plain form
1097.3 704865456 702958524 700637400 697037339 692745924 688807607 684946597 680303752 675169051
1113.6 675169051 670212328 664972186 658527017 650213838 638894677 624419749 612695992 614750862
1129.9 614750862 633763015 657545567 672219276 676696181 677054465 676036656 672817111 666954160
1146.3 666954160 659461617 651088953 641443729 630366802 618410945 605060160 588010311 564775586
1162.6 564775586 534088790 495816886 451265782 406538010 376479745 379874349 425717831
1176.9 425717831 504888177 595795989 677430928 737666667 773404241 788411796 790239275
1191.1 790239275 785545349 777520239 767729521 758395910 751404881 746492982 742269516 738156855
1207.5 738156855 734026670 729032338 722360551 714644372 707200527 700275302 693262994 686291933
1223.8F86291933o109714n162836m977643n005181m432678l795147m031420m719972
1240.1F48057342m789412m487515m821241n722284o353855o726384p571996q844971
1256.4E98739684r817481j0495007j1541307j3103724j4534235j5400648j6043305
1270.7E07803977j6304106j5589267j4686704j5090853j6705662j7907142j7131657
1285C94388586j3372749o154030L395676J2544841J9586772K6380389L3263296L1991750
1301.3E02024531J5158236r731829k5519252k3203134j0144413J803041O830960N176336
1317.6D62394476K404720K078264K932668P064551J8208981L2549292M0887475L8640976
1333.9F07161403K8277576J3585090j095652o220043K372205J6645789K5993348K6230335
$$ plain form
1223.8 686291933 680182219 675019383 670041740 665036559 660603881 656808734 652777314 648057342
1240.1 648057342 643267930 638780415 633959174 628236890 621883035 615156651 607584655 598739684
1256.4 598739684 588922203 578427196 566885889 553782165 539247930 523847282 507803977
1270.7 507803977 491499871 475910604 461223900 446133047 429427385 411520243 394388586
1285 394388586 381015837 374861807 378257483 390802324 410389096 436769485 470032781 502024531
1301.3 502024531 517182767 507450938 481931686 458728552 448584139 450387180 457218140 462394476
1317.6 462394476 464799196 466877460 469810128 476874679 495083660 527632952 568520427 607161403
1333.9 607161403 635438979 649024069 647928417 641708374 644080579 660726368 686719716 712950051
1350.2G12950051K0843327J4669001Q894801L557265m97520l184974m700005n396784
1366.6G47135162n876481n685568n438924o550670p558584p583558p616997p707656
1382.9F93116724p268190o856203o770909o349623o397188o679654n962670n435943
1399.2F41396344n542755n873084p379234r504676j1861026j4365077j5620232j5658558
1415.5E55591702j7063140j7740012p822394J0221064K8964341M0017307L9712190
1429.8F31881058K4818838K476036k4267912m7969877m2820335j7663121J7331362
1444.1E43786049M7111452N8766007N0007105L4526765K3990274J9927621J4381885
1458.3G92497158M625440J004278P29442K8074q69334j252472j955569l014386l909230
$$ plain form
1350.2 712950051 733793378 748462379 757357180 760914445 760416925 757231951 752531946 747135162
1366.6 747135162 741258681 735573113 730134189 723583519 716024935 708441377 700824380 693116724
1382.9 693116724 685848534 678992331 672221422 665871799 659474611 652794957 646832287 641396344
1399.2 641396344 635853589 629980505 622601271 613096595 601235569 586870492 571250260 555591702
1415.5 555591702 538528562 520788550 512966156 523187220 552151561 592168868 631881058
1429.8 631881058 656699896 659175932 634908020 586938143 544117808 526454687 543786049
1444.1 543786049 590897501 649663508 699670613 734197378 758187652 778115273 792497158
1458.3 792497158 797122598 798126876 798856318 798884392 798015058 796762586 794807017 791792631 787883401
1476.7G87883401m420579m268825l458142k478182k063096k621233l747404m133880
1493G60692060m699111o334424p161438o699324n998969p102907j2304306j3468027
1509.3F96923554j2429357j3128101j3147116j1261106n460679K116799P084966Q553386
1525.6F59252346Q662045P897377P252097N002618J018106j186549l378928n897224
1542F78621888o353795o589949o206632o069958o187022o304979n949498q402466j3069570
1560.3F13488019j0321498r997368j1892677j5690565k1829545j8747866k048672K3450375
1576.6E46410203K3647845M313409p396698j4130175k0449758k5605559k8644353l0515015
1593D47629899l1790227k9441327k0950585p233978R083808K3289948L2600791L6687106
$$ plain form
1476.7 787883401 783462822 779193997 775735855 773257673 771194577 768573344 764825940 760692060
1493 760692060 755992949 749658525 742497087 735797763 729798794 722695887 710391581 696923554
1509.3 696923554 684494197 671366096 658218980 646957874 641497195 643613994 650698960 659252346
1525.6 659252346 667914391 675811768 683063865 688066483 689084589 687898040 684519112 678621888
1542 678621888 672268093 665678144 659471512 653401554 647214532 640909553 634960055 626557589 613488019
1560.3 613488019 603166521 593169153 581276476 565585911 543756366 525008500 522959828 546410203
1576.6 546410203 570058048 574371457 566974759 552844584 532394826 506789267 478144914 447629899
1593 447629899 415839672 386398345 365447760 358213782 367297590 390587538 423188329 459875435
1609.3D59875435L2198786J8194884k196669k4457038k9288441k3882478j7265588
1623.5D13178891l972441Q359998J2695462R191185M336208L856987J2028962K2290767
1639.9D81966019K8355658K6346922J7553150J781822j0271907k4620593m4733375
1654.1D76377696l2158911k0318211j6145557j1440813o387532k447724m02063M17500
1670.5C87494385O19680Q91894J229465K089977L325403O438196J2363493J4828086
1686.8D29280579J6784191K0415485K0681977K3855567K6634276K4549425K5233447
1701.1E87434947K0117045J8106580J9177019J6413868J4677703J4733017J5370488
1715.3G06030667J5673041J2513697R437681R080469Q382976P141292P062376O851792
$$ plain form
1609.3 459875435 492074221 510269105 508072436 483615398 454326957 430444479 413178891
1623.5 413178891 409206450 417566448 430261910 439453095 443789303 447646290 459675252 481966019
1639.9 481966019 510321677 536668599 554221749 556003571 545731664 521111071 476377696
1654.1 476377696 444218785 423900574 407755017 396314204 389926672 387478948 387076885 387494385
1670.5 387494385 388114065 389005959 390235424 392325401 395650804 402089000 414452493 429280579
1686.8 429280579 446064770 466480255 487162232 511017799 537652075 562201500 587434947
1701.1 587434947 607551992 625658572 644835591 661249459 675927162 690660179 706030667
1715.3 706030667 721703708 734217405 743655086 752735555 761118531 768259823 775322199 782173991
1731.7G82173991O136120L880202K430797K384782R47177q23796p05480N47528R98259
1750G97969580Q04007J666605L258944L377735K030492J149953R11951O77824L1173
1768.4H11878264l51071m36187j034558j542151j073122J04606P61390L17633n4300
1786.7H08570504P28786J707673J008451m67241j65820P55906M07160o81818m98712
1805.1H11364889N03123N72503m14491p10547J55985M74811k65062n24580L18944P19666
1825.5H12195241m0590p42078n42045k6881k81752p74264k51412O76095K76506j103342
1845.9H09385478j150786l99590m70519j087368q60631R0241K41220m75645m67956
1864.2H04804444M85123O39140o66082j162350k50757L13759k80499q10623k80679
$$ plain form
1731.7 782173991 788310111 792190313 794621110 797005892 797953069 797129273 796423793 796971321 797969580
1750 797969580 798773587 800440192 803699136 807076871 809107363 810257316 811169267 811847091 811878264
1768.4 811878264 811527193 811091006 810056448 808514297 807441175 807545781 808307171 808624804 808570504
1786.7 808570504 809299290 811006963 812015414 811548173 811382353 812138259 812545419 811863601 811364889
1805.1 811364889 811868012 812440515 812026024 811315477 811471462 811946273 811681211 811156631 811475575 812195241
1825.5 812195241 812154651 811412573 810870528 810843647 810561895 809787631 809536219 810212314 810488820 809385478
1845.9 809385478 808234692 807835102 807364583 806277215 805416584 805506825 805748045 805272400 804804444
1864.2 804804444 805289567 805928707 805262625 804100275 803849518 804163277 803882778 803072155 802791476
1882.6H02791476L08991p8023p42793o18994r7334m41373j400769j523375j076758
1900.9G97121048j380384k249062k432764j539528l98695J36554N34713J480639K033889
1919.3G93306410J467586Q34823Q11219Q00609J84000k36213L51846J009703O76035
1937.7G99206018P7188K84493O70910J63973o41525n48959K28047L35873l59178n68867
1958.1G98847973L219J54436m50671p47860l08930k4617m44055p46488k07842L57151
1978.5G96432316k8670o67512m48227J21057r5725p69019p83384k54512k89321r03368
1998.8G92313635r71615l87371k83658r46522j306236r09924p01368j097620j080811
2017.2G84628510j04963N98788K1279o91235j56522N40852L3677q45075q46445l07739
$$ plain form
1882.6 802791476 803100467 803022444 802279651 801660657 801563323 801121950 799721181 798197806 797121048
1900.9 797121048 795740664 793491602 791058838 789519310 789120615 789257169 789791882 791272521 793306410
1919.3 793306410 794773996 795608819 796420038 797220647 797404647 797168434 797520280 798529983 799206018
1937.7 799206018 799283206 799567699 800238609 800402582 799761057 799212098 799440145 799776018 799416840 798847973
1958.1 798847973 798851192 799005628 798554957 797807097 797498167 797473550 797029495 796283007 796075165 796432316
1978.5 796432316 796403646 795736134 795287907 795408964 795313239 794544220 793760836 793506324 793217003 792313635
1998.8 792313635 791342020 790954649 790670991 789724469 788418233 787508309 786806941 785709321 784628510
2017.2 784628510 784523547 785122335 785143614 784452379 784295857 784836709 784870386 784025311 783178866 782871127
2037.6G82871127l75450r88960j042664m51863l36051q82506r50634j59145L89814
2056G78073668R2686j10865M50552R03010M45723r6082J56164N02288K0206p11739
2076.4G79725611o53028j37329k00034o71148n18381J43349K09093l66509m74215O3241
2096.8G77120650K04861l99649p70450l67284q4817n74470j020670o64830k50518o30081
2117.1G72562742j173436r27151l70383m81546r41336p73191j63198j41084o57439
2135.5G66933978o71149o6340J24634l68178n46456m4107J92761l07858o69539k66134
2155.9G64311612J37806j79530n65409k45750J89900j25050o53923m61340K1398j62124
2176.3G62267590p33138p20679k14160j80661p14005q59320l90887k14159o56963r04620
$$ plain form
2037.6 782871127 782495677 781506717 780464053 780012190 779676139 778793633 777842999 777683854 778073668
2056 778073668 778166354 778055489 778506041 779409051 779854774 779758692 779914856 780417144 780437350 779725611
2076.4 779725611 779072583 778935254 778735220 778064072 777545691 777689040 777898133 777531624 777057409 777120650
2096.8 777120650 777325511 776925862 776155412 775788128 775703311 775128841 774108171 773443341 773192823 772562742
2117.1 772562742 771389306 770462155 770091772 769610226 768668890 767895699 767732501 767591417 766933978
2135.5 766933978 766262829 766196489 766321123 765952945 765406489 765362382 765555143 765247285 764577746 764311612
2155.9 764311612 764449418 764269888 763704479 763458729 763648629 763523579 762869656 762408316 762429714 762267590
2176.3 762267590 761534452 760813773 760599613 760418952 759704947 758845627 758454740 758240581 757583618 756678998
2196.7G56678998n65648l69191p79032j100302p08819k17437l49284o09874k65241
2215G51714170K16424Q882n58734o06656k45691k72989o59645o26206j41084m8042
2235.4G48780429n06699o98864l32534j54853n39065p99060m90069k26438n35607q49903
2255.8G43647337n33104r0897k59519o80506n93781k29836l32117p71642q06510m20153
2276.2G38929272l59536p33315p92265l81113k17854n54562p52270m69148k64764n67615
2296.6G33836830q80242o78539l32832m27306o89745n07712j22905j90199n06281m03941
2317G29097128m9651r3043m96387n89132k34783r8825m84109p48574n76675m98831
2337.4G25227118p29621r20117q77023r70244j080990p30932j43230J64092j67608
$$ plain form
2196.7 756678998 756113350 755744159 754965127 753864825 753156006 752938569 752589285 751979411 751714170
2215 751714170 751930594 751939476 751380742 750774086 750528395 750255406 749595761 748969555 748828471 748780429
2235.4 748780429 748273730 747574866 747242332 747087479 746548414 745749354 745259285 745032847 744497240 743647337
2255.8 743647337 743114233 743023336 742763817 742083311 741489530 741259694 740927577 740155935 739349425 738929272
2276.2 738929272 738569736 737836421 737044156 736663043 736445189 735890627 735138357 734669209 734404445 733836830
2296.6 733836830 732956588 732278049 731945217 731517911 730828166 730320454 730197549 730007350 729501069 729097128
2317 729097128 729047477 728954434 728458047 727868915 727634132 727535307 727051198 726302624 725725949 725227118
2337.4 725227118 724497497 723577380 722700357 721730113 720649123 719918191 719774961 719939053 719771445
2355.8G19771445q07882j128077j122058j300692j563966j411856j058697j088441
2372.1G10289776j343369j275003r12726p67648r64225j022279p34150n51105p76231
2390.4G01943040j015186q89183o97970q19921j016975q90910o21200o43849q55327
2408.8F94492519q00192n28634m92454o84440o95050n09798n12362p91907r70840q62778
2429.2F87644064p89105r81689j206160j193702j111269j231074j380444j223862r15229
2447.6F77611530q34465r16302q00431m76241l44098m64737m52161k37942j94847m26174
2467.9F72464132n86569n70118o62148r64404j232028j254737j153111j129747j046181
2486.3F63865089p55071n32150o50108r35555j040995r79960j084685j356781j441538
$$ plain form
2355.8 719771445 718963563 717835486 716713428 715412736 713848770 712436914 711378217 710289776
2372.1 710289776 708946407 707671404 706758678 705991030 705026805 704004526 703270376 702719271 701943040
2390.4 701943040 700927854 700038671 699340701 698520780 697503805 696612895 695991695 695347846 694492519
2408.8 694492519 693692327 693163693 692671239 691986799 691291749 690781951 690269589 689477682 688506842 687644064
2429.2 687644064 686854959 685873270 684667110 683473408 682362139 681131065 679750621 678526759 677611530
2447.6 677611530 676777065 675860763 675060332 674584091 674239993 673775256 673323095 673085153 672890306 672464132
2467.9 672464132 671877563 671307445 670645297 669680893 668448865 667194128 666041017 664911270 663865089
2486.3 663865089 663110018 662577868 661927760 660992205 659951210 658971250 657886565 656529784 655088246
2504.7F55088246j302302j276672j457155j534223j376271j252711j354516j478255
2521F44056141j403749j333892j490712j669467j634538j535833j601636j701176j564622
2539.3F30120516j250863j019955q34465m28200J37329N53906P72536J049101J553476
2557.7F30653381K067685K379239K660155L016591L123045K764643K202451J691162
2574F50558352J137734L65674m67240j024127j341463j639723j767338j388430n37873
2592.4F43895566M04299J217544J906156K347112K279937J708329R90927M14729j15633
2610.7F55048966p59720j286388j441359j444400j573324j654982j410485r83715o88791
2629.1F43805802n46277m17649l60907n40018q49843j017868j020849j081526j246929
$$ plain form
2504.7 655088246 653785944 652509272 651052117 649517894 648141623 646888912 645534396 644056141
2521 644056141 642652392 641318500 639827788 638158321 636523783 634987950 633386314 631685138 630120516
2539.3 630120516 628869653 627849698 627015233 626587033 626724362 627278268 628050804 629099905 630653381
2557.7 630653381 632721066 635100305 637760460 640777051 643900096 646664739 648867190 650558352
2574 650558352 651696086 652061760 651594520 650570393 649228930 647589207 645821869 644433439 643895566
2592.4 643895566 644299865 645517409 647423565 649770677 652050614 653758943 654749870 655164599 655048966
2610.7 655048966 654289246 653002858 651561499 650117099 648543775 646888793 645478308 644494593 643805802
2629.1 643805802 643259525 642841876 642480969 641940951 641091108 640073240 639052391 637970865 636723936
2647.4F36723936j242698j006245q74520r64880r91582p87437n72682n28395m74632
2665.8F29280865k46107K5272J73211K86281N84662J074076J561284K061605K764941
2684.1F37566090L527701L953397L947556L764629L524244L040850K299726J668811
2700.5F63293004J341879J042068N95332K38955J44720J21355o2883l16620m00305
2718.8F65997505l59893m19676n23806m67717k63453j09374j28091j97947k48730m12166
2739.2F62866652o61731p56919p01547q03947j140118j425266j456022j392425j471579
2757.6F53057098j571953j437902j212061j155495j164139j029253q43346q72254j126528
2775.9F42644167j285493j214743j196981j330256j328051j121581j004100j066088
$$ plain form
2647.4 636723936 635481238 634474993 633600473 632635593 631644011 630856574 630283892 629755497 629280865
2665.8 629280865 629034758 629060030 629233241 629519522 630104184 631178260 632739544 634801149 637566090
2684.1 637566090 641093791 645047188 648994744 652759373 656283617 659324467 661624193 663293004
2700.5 663293004 664634883 665676951 666272283 666511238 666655958 666777313 666714430 666397810 665997505
2718.8 665997505 665637612 665217936 664694130 664226413 663962960 663853586 663725495 663527548 663278818 662866652
2739.2 662866652 662204921 661448002 660746455 659942508 658802390 657377124 655921102 654528677 653057098
2757.6 653057098 651485145 650047243 648835182 647679687 646515548 645486295 644642949 643770695 642644167
2775.9 642644167 641358674 640143931 638946950 637616694 636288643 635167062 634162962 633096874
2792.2F33096874j040995q54731p86483r36210j048625r90570r45866j060009j211702
2810.6F24221683j220286j143039j154899j174748r49919m85421m3571K56539N33819
2828.9F18840158Q28385R77993R70245J043737J212597J224279R72629N79655K15113
2847.3F26864791j40071n75185r25600r82225q49128p89225p88927o26922l71933k90394
2867.7F20525181l28839k28881o3658l1769l1233R5308L10897L94762K42591J20103
2888.1F21004462K10107L02016J85967m9234j84059k35915m31836p36832q66592p66873
2908.5F18431211o34492n49436m03761j56343k802J0729J50144M09782N37336L45468
2928.9F18137836j23679m79520o44028q95023j124561j032889q08179q71003j120686
$$ plain form
2792.2 633096874 632055879 631201148 630414665 629478455 628429830 627439260 626493394 625433385 624221683
2810.6 624221683 623001397 621858358 620703459 619528711 618578792 618093371 618049800 618306339 618840158
2828.9 618840158 619668543 620646536 621616781 622660518 623873115 625097394 626070023 626649678 626864791
2847.3 626864791 626724720 626149535 625223935 624241710 623392582 622603357 621814430 621187508 620815575 620525181
2867.7 620525181 620196342 619967461 619903803 619872034 619840801 619936109 620247006 620641768 620884359 621004462
2888.1 621004462 621214569 621516585 621702552 621653318 621469259 621233344 620801508 620064676 619198084 618431211
2908.5 618431211 617796719 617247283 616843522 616687179 616684377 616695106 616845250 617255032 617792368 618137836
2928.9 618137836 618014157 617534637 616890609 615995586 614871025 613838136 613029957 612158954 611038268
2947.2F11038268j106620q48413q49306j056791r94324p18356n26428m83870l90590
2965.6F04063570j36077L8505O5326J42694L24368N12720N23567L62634L76225N95570
2986F06869102P08758P33018P55966O89030N53667L80516L63291O22749P73489P22230
3006.4F13171816Q62777J124084J014054N55098K64347L31401M61400L90530K20060
3024.7F18395567K17438L36528K49147l5286j94311j75774k20716m09067n85675p92086
3045.1F16785765j230121j494527q66532K86758J046181J374721J658142J881182J855254
3063.5F21296823J597703J307010J189470J192093J071096R48787J050055J154065
3079.8F30807102J042783Q70526Q70228J009702R87232P32064O35565Q46028R67622
$$ plain form
2947.2 611038268 609931648 609083235 608233929 607177138 606182814 605464458 604938030 604454160 604063570
2965.6 604063570 603927493 603965998 604031324 604174018 604498386 605011106 605534673 605897307 606273532 606869102
2986 606869102 607577860 608310878 609066844 609755874 610309541 610690057 611053348 611676097 612449586 613171816
3006.4 613171816 614034593 615158677 616172731 616727829 616992176 617323577 617784977 618175507 618395567
3024.7 618395567 618613005 618949533 619198680 619163394 618969083 618793309 618572593 618163526 617577851 616785765
3045.1 616785765 615555644 614061117 613194585 613481343 614527524 615902245 617560387 619441569 621296823
3063.5 621296823 622894526 624201536 625391006 626583099 627654195 628602982 629653037 630807102
3079.8 630807102 631849885 632720411 633590639 634600341 635587573 636319637 636955202 637801230 638768852
3098.2F38768852P97212O58035P73132Q41439N92768L45945M88997P16388O18815M63427
3118.6F45065010N54323O51598N52594M63427N71727P40886O98745M92752M41611N21421
3139F50754094M02212J48237J94132N83709Q43107O96898M47988M04597M04775K31206
3159.4F55110955Q1480J75059K63452J05918l6717N4479J45972L7491j15872q0525
3179.8F55741692L3676o9380l63111n21541m96804o24299r58920j212358j310707j460075
3200.1F48758173j718998j836121j629412j340509j267314j260340j082063r87649
3216.5F37635767j345098j953780k366960k489686k369762j729548k96056J527965
3232.8F26612842K923191L554642L700197L569722L117323K424419J882016J793385
$$ plain form
3098.2 638768852 639566064 640224099 640997231 641838670 642431438 642777383 643266380 643982768 644601583 645065010
3118.6 645065010 645619333 646270931 646823525 647286952 647858679 648599565 649298310 649791062 650232673 650754094
3139 650754094 651156306 651304543 651498675 652082384 652925491 653622389 654070377 654474974 654879749 655110955
3159.4 655110955 655192435 655367494 655630946 655736864 655700147 655754626 655900598 655938089 655822217 655741692
3179.8 655741692 655775368 655705988 655342877 654821336 654324532 653700233 652741313 651528955 650218248 648758173
3200.1 648758173 647039175 645203054 643573642 642233133 640965819 639705479 638623416 637635767
3216.5 637635767 636290669 634336889 631969929 629480243 627110481 625380933 625084877 626612842
3232.8 626612842 629536033 633090675 636790872 640360594 643477917 645902336 647784352 649577737
3249.1F49577737J928806J966179J989245K119780K065002J599134J062929P78318
3265.4F63087130N77688K26199j53243l11434l33369n14567q46982j030922r93609
3283.8F59706891j014769j232625j381695j341104j411081j692533j905322j875818
3300.1F47851944j799822j947880k212345k336800k401114k675652l107965l408552
3316.4F27961814l587484l900588m348337m687429m877388n139470n546570n866706
3332.7E90007842o039441o323516o758035p173538p558942q091926q899629r845674
3349E29317141j0781527j1782646j2794733j3173998j2009322q661241k930224M532606
3365.4D61716056J1798054J6121358J5454292R785473J437009n768478p958293l455967
$$ plain form
3249.1 649577737 651506543 653472722 655461967 657581747 659646749 661245883 662308812 663087130
3265.4 663087130 663664818 663891017 663737774 663426340 663092971 662578404 661731422 660700500 659706891
3283.8 659706891 658692122 657459497 656077802 654736698 653325617 651633084 649727762 647851944
3300.1 647851944 646052122 644104242 641891897 639555097 637153983 634478331 631370366 627961814
3316.4 627961814 624374330 620473742 616125405 611437976 606560588 601421118 595874548 590007842
3332.7 590007842 583968401 577644885 570886850 563713312 556154370 548062444 539162815 529317141
3349 529317141 518535614 506752968 493958235 480784237 468774915 460113674 457183450 461716056
3365.4 461716056 473514110 489635468 505089760 514875233 516312242 510543764 502585471 499129504
3381.7D99129504N491286J4258326J9481122K0614147J8621743J4781535J0533571
3395.9F02911234O875336M041970K052843P54416j70528r38356j448393j711726k075971
3414.3F10290825k547919k823294k942264l126263l382683l552199l608226l807962
3430.6E84500015m132450m300594m316628m299224m272461m294037m580498n585671
3446.9E48718452p499933j0036826j2667239j3973355j2056291o150246K178401R454191
3463.2D97967154J2194663R689689M849553J654625J941979M738986Q208037J0977864
3479.6E52222550J2285888J2012720J0764539R213627P664144O332457N305767M603803
3495.9F20405495M036665L515959L067732K537250K195299K216041K183378K085686
$$ plain form
3381.7 499129504 504620790 518879116 538360238 558974385 577596128 592377663 602911234
3395.9 602911234 609786570 613828540 615881383 616635799 616465271 615526915 614078522 612366796 610290825
3414.3 610290825 607742906 604919612 601977348 598851085 595468402 591916203 588307977 584500015
3430.6 584500015 580367565 576066971 571750343 567451119 563178658 558884621 554304123 548718452
3446.9 548718452 541218519 531181693 518514454 504541099 492484808 486334562 488512963 497967154
3463.2 497967154 510161817 519851506 524701059 526355684 528297663 533036649 541244686 552222550
3479.6 552222550 564508438 576521158 587285697 596499324 604163468 610495925 615801692 620405495
3495.9 620405495 624442160 627958119 631025851 633563101 635758400 637974441 640157819 642243505
3512.2F42243505K056539J899659J676560J670360J866758J773536J391054J258790
3528.5F55836761J414120J619160J686454J498640J381278J659214J916528J722157
3544.8F68734312J269877J176655J399815J337290J208902J458227J704872J636684
3561.1F79926634J603007J837969J904964J412929J112163J406490J786411J860559
3577.5F92851126J847625K034485K338648K417267J979529J552821J771807K092839
3593.8G08886147K043485J993060K065838J929283J746177J832426K070665K068937
3610.1G24636018J888693J803994J862168J968682J606524J054764J204312J757085
3626.4G37782240J851261J065552O65009Q67247Q67546P26819P66218R96470J322866
$$ plain form
3512.2 642243505 644300044 646199703 647876263 649546623 651413381 653186917 654577971 655836761
3528.5 655836761 657250881 658870041 660556495 662055135 663436413 665095627 667012155 668734312
3544.8 668734312 670004189 671180844 672580659 673917949 675126851 676585078 678289950 679926634
3561.1 679926634 681529641 683367610 685272574 686685503 687797666 689204156 690990567 692851126
3577.5 692851126 694698751 696733236 699071884 701489151 703468680 705021501 706793308 708886147
3593.8 708886147 710929632 712922692 714988530 716917813 718663990 720496416 722567081 724636018
3610.1 724636018 726524711 728328705 730190873 732159555 733766079 734820843 736025155 737782240
3626.4 737782240 739633501 740699053 741364062 742231309 743098855 743825674 744591892 745588362 746911228
3644.8G46911228J582026J342535L55661j50978K6702J66893J60158R9659J5080K05338
3665.2G50714302O43313P20441K34187l457k56658p72953p24375l69072J72496R06169
3685.6G51264393J309812N78285m50075l97563p3910J6272J33455J72794l0577m5717
3706G52477169K47180L77536j12891o20425m78565l5882K85089J70469k53975m58956
3726.4G51596749j63019L26634O01530L45707l06309n96285m26411k43187k46167j28687
3746.7G50760555L7194l42012p89285n20050k28465l59475m65513j87397N37q8036
3767.1G47818053j79708k67327l58462k53022O5207R5129k84671m43817l69906k36690
3787.5G45584786j44780j86205j37746L9816J38938M6075l31521m76599k94805n17308
$$ plain form
3644.8 746911228 748493254 749835789 750191450 750040472 750067174 750234067 750394225 750493884 750508964 750714302
3665.2 750714302 751357615 752078056 752312243 752308786 752052128 751279175 750554800 750185728 750358224 751264393
3685.6 751264393 752574205 753152490 752702415 752304852 752230942 752247214 752380669 752553463 752522886 752477169
3706 752477169 752724349 753101885 752988994 752368569 751890004 751854122 752139211 752309680 752055705 751596749
3726.4 751596749 751433730 751760364 752361894 752707601 752401292 751805007 751378596 751135409 750889242 750760555
3746.7 750760555 750797749 750455737 749666452 749146402 748917937 748558462 748092949 747905552 747906089 747818053
3767.1 747818053 747638345 747371018 747012556 746759534 746824741 746919870 746635199 746191382 745821476 745584786
3787.5 745584786 745440006 745253801 745116055 745155871 745294809 745340884 745009363 744532764 744237959 743720651
3807.9G43720651o83487k57075K37883K63571L9697j55747n58615o42955m85301l80635
3828.3G41097987j29402J29640K69830K62499j5795l60906o10352p00116l90947J80304
3848.7G39732742N44012J32143o55889n28276k35796q6546L6597l7431j29521j47343
3869.1G38624692k34842k92361l59178k52783o914N4896n245k78891n01215k25663
3889.5G36522496j16110l64184k68877P7844J54137j06573m04060n23984m11034l03745
3909.9G34255910k57731p1406J04845j669k07126k25842j05560m3214o7591r2030j51396
3932.3G33137190k58922l12448k08318J1325O1214j24216j86980r1374j07527k13444
3952.7G31706500k19226r7573j5378r3698k16484k26379j51574j05620j17838j06752
$$ plain form
3807.9 743720651 743037164 742780089 743017972 743281543 743321240 743165493 742606878 741963923 741478622 741097987
3828.3 741097987 740968585 741098225 741368055 741630554 741614759 741253853 740643501 739943385 739552438 739732742
3848.7 739732742 740276754 740408897 739753008 739224732 738988936 738902390 738938987 738901556 738772035 738624692
3869.1 738624692 738389850 738097489 737738311 737485528 737478614 737533510 737528265 737249374 736748159 736522496
3889.5 736522496 736406386 736042202 735773325 735851169 736005306 735898733 735494673 734970689 734559655 734255910
3909.9 734255910 733998179 733926773 734031618 734029949 733822823 733596981 733491421 733448207 733380616 733288586 733137190
3932.3 733137190 732878268 732565820 732357502 732368827 732430041 732305825 732118845 732027471 731919944 731706500
3952.7 731706500 731487274 731389701 731374323 731280625 731064141 730837762 730686188 730580568 730462730 730355978
3973.1G30355978m7803n5253j48654j85192j32740j38342j98424j92582j24932p7307
3993.5G29054749j37627k40624
3997.6G28676498
$$ plain form
3973.1 730355978 730308175 730252922 730104268 729919076 729786336 729647994 729449570 729256988 729132056 729054749
3993.5 729054749 728917122 728676498
3997.6 728676498
##END=$$ End of the data block
