##TITLE=PABA - Nicole e Lucas $$ Begin of the data block
##JCAMP-DX=5.00 $$ ACD/SpecManager v 10.08
##SPECTROMETER/DATA SYSTEM=Alpha
##DATE=14 Apr 2015 08:11:20
##DATA TYPE=INFRARED SPECTRUM
##DATA CLASS=XYDATA
##ORIGIN=
##OWNER=
##NPOINTS=1765
##FIRSTX=399.76428223
##LASTX=3997.64306641
##MAXX=3997.64306641
##MINX=399.76428223
##MAXY=0.84002566
##MINY=0.57530969
##XFACTOR=1.0000000000
##YFACTOR=1.000000000000000e-9
##FIRSTY=0.77535951
##DELTAX=2.03961372
##XUNITS=1/CM
##YUNITS=ARBITRARY UNITS
##XYDATA=(X++(Y..Y))
399.8G75359511N60701K817452K631545J359582K352476L845752K060830o90818K76804
418.1G90573835L110826J469434m75169J288951L032744R98020j652300m51267K197742
436.5H00092816J288414j129746k78950J934946P60793j395165p6831K110362P61986
454.8H04068625j515567j51217J949608L19421k053678o58333J726568L934k475262
473.2H01214099n61059J393974r56118l442764j905739m25041l422141p029355p383585
491.5G77482271p986784j0981262r624719m1127R980201J2102485J0480285J1187434
507.9G92598784R862304L968417o82771J848J547515q50439l091395j118004J069248
526.2H03305507q40068l138125j904369n97596l190696o638825p244050p772446j1031806
$$ y = [775359511, 775920212, 778737664, 781369209, 782728791, 785081267, 788927019, 790987849, 790297031, 790573835, 793684661, 795154095, 794678926, 795967877, 799000621, 799998641, 798346341, 797895074, 800092816, 801381230, 800251484, 799972534, 801907480, 802668273, 801273108, 801196277, 803306639, 804068625, 802553058, 802401841, 804351449, 804670870, 802617192, 801958859, 803685427, 803689361, 801214099, 800653040, 802047014, 801090896, 797648132, 795742393, 795317352, 791895211, 784865856, 777482271, 769495487, 758514225, 748889506, 748848379, 758828580, 770931065, 781411350, 792598784, 802461088, 806429505, 805746734, 805748582, 807296097, 806445658, 803354263, 802236259, 803305507, 802465439, 799327314, 797422945, 796825349, 793634653, 786995828, 779751778, 771979332, 760947526]
544.6G60947526j2884439r189426k906561K351403P159233J1941433J4041364J1488855
560.9G82949388P228613N605698N465269L331661P19845J004160K615034J712203o43074
579.3H09988797l63767J527369Q38458j313388j001001Q43108K23339k153874k045870
597.6H06543171j92999r85802m000961m821003l639519m994750r451091j1949420r821117
616G56686509o139100k83360J4469385L1264305L0506968J3469816N1140m097879q552491
634.3H27375293j1893213m218757N988061O475866J217246j490056j01030N98669j382768
652.7H22569311j939118L57985J372338m89116j363456k26975l53157j495779j78993
671H18253040J322747J232564q05080k147019q01444J62065j814186m119337m045069
$$ y = [760947526, 748063087, 738873661, 735967100, 738318503, 745477736, 757419169, 771460533, 782949388, 790178001, 795783699, 801248968, 804580629, 805300474, 806304634, 808919668, 810631871, 809988797, 809625030, 811152399, 811990857, 810677469, 809676468, 810519576, 810742915, 808589041, 806543171, 806350172, 805364370, 801363409, 796542406, 792902887, 787908137, 778457046, 766507626, 756686509, 750547409, 750264049, 764733434, 795997739, 826504707, 839974523, 840025663, 835927784, 827375293, 815482080, 811263323, 817251384, 823727250, 824944496, 823454440, 823353410, 823952079, 822569311, 820630193, 820988178, 822360516, 821871400, 820507944, 820280969, 819927812, 818432033, 818253040, 819575787, 820808351, 820003271, 817856252, 817054808, 817216873, 815402687, 811283350, 807238281]
689.4H07238281m185140p359207j0344565p710516J672029J1908591J4632463J0279239
705.7H16131175N276441J386404j172364p65621Q77499J93656j682043j172006O06477
724.1H19679618J22845j786947j660168M5180j49787k014637k098500m47631m42684
742.4H11247289k350747k847255j468479j538098l800571n089939m627347n512714
758.7G84012139q599401j1734426j5224576k0281434k1603465r425461J3946116K8350532
775.1G39440024K3094177J1884809P770359Q044780O491184L706991K770424K528072
791.4H05730820O40392j319706r24588K24352o26683k145112j523792j46389j094878
809.7G98814416l238261k887368j52111J287222M79817Q3387O13153o46412l671587
$$ y = [807238281, 803053141, 795693934, 785349369, 777638853, 779310882, 791219473, 805851936, 816131175, 821407616, 822794020, 821621656, 820856035, 821733534, 821927190, 820245147, 819073141, 819679618, 819802463, 818015516, 816355348, 816400528, 816250741, 814236104, 812137604, 811689973, 811247289, 808896542, 806049287, 804580808, 803042710, 799242139, 794152200, 789524853, 784012139, 775412738, 763678312, 748453736, 728172302, 706568837, 697143376, 711089492, 739440024, 762534201, 774419010, 782189369, 790234149, 796725333, 800432324, 803202748, 805730820, 806371212, 805051506, 804126918, 804351270, 803724587, 801579475, 800055683, 799909294, 798814416, 795576155, 792688787, 792536676, 793823898, 794303715, 794387102, 795000255, 794353843, 790682256]
828.1G90682256n398392n840838q020163j2347519j5463174j3418317n577206L243088
844.4G27859735R284080J4201402J7370582J5605688J0971188P461846M727960J504004
860.7H08986485n92411n58376n83529k125740l264666k550721j796842k624094l539443
879.1G91350663k849520j830875k175332k655863j487255J53422K84016k19345M92930
897.4G81062841J558066J029610l17096l71814L96013k801j147390j071631p4745j03950
917.8G80957103j015008q19564N13494J011849M49061O88017J974404K409577J596630
936.2G87765563J358330K203643K400994J392484P95782J209259J234412M37617M0174
954.5G98838258J03354p56085k111792j630664J108825L706873L717184J801967O97553
$$ y = [790682256, 785283864, 779443026, 771422863, 759075344, 743612170, 730193853, 724616647, 727859735, 737143815, 751345217, 768715799, 784321487, 795292675, 802754521, 807482481, 808986485, 808394074, 807835698, 807252169, 805126429, 801861763, 799311042, 797514200, 794890106, 791350663, 788501143, 786670268, 784494936, 781839073, 780351818, 780505240, 780789256, 780569911, 781062841, 782620907, 783650517, 783333421, 782961607, 783357620, 783354819, 782207429, 781135798, 781061053, 780957103, 779942095, 779122531, 779636025, 780647874, 781096935, 781784952, 783759356, 786168933, 787765563, 789123893, 791327536, 793728530, 795121014, 795916796, 797126055, 798360467, 798798084, 798838258, 798941612, 798185527, 796073735, 794443071, 795551896, 799258769, 802975953, 804777920, 805475473]
972.9H05475473N98848q7023q82983m91082L38554J32501n66304l38375M25517L31104
993.3H04936230l80099l14474L90053L15309n60046q56936l50654m8756j98722j52707
1013.7H02779198K83837L17991l76284o88076n2572L36051k34425o45101j37210K81334
1034.1H01864743k11537p15673l25858J49309k77102q58962n78284j12057m90427j187384
1054.5G97256768j169503q55029j218915j763701j492798q41558p63595r04620l13759
1072.8G87933290O83069R22203M01318K11478M92930K62916m86970o81996k02000m5061
1093.2G89491177n29707q36313o02781o04868j204074j594066j395047j393080j942038
1111.6G79389203k335549k417743k919853l860891m651010n738318p279455o098271
$$ y = [805475473, 806074321, 805987298, 805104315, 804613233, 804951787, 805084288, 804517984, 804179609, 804605126, 804936230, 804556131, 804241657, 804631710, 804947019, 804386973, 803530037, 803179383, 803130627, 802931905, 802779198, 803063035, 803381026, 803004742, 802316666, 802264094, 802600145, 802365720, 801720619, 801583409, 801864743, 801653206, 800937533, 800611675, 800760984, 800483882, 799624920, 799046636, 798934579, 798444152, 797256768, 796087265, 795232236, 794013321, 792249620, 790756822, 789915264, 789151669, 788247049, 787933290, 788616359, 789538562, 789939880, 790151358, 790644288, 790907204, 790420234, 789738238, 789536238, 789491177, 788961470, 788125157, 787522376, 786917508, 785713434, 784119368, 782724321, 781331241, 779389203, 777053654, 774635911, 771716058, 767855167, 763204157, 757465839, 750186384, 744088113]
1127.9G44088113J203478J0280966J2095750O503582J411438o2943n40971j685024
1144.2G73294389k842128l361762l724813m419684n006612n202830n874812p875681
1160.5G34986067j0870159j4238536j8326760k3000061k4474979j6713142J485765
1174.8F28848195K3587406M0192902M5718491M1446388L1521856J8992723P317602
1189.1H37625563m19855m187882n580425n502224m482091l258526k304256j590669
1205.4H10299635j155794j268983j840949k303600k407849k513826k772927k881229
1221.7G93154478k737701k668619k817690k909661k793729k740264k892137k976834
1238.1G70617843k811969k530574k358199k342879k474189k868533l474474m028082
$$ y = [744088113, 745291591, 755572557, 767668307, 774171889, 775583327, 775520384, 774979413, 773294389, 770452261, 767090499, 763365686, 758946002, 753939390, 748736560, 742861748, 734986067, 724115908, 709877372, 691550612, 668550551, 644075572, 627362430, 628848195, 652435601, 692628503, 738346994, 779793382, 811315238, 830307961, 837625563, 837205708, 833017826, 827437401, 821935177, 817453086, 814194560, 811890304, 810299635, 809143841, 807874858, 806033909, 803730309, 801322460, 798808634, 796035707, 793154478, 790416777, 787748158, 784930468, 782020807, 779227078, 776486814, 773594677, 770617843, 767805874, 765275300, 762917101, 760574222, 758100033, 755231500, 751757026, 747728944]
1254.4G47728944m444659m881024n404532n862355o278933o893575p622182q000434
1270.7F98341250p641971o841004o499052p108152q302390r502113j0145307r306848
1287F32994413o002366n61595N069792R823978J5180886K0467996J9167126O961107
1303.3G03101337r510219j8018782j4310181n036235L123104P250488O465018L778696
1319.6F76843226J979172J340807L755808J0585188J8079937K0919144J7905057J1314094
1336G62722433L424465k911687l340780K125442Q852362J2795151J2839675J0318160
1352.3H06825221P223129M437506J906812l35574j830161k182066k256393k720416
1368.6H11068058l108144l377557l735244l923774m308462m840910m764557l906369
$$ y = [747728944, 743284285, 738403261, 732998729, 727136374, 720857441, 713963866, 706341684, 698341250, 690699279, 683858275, 677359223, 670251071, 661948681, 652446568, 642301261, 632994413, 626992047, 626430452, 631500244, 641324222, 656505108, 676973104, 696140230, 703101337, 693591118, 675572336, 661262155, 656225920, 659349024, 666599512, 673064530, 676843226, 678822398, 680163205, 683919013, 694504201, 712584138, 733503282, 751408339, 762722433, 766146898, 763235211, 759894431, 762019873, 770872235, 783667386, 796507061, 806825221, 814048350, 818485856, 820392668, 820057094, 818226933, 816044867, 813788474, 811068058, 807959914, 804582357, 800847113, 796923339, 792614877, 787773967, 783009410, 779103041]
1384.9G79103041l120005k812326k707363l065407l382802k755046j929939j805841
1401.2G57524312k536417l813564m918099o255626q048654r322941r826899j0647356
1417.5G02154756j0266602l836751O609737J6830385K1809995K0300806J1882305J90854
1433.9G65675485j3387859k4390340k0354151o395161J1366844K4535835K8251707
1448.1G65302360K3227692J5679300J0315001P829308N671084J997530j8060o57499
1464.5H29346716p96496r93848j601816k214908j972258j711011j990199k119422j686692
1482.8H14260066j245082j422942j771450j578807j489640k243161l183603l140509
1499.1G98184872k730668k725124l941775o249427n376280m531264n116105n377770
$$ y = [779103041, 775983036, 773170710, 770463347, 767397940, 764015138, 761260092, 759330153, 757524312, 754987895, 751174331, 746256232, 740000606, 731951952, 722629011, 712802112, 702154756, 691888154, 688051403, 694661140, 711491525, 733301520, 753602326, 765484631, 765675485, 752287626, 727897286, 707543135, 701147974, 712514818, 737050653, 765302360, 788530052, 804209352, 814524353, 822353661, 828024745, 830022275, 830004215, 829346716, 828550220, 827556372, 825954556, 823739648, 821767390, 820056379, 818066180, 815946758, 814260066, 813014984, 811592042, 809820592, 808241785, 806752145, 804508984, 801325381, 798184872, 795454204, 792729080, 788787305, 782537878, 777161598, 772630334, 767514229, 762136459]
1515.4G62136459m894614l311634q30352J842797L112495L586232L756225L599286
1531.8G68996894K710104R03607n63622j910150k764404k649068k645195k674043k782107
1550.1G56622016k823591l001869l008544m034877n464196m269719m606485n835653
1566.4G23577082q088827j1327267q995413K113878J8151939J5546620M47869q219719
1582.8G23206162j1198461j2241184j2939215j3381839j4044106j5150070j5122414
1597F29128873j2541234o893098K065002J1848510J8821060K1311760J7970324R645104
1613.4F91356301j391530j3138056j6114473j3549089r340346j012206N808472O848991
1629.7F49468064L068924j356482k827347L681362J1825442J5561462J3773620Q153260
$$ y = [762136459, 757241845, 753930211, 753099859, 754942656, 758055151, 761641383, 765397608, 768996894, 771706998, 772610605, 772046983, 770136833, 767372429, 764723361, 762078166, 759404123, 756622016, 753798425, 750796556, 747788012, 743753135, 738288939, 734019220, 729412735, 723577082, 715488255, 704160988, 695165575, 697279453, 715431392, 730978012, 731425881, 723206162, 712007701, 699766517, 686827302, 673445463, 659401357, 644251287, 629128873, 616587639, 609694541, 611759543, 623608053, 642429113, 663740873, 681711197, 691356301, 689964771, 676826715, 660712242, 647163153, 637822807, 636810601, 642619073, 649468064, 652536988, 651180506, 648353159, 652034521, 663859963, 679421425, 693195045, 701348305]
1646G01348305K0802n597174j2937487k2634506j5693545r633899p631242n344510
1662.3F21896744k625227l52919J126706J932502J749039J783311K058745J921594
1678.6F29490495J839757L162086O552934P939399Q452713J0167480J0405957J1481524
1694.9F89492345J2024999J0725677J1332869R142935P516742P624030O954253O504774
1711.3G61318624O053567N851626O831229O621599M799187M049719M159391M069209
1727.6H03754151L614962K942562L256321L371954J984835Q29756K03788J08421J6749
1745.9H20083499k25306L46959J764536K116561J690209J556396J683116J488984N55575
1764.3H31060529j75476n1856J40309m87626q53359k85864J58250J0848j29759L07739
$$ y = [701348305, 701369107, 695771933, 682834446, 660199940, 644506395, 634872496, 627241254, 621896744, 619271517, 618918598, 620045304, 621977806, 623726845, 625510156, 627568901, 629490495, 631330252, 634492338, 641045272, 648984671, 657437384, 667604864, 678010821, 689492345, 701517344, 712243021, 723575890, 732718825, 740235567, 747859597, 754813850, 761318624, 767372191, 773223817, 780055046, 786676645, 791475832, 795525551, 799684942, 803754151, 807369113, 810311675, 813567996, 816939950, 818924785, 819754541, 819958329, 820066750, 820083499, 819858193, 820205152, 821969688, 824086249, 825776458, 827332854, 829015970, 830504954, 831060529, 830885053, 830833197, 830973506, 830485880, 829632521, 829346657, 829504907, 829515755, 829385996, 829693735]
1784.7H29693735P39872M32849J9193K84314N19037J64688l19302k77400K18570J78575
1805.1H31654131k90513k71618J53780J42395k26080j88589J95265P2121m43518m52339
1825.5H30345035J5795O9856k86281l43144m8458N6088k90394n28991k77817p7487
1845.9H28634202l82959n45562k91347r7692k89142m71771j98066J42276k2352m05788
1866.3H26071799l06905R6560J3113l19421k61843K5808l5584l34143l15190q0287
1886.7H24553907j70350m34637l92199j54376k12967o84560j045823j051306j181066
1905H19226623j604498j430869k27034P04467N42701L18586P65026J097500Q18312
1923.4H20210814L47078J71185K45273J70052k8908L5524K35379Q5890k39372j34468
$$ y = [829693735, 830433607, 830866456, 830885649, 831169963, 831689000, 831853688, 831534386, 831256986, 831475556, 831654131, 831363618, 831092000, 831245780, 831388175, 831162095, 830973506, 831168771, 831240892, 830797374, 830345035, 830360830, 830430686, 830144405, 829801261, 829752803, 829808891, 829518497, 828989506, 828711689, 828634202, 828251243, 827705681, 827414334, 827316642, 827027500, 826555729, 826357663, 826499939, 826477587, 826071799, 825764894, 825861454, 825874567, 825555146, 825293303, 825319111, 825283527, 824949384, 824634194, 824553907, 824383557, 823948920, 823556721, 823402345, 823189378, 822504818, 821458995, 820407689, 819226623, 817622125, 816191256, 815964222, 816668689, 817211390, 817529976, 818295002, 819392502, 820210814, 820557892, 820729077, 820974350, 821144402, 821115494, 821151018, 821386397, 821472287, 821232915, 821098447]
1943.8H21098447J80483P4565k71499k88844n841L7789k64287l89040j41203l6895
1964.2H19993675l10302m28736j49429j5438k48193l57986p6473J20998j30534m23372
1984.6H17974210l24667j48773l19421n01096k78891l7312k07841n12898m74751k54572
2005H14913988l66449o94990p07388m74453m53413m78923j21951K50280n4419n64456
2025.4H11247826k61248K94507J16587m32194o10649l52502k16067m54068n86450l21686
2045.8H08424056j24276l26276m63486j38998K07305J07229r0778Q6188L55065K19882
2066.2H08255911r8765r8109P9930q0348m55021m54188j43647j22428l64065l13163
2086.6H06206107L517L6716k48730k76267M5657J05381k54751m18901j81437j05917
$$ y = [821098447, 821278930, 821353495, 821081996, 820793152, 820787311, 820825100, 820560813, 820171773, 820030570, 819993675, 819683373, 819254637, 819105208, 819089770, 818841577, 818483591, 818407118, 818528116, 818397582, 817974210, 817649543, 817500770, 817181349, 816680253, 816401362, 816364050, 816156209, 815643311, 815168560, 814913988, 814547539, 813852549, 813145161, 812670708, 812217295, 811738372, 811616421, 811866701, 811812282, 811247826, 810986578, 811281085, 811397672, 810965478, 810354829, 810002327, 809786260, 809332192, 808745742, 808424056, 808299780, 807973504, 807510018, 807371020, 807578325, 807685554, 807594776, 807680964, 808036029, 808255911, 808157146, 808059037, 808138967, 808058619, 807603598, 807149410, 807005763, 806883335, 806519270, 806206107, 806209624, 806246340, 805997610, 805721343, 805767000, 805872381, 805617630, 805198729, 805017292, 804911375]
2106.9H04911375l81529n01275k65003j50084m20034o10232l86238j99914l92735n31376
2127.3H01072955k68459l2127k20299m21524k17020M7028n7698k72572j47402R6619
2147.7G99579501m6730l55959k94566k6286m3511k54035k03729K2769n9783l62456
2168.1G97955215l20554j6212k6286l10719l50714j12235r1195l65854m54604k52426
2188.5G95654416j79470l46302m00544k17497j39713l58701n28514l76761j89662k68281
2208.9G92648971l53873j45554O6280m1962k50875k65241j86443k32041l27528k62737
2229.3G90648997j21772j60516l05295k92361j77443k05695l50058l57807k10404j84775
2249.7G88282871l59595m48525l13222j96576k50101k84195j88351j50501k89023m03345
$$ y = [804911375, 804529846, 804028571, 803763568, 803613484, 803193450, 802583218, 802196980, 801997066, 801604331, 801072955, 800804496, 800772369, 800552070, 800130546, 799913526, 799960554, 799902856, 799630284, 799482882, 799579501, 799532771, 799176812, 798882246, 798855960, 798812449, 798558414, 798354685, 798377454, 798317671, 797955215, 797634661, 797618449, 797592163, 797281444, 796930730, 796818495, 796727300, 796361446, 795906842, 795654416, 795474946, 795128644, 794728100, 794510603, 794370890, 794012189, 793483675, 793106914, 792917252, 792648971, 792295098, 792149544, 792215824, 792173862, 791922987, 791657746, 791471303, 791239262, 790911734, 790648997, 790527225, 790366709, 790061414, 789769053, 789591610, 789385915, 789035857, 788678050, 788467646, 788282871, 787923276, 787474751, 787161529, 786964953, 786714852, 786430657, 786242306, 786091805, 785802782, 785399437]
2270.1G85399437l12328k01285k62797l40820k65657j85490l01719m95791m96984l75092
2290.5G82161474m31955n92470n88774n13614o03020p83741p96199o68943o51658p16090
2310.9G75815010o15060m37916n60522r18209j023114p41959m80234n49436o47068
2329.3G69841492m35173k83420n09441p16448o18279m11451j07348M40002N61654j60873
2349.7G67600715j104474j633823j596451j315415j007676o44266j23918L70204N33104
2368G61078000N22971O59406Q32797Q17656P49171P84159P37309M39703L0101k12074
2388.4G66439199k67326l50774m72247m74573l87310l78788m59611m71533l67224k93910
2408.8G62515903l16084l19958k55942k22683k88606l62515l56972l44098l89218m43876
$$ y = [785399437, 785087109, 784885824, 784623027, 784282207, 784016550, 783831060, 783529341, 783033550, 782536566, 782161474, 781729519, 781137049, 780548275, 780034661, 779431641, 778647900, 777851701, 777182758, 776531100, 775815010, 775199950, 774762034, 774201512, 773283303, 772260189, 771518230, 771037996, 770488560, 769841492, 769406319, 769122899, 768613458, 767897010, 767278731, 766867280, 766759932, 767199934, 767761588, 767600715, 766496241, 764862418, 763265967, 761950552, 760942876, 760298610, 760174692, 760544896, 761078000, 761600971, 762260377, 763093174, 763910830, 764660001, 765444160, 766181469, 766621172, 766651273, 766439199, 766171873, 765821099, 765348852, 764874279, 764486969, 764108181, 763648570, 763177037, 762809813, 762515903, 762199819, 761879861, 761623919, 761401236, 761112630, 760750115, 760393143, 760049045, 759659827, 759215951]
2429.2G59215951m42028m26591n04434o26802o44386n64873n44548n81861n27084m04000
2449.6G53949344l67164m14432l87668k69652j95443j89066j64390j16169j57118l02851
2470G51385391m07815m18544m55439n82874o67989o07133n15163m97699m63664l50476
2490.4G46418595k94983l92139n36859n78284n52237o26743p40171p19011o47604o64771
2510.8G40665793p00295o55591o03855o43670p18892p33793p04109p31230q14736q39472
2531.2G33520150q05557q25584q87334q66771p53641o22391m77910k69413m1962Q8692
2551.6G28058279J77979L77655O73294R18269J066327J219869J386404J389086J179159
2569.9G36446321R08434O41168L26931l3498l70800o29127q33810j010239j026869
$$ y = [759215951, 758773923, 758347332, 757842898, 757216096, 756571710, 756006837, 755462289, 754880428, 754353344, 753949344, 753582180, 753167748, 752780080, 752510428, 752314985, 752125919, 751961529, 751845360, 751688242, 751385391, 750977576, 750559032, 750103593, 749520719, 748852730, 748245597, 747730434, 747232735, 746769071, 746418595, 746123612, 745731473, 745194614, 744616330, 744064093, 743437350, 742697179, 741978168, 741330564, 740665793, 739965498, 739309907, 738706052, 738062382, 737343490, 736609697, 735905588, 735174358, 734359622, 733520150, 732714593, 731889009, 731001675, 730134904, 729381263, 728758872, 728280962, 728011549, 727969587, 728058279, 728236258, 728613913, 729287207, 730205476, 731271803, 732491672, 733878076, 735267162, 736446321, 737354755, 737995923, 738322854, 738289356, 737918556, 737289429, 736455619, 735445380, 734418511]
2588.3G34418511p70926l42012J22667N51343Q61883R82583R06050O85870M09305J06395
2608.7G37931669k22206n10812o75380p43032q01206q42213p99894o56307m87566l47018
2629.1G31846035k29717j60754j66118k53319m08411n53310o24836o46651o36339n70237
2649.5G27596343m85898m78982n54204n87285n17011m34100l93272l54409k94566k02358
2669.9G23294258j25408p2599Q2732L22163N25474P68066J134872J480580J641631
2688.2G29051769J649260J575113J400828J139522Q85248O93202N37336L43203J19329
2706.6G37394810n37k5987r0540j83344k24471k07662k25664l07977l31223l07381
2727G35490024k95877k26677j32978p9930j10745k46048l46184l17097k94983m16994
$$ y = [734418511, 733647585, 733305573, 733428240, 733979583, 734841466, 735824049, 736730099, 737415969, 737825274, 737931669, 737709463, 737198651, 736523271, 735780239, 734979033, 734136820, 733336926, 732680619, 732193053, 731846035, 731616318, 731455564, 731289446, 731036127, 730627716, 730074406, 729449570, 728802919, 728166580, 727596343, 727110445, 726631463, 726077259, 725489974, 724972963, 724538863, 724145591, 723791182, 723496616, 723294258, 723168850, 723096251, 723178983, 723501146, 724026620, 724794686, 725929558, 727410138, 729051769, 730701029, 732276142, 733676970, 734816492, 735701740, 736394942, 736932278, 737275481, 737394810, 737394273, 737368286, 737277746, 737094402, 736869931, 736662269, 736436605, 736128628, 735797405, 735490024, 735194147, 734967470, 734834492, 734754562, 734643817, 734397769, 734051585, 733734488, 733439505, 733022511]
2747.4G33022511n92172o62625o59764o81162p04944o80327o24180n79536n33819m39525
2767.8G26864457l56197l63052m10557m81307n77152o34849o24001n17965l64244l37124
2788.2G22198009m66883n29885m27246l42965l99590m74989m73082n32925o65188p03395
2808.6G17181861p20620q27074q96752q11875o34968n08368m40895k94269n2273J22786
2828.9G12117553J66297J98304L18230M14490K97725P8559j0788o9797k80738n49376
2849.3G12680459o80804o92010o87063n91397m36604l72708l41177k65598j85907q4222
2869.7G08342969k324j01268k52009j67191P272M9591O2644R0301M9890m3631o4910
2892.2G07971334O795m7922k58445l38853k75612l40402n30243n66065l49879j71900
$$ y = [733022511, 732430339, 731767714, 731107950, 730426788, 729721844, 729041517, 728417337, 727837801, 727303982, 726864457, 726508260, 726145208, 725734651, 725253344, 724676192, 724041343, 723417342, 722899377, 722535133, 722198009, 721731126, 721201241, 720773995, 720431030, 720031440, 719556451, 719083369, 718550444, 717885256, 717181861, 716461241, 715634167, 714737415, 713925540, 713290572, 712782204, 712341309, 712047040, 711994767, 712117553, 712283850, 712482154, 712800384, 713214874, 713512599, 713591158, 713580370, 713510573, 713229835, 712680459, 711999655, 711307645, 710620582, 710029185, 709592581, 709219873, 708878696, 708613098, 708427191, 708342969, 708340645, 708239377, 707987368, 707820177, 707827449, 707877040, 707939684, 708029985, 708079875, 708036244, 707971334, 707978129, 707930207, 707671762, 707332909, 707057297, 706716895, 706186652, 705620587, 705270708, 705098808]
2912.6G05098808k87712m81605m96209l84271k28167o7293J45375K74063J7106l23415
2933G03266680l41594k61903k84016k46584j22488j50263m13060n74887m27425l61145
2953.4G00083315n36322o06477m71890k84136j93536j88351j28627k2351P6890R8526
2973.8F97827041N4598J25825J86742J5378j24216J3470K37763L65615L28422J70469
2994.2F99201107R7871N0664j5676J03831L00825L84986M67241N62727M74453J96874
3014.5G01824903m8577r1195J3113R2089O0558K98O0082J63853J42574n5313k04444
3037G01957941j02997p3015l27111o87778j015484j079381p40528k66134P3850K42114
3057.4F97981477L32236M41551N46992N46694L62217J65999K06113L60072M39763M43160
$$ y = [705098808, 704811096, 704329491, 703833282, 703449011, 703220844, 703153551, 703298926, 703572989, 703590095, 703266680, 702925086, 702663183, 702379167, 702132583, 702010095, 701859832, 701446772, 700871885, 700444460, 700083315, 699546993, 698940516, 698468626, 698184490, 697990954, 697802603, 697673976, 697651625, 697728515, 697827041, 697881639, 698007464, 698194206, 698209584, 698085368, 698098838, 698336601, 698702216, 699030638, 699201107, 699298978, 699349642, 699333966, 699437797, 699738622, 700123608, 700590849, 701153576, 701628029, 701824903, 701776326, 701685131, 701698244, 701790333, 701850891, 701851189, 701911271, 702075124, 702217698, 702162385, 701957941, 701854944, 701781929, 701454818, 700767040, 699751556, 698672175, 697931647, 697665513, 697739363, 697981477, 698313713, 698755264, 699302256, 699848950, 700211167, 700377166, 700583279, 700943351, 701383114, 701826274]
3077.8G01826274L34263J94192J16587P4088J59145K19107N3763j9491J85728L69549
3098.2G03513205L08394J63734K04981L43919K49922K3425J23381M10795L86834J59503
3118.6G05888093J5258o0737o8426K2411J58191J96934Q1003p570P6651J36376n1022
3141G06387162k49803j46031J22070K75552K22445K2590j59383k52247l13639k83897
3161.4G05624819j75595j87517l02016l08574k14040k08437l03328l18945k22802k11120
3181.8G03172445l42667m22716l68178l54469m93407o46412o77705o89626q24749r61602
3202.2F97390914r27866q45849q87036r50694q84474p98225r22442j236736j508177
3220.5F88429415j660168j793623j783192j316726l72470N74470J047850J218438J362025
$$ y = [701826274, 702160537, 702354729, 702471316, 702545404, 702704549, 702923656, 702977419, 702957928, 703143656, 703513205, 703821599, 703985333, 704190314, 704534233, 704784155, 704807580, 704930961, 705341756, 705728590, 705888093, 705903351, 705842614, 705774188, 705796599, 705954790, 706151724, 706232727, 706225157, 706301808, 706438184, 706387162, 706137359, 705991328, 706113398, 706388950, 706611395, 706633985, 706474602, 706222355, 705908716, 705624819, 705449224, 705261707, 704959691, 704651117, 704437077, 704228640, 703925312, 703606367, 703383565, 703172445, 702829778, 702407062, 702038884, 701684415, 701191008, 700544596, 699866891, 699177265, 698352516, 697390914, 696463048, 695617199, 694730163, 693779469, 692894995, 692096770, 691174328, 689937592, 688429415, 686769247, 684975624, 683192432, 681875706, 681503236, 682077706, 683125556, 684343994, 685706019]
3238.9F85706019J335204J098633Q62956O99222N43654M78089O07073P88748P92265
3257.3F92911863O19233M05729K52187J49071K6047j13189k70068m37737o12676p39276
3277.7F92191184p27535o95288p72655q76307q52347p21216p29382r43720j078129
3296F84794605j006007q93295p89225o65069o99580r97305j305878j370847j296580
3314.4F75770819j361608j585067j763999j818419j898348k135932k355755k404213
3330.7F60447478k447486k611339k794683k981484l266155l675342m178166m645944
3347F33846879n150199o039321p169366q053363q610606q723140p641792m452050O74546
3365.4E78681588N926132R048283Q957923N983651J256942l372967n564928l881156
$$ y = [685706019, 687041223, 688139856, 689002812, 689702034, 690245688, 690723777, 691330850, 692119598, 692911863, 693531096, 693936825, 694189012, 694338083, 694364130, 694250941, 693980873, 693543136, 692930460, 692191184, 691463649, 690768361, 689995706, 689119399, 688267052, 687545836, 686816454, 685872734, 684794605, 683788598, 682895303, 682106078, 681441009, 680741429, 679744124, 678438246, 677067399, 675770819, 674409211, 672824144, 671060145, 669241726, 667343378, 665207446, 662851691, 660447478, 657999992, 655388653, 652593970, 649612486, 646346331, 642670989, 638492823, 633846879, 628696680, 622657359, 615487993, 607434630, 598824024, 590100884, 582459092, 578007042, 578681588, 584607720, 593656003, 602613926, 608597577, 609854519, 606481552, 600916624, 597035468]
3381.7E97035468Q65757O116212R775996J1280238J0652900Q339882N720854L842234
3398F53629541K395928R84490j3828l25143m46678p58111j081944j282215j373648
3416.3F51728392j397372j446664j475155j421333j380741j421154j533925j595021
3432.7F40057027j674592k011418k415896k587080k709627l099859l827095m787803
3449F16943657n969762p529021r078204r379983p199407k477586L178477O888270O667078
3467.3E92043519L535330N64397j04070J281202L363371N073666O030560O286442N876780
3485.7F23951197M953921L972172L263712K763987K339780J911759J607359J488507
3502F46252394J272082J010060J010478J189470J237214R99927P43986P18474Q31842
$$ y = [597035468, 597901225, 604017437, 613793433, 625073671, 635726571, 644066453, 649787307, 653629541, 656025469, 657009959, 656996131, 656670988, 656224310, 655466199, 654384255, 653102040, 651728392, 650331020, 648884356, 647409201, 645987868, 644607127, 643185973, 641652048, 640057027, 638382435, 636371017, 633955121, 631368041, 628658414, 625558555, 621731460, 616943657, 610973895, 603444874, 594366670, 584986687, 577787280, 575309694, 578488171, 585376441, 592043519, 595578849, 596143246, 596039176, 597320378, 600683749, 605757415, 611787975, 618074417, 623951197, 628905118, 632877290, 636141002, 638904989, 641244769, 643156528, 644763887, 646252394, 647524476, 648534536, 649545014, 650734484, 651971698, 652971625, 653715611, 654434085, 655265927]
3520.4F55265927R37522Q21888O20425O59943P84158Q46505R03428Q17001O54638P30037
3540.8F63041472Q44002P43807O05285N81145O53803P36416P50482P43449P91192P28428
3561.1F70219481L96252L18944J005173J465797J071990P63535P91073Q45313R25362
3579.5F77802920R52065P52390N39541P73788J142144J008391Q50141J002371J148701
3597.9F85972452J120687J021564Q01384O26803Q71420J158952J112163R84311Q30770
3616.2F94500506J107871J564861J164853M65870K81155J021862J593173J048028Q18611
3634.6G03566790Q82268Q07464P10189N43892K81692L59774J210332J507461N77986
3652.9G10447848L25322Q78870Q45612L25739R1016j7106j17362J38819K73347k5809
$$ y = [655265927, 656203449, 657025337, 657645762, 658305705, 659089863, 659936368, 660839796, 661656797, 662311435, 663041472, 663885474, 664629281, 665234566, 665815711, 666469514, 667205930, 667956412, 668699861, 669491053, 670219481, 670615733, 670934677, 671939850, 673405647, 674477637, 675241172, 676032245, 676877558, 677802920, 678754985, 679507375, 680046916, 680820704, 681962848, 682971239, 683821380, 684823751, 685972452, 687093139, 688114703, 688916087, 689542890, 690414310, 691573262, 692685425, 693669736, 694500506, 695608377, 697173238, 698338091, 698803961, 699085116, 700106978, 701700151, 702748179, 703566790, 704449058, 705256522, 705966711, 706510603, 706792295, 707152069, 708362401, 709869862, 710447848, 710773170, 711652040, 712497652, 712823391, 712914407, 712897301, 712779939, 712918758, 713192105, 713166296]
3673.3G13166296L27647O20127K24590O3718J2278J7882L17633M72784J38700m4823
3693.7G15316832j16110k64287k38478O4373J65224r4533k41995q2075K66432J82569
3714.1G14957952k61604m47512l52263l17276l30508j06513K4438j48118k67505M4286
3734.5G12795377N75661K30968p08580q63552L1710J94907k69413J06275L46840j53661
3754.9G12286532l55840o0916N1618k08438k97784k16365J2815J89900o6399l09468
3775.3G11025655j75178N8413r3997k98798k04086j57058k11895k69949l19183k72215
3795.7G09081709l32296l03030O6460n8115k49803l7610j93537m96328m01616q3387
3816.1G06992447k37405k58028Q2075j89841l82900k75314k42531j71244j03057p8499
$$ y = [713166296, 713493943, 714114070, 714338660, 714402378, 714414656, 714432538, 714750171, 715222955, 715361655, 715316832, 715200722, 714936435, 714697957, 714762330, 714927554, 714833021, 714591026, 714508951, 714775383, 714957952, 714696348, 714248836, 713896573, 713579297, 713248789, 713142276, 713166714, 713018596, 712751091, 712795377, 713371038, 713602006, 712893426, 712029874, 712061584, 712256491, 711987078, 712093353, 712440193, 712286532, 711930692, 711869776, 711921394, 711712956, 711415172, 711198807, 711211622, 711401522, 711335123, 711025655, 710850477, 710908890, 710814893, 710516095, 710312009, 710154951, 709943056, 709673107, 709353924, 709081709, 708749413, 708446383, 708512843, 708454728, 708204925, 708167315, 707973778, 707477450, 707075834, 706992447, 706755042, 706497014, 706579089, 706389248, 706006348, 705731034, 705488503, 705317259, 705214202, 705135703]
3836.5G05135703j07467j47224n900L2603l02493p47979r55522k07603Q13365J66357
3856.9G03673840m76480m72188j94251J0788k47896l40700J1623J29879q703l60429
3877.3G01725483m26114p8797l8981l5048j69694l67046m1306J1265n00202p12573
3897.7F99366987m71235j32978J78040L28242J33336j01030k64227m53115m17054j32978
3918.1F98033988m7802j46389o8546m828k25663l40641j18076K2828j16408k93195
3938.5F96695268l46541k22922j24156j52528o5625K6405n6803j66953k05457j89007
3958.9F95191681j42693j07348j28508j85430k02536j63257j35005j52469j77562j50204
3979.3F93646669j09493j33157k02835k61247k68698k06947j24931j22190j82509
$$ y = [705135703, 705028236, 704881012, 704875112, 704907715, 704605222, 703857243, 702901721, 702694118, 703507483, 703673840, 703197360, 702725172, 702530921, 702541709, 702293813, 701953113, 701964736, 702094615, 702085912, 701725483, 701299369, 701220572, 701181591, 701146543, 700976849, 700609803, 700568497, 700579762, 700079560, 699366987, 698895752, 698762774, 698940814, 699269056, 699402392, 699301362, 699037135, 698584020, 698166966, 698033988, 697986186, 697839797, 697771251, 697766423, 697540760, 697200119, 697082043, 697104871, 696988463, 696695268, 696348727, 696125805, 696001649, 695849121, 695783496, 695809901, 695753098, 695586145, 695380688, 695191681, 695048988, 694941640, 694813132, 694627702, 694425166, 694261909, 694126904, 693974435, 693796873, 693646669, 693537176, 693404019, 693201184, 692939937, 692671239, 692464292, 692339361, 692217171, 692034662]
3997.6F92034662
$$ y = [692034662]
##END=$$ End of the data block
