##TITLE=PABA - Lucas, Lucas e Marcos $$ Begin of the data block
##JCAMP-DX=5.00 $$ ACD/SpecManager v 10.08
##SPECTROMETER/DATA SYSTEM=Alpha
##DATE=14 Apr 2015 08:11:20
##DATA TYPE=INFRARED SPECTRUM
##DATA CLASS=XYDATA
##ORIGIN=
##OWNER=
##NPOINTS=1765
##FIRSTX=399.76428223
##LASTX=3997.64306641
##MAXX=3997.64306641
##MINX=399.76428223
##MAXY=0.69991028
##MINY=0.08445894
##XFACTOR=1.0000000000
##YFACTOR=1.000000000000000e-9
##FIRSTY=0.47287649
##DELTAX=2.03961372
##XUNITS=1/CM
##YUNITS=ARBITRARY UNITS
##XYDATA=(X++(Y..Y))
399.8 472876489 472076356 473793060 479818940 490021348 500313938 507240951 512031734 517452955
416.1 517452955 524255633 530268431 534673989 538679898 541086793 542204082 544230163 546851099
432.4 546851099 548511565 549775302 551805973 554005027 555305898 556449175 558485925 560312390
448.7 560312390 561270535 562554717 564657271 566294491 566471100 566522002 567035556 566902816 566257119
467.1 566257119 566061616 565839946 564281762 561867237 559679747 556888759 552438855 546371341 538404167
485.4 538404167 526829183 509665012 485632777 455003560 422260761 399392366 400343597 426729113
501.7 426729113 464961141 503759563 539616883 565784276 579196513 583977163 585110247 584605038
518.1 584605038 582415581 579514384 577046752 574323714 570200324 564918399 558553278 550028741
534.4 550028741 537897527 521099329 497829288 466310680 427545100 386677086 351781517
548.7 351781517 330665827 329597622 350261360 386132330 426378161 463531971 494337440 517771065
565 517771065 534459174 546211541 554902554 561547518 566530108 570247352 573383451 575847030
581.3 575847030 577247381 577817142 577978730 577523351 576032758 573569119 570242763 565775633 559671581
599.6 559671581 552031875 543108761 532914102 520497203 503477693 478235394 444115907 408439457
616 408439457 381754190 377403021 421585292 521917462 627551496 684435010 693848908 679349899
632.3 679349899 646965325 608573794 597758710 616510749 635268331 642536759 642249167 638744056
648.6 638744056 635088503 632403731 630418360 628880918 628250003 628531873 629065931 629492998 630169213
667 630169213 630874574 630829096 630338728 629902244 629274666 627658367 625077546 622017741 617834032 610853136
687.3 610853136 599798620 583100736 557997346 524720907 495053470 492906004 530445457 584325612
703.7 584325612 621678233 636482537 639948189 639778018 638832450 638165116 637217700 635463119 633613646
722 633613646 632112622 630248606 627698839 625239670 623065293 620349407 616983354 613829255 610838294
740.4 610838294 607174337 602782547 598184466 592868924 585742116 576812029 566214383 552335382
756.7 552335382 532986760 507687926 474052310 423988670 353407025 279457778 241953939
771 241953939 271604389 348883450 420736283 461052448 482478231 502085626 523358822 542154431
787.3 542154431 555107534 562312722 566072524 568062186 568242610 566727281 564771056 562864184
803.6 562864184 560103774 555890501 550011575 541652858 532277644 527130008 528631806 532403708
819.9 532403708 534053683 534240782 533179283 527493119 514850676 495390326 467986286 429079801
836.2 429079801 378348112 328436613 301875085 307700545 335194439 376193941 429299593 484820038
852.6 484820038 528534412 555849552 570919812 577904522 579151630 577002168 572935700 566835880
868.9 566835880 558906496 550512969 542322338 533592165 524005771 514342368 504795134 494896978
885.2 494896978 485345960 477870017 473241806 470997810 470821857 472507715 474810272 476064920 475923121
903.5 475923121 475038081 473587006 471437335 469204575 467724919 466833383 465958059 465465426 466181129
921.9 466181129 468105644 470985770 475353807 481673807 489255935 497218788 505668283 514772713
938.2 514772713 523647487 531471252 538661897 545364738 550094366 552186251 554238439 557782888
954.5 557782888 558959961 553730130 544350445 537441373 538594306 549750328 566479862 579967082
970.9 579967082 586251736 588148654 589063466 589852393 589978218 589696348 589899123 590311110 589998960
989.2 589998960 589341462 589332461 589665532 589476168 588997900 588744164 588003814 585907578 582964301 580656946
1009.6 580656946 580066323 580886424 582166314 583193779 583262622 582329929 581382155 580848634 579984963
1028 579984963 578510344 577182889 576238692 574957848 573229134 571810186 570713341 569096565 566859365
1046.3 566859365 564683259 562526345 559621990 555828035 551488280 546299994 539857745 532919228
1062.6 532919228 526650071 521148443 516192436 512611449 511457801 512474418 514505804 516829133
1079 516829133 519067049 520537913 520792782 520285904 519549251 518354118 516424775 514085650 511519670
1097.3 511519670 508230567 503899634 498923719 493596375 487554550 480582863 473240018 465977401
1113.6 465977401 458028346 448480397 437394768 423722148 404072136 378057837 356884688 359418899
1129.9 359418899 390328318 428681701 451216608 456759542 455703050 452403665 446347713 437386066
1146.3 437386066 425908089 412210554 396876603 380882829 364475220 345996618 322824568
1160.5 322824568 293105066 256267726 213130862 166640788 123841561 96996576 100366905
1174.8 100366905 144737720 232026815 350306839 474916697 578599215 644491374 672546923
1189.1 672546923 674188435 661771774 643083334 622647643 604227245 590437472 581323743 575196326
1205.4 575196326 570303142 564947546 557539225 547750354 536701143 525435388 514215589 503195345
1221.7 503195345 492761523 483066231 473921716 465227216 457139909 449717641 442683071 435759604
1238.1 435759604 428862929 421822727 414258122 405997992 397090733 387382239 376662970 365041077
1254.4 365041077 352756590 339704126 325560689 310310692 294041336 276658952 258260041
1268.6 258260041 239338085 220947012 204246968 189111665 174097419 158052519 141070962
1282.9 141070962 124325015 109840840 100221291 97483963 102011666 113601781 135005713 169102222
1299.2 169102222 205779061 222080946 206510395 174032629 148798138 140579149 145509616 156141669
1315.6 156141669 164714143 168355614 169021934 168644369 172900662 192470193 233059332 288264453
1331.9 288264453 343787313 385657519 403918862 397150010 382606536 384788215 413622469 461142778
1348.2 461142778 511970341 555083573 587049067 607694149 618042171 620446265 616995931 610008061
1364.5 610008061 601918221 593456447 584865749 575676024 564596832 552479804 539978623 526540041
1380.8 526540041 512704372 499400049 485803485 471825093 459464669 448430955 438112557
1395.1 438112557 429523319 422410935 415622443 407436132 394896120 377556682 356286228 331069410
1411.4 331069410 303581506 275986701 247026160 218307674 204131246 214523852 252474368
1425.7 252474368 311132878 374272555 415249497 418601155 378503531 304938704 244334668
1440 244334668 222508758 250158906 321488738 414184779 497886747 559601724 604607701 641856611
1456.3 641856611 668270409 677257478 679000199 678466856 675885439 672533095 668629944 662374914
1472.6 662374914 654016733 645320773 636435270 627218008 618708432 612610042 608499348 603615701
1488.9 603615701 596088767 587886810 579045773 567321420 553799033 541172087 530114770 517016232
1505.2 517016232 495278567 473444194 455050200 436309814 416969419 398705721 387042075
1519.5 387042075 385196626 391777605 402454913 414927989 427903742 440190792 448304802 449826956
1535.8 449826956 447719723 441821337 432187021 422559768 413133860 403832644 393727601 383275121
1552.2 383275121 373304456 364018291 350762129 332144976 318702370 305587947 289355814 268060595
1568.5 268060595 239804074 216641948 217830107 258584142 299181372 305773675 290187061 265416443
1584.8 265416443 237158909 207636669 178396493 150273502 123864956 101768285 87638482
1599.1 87638482 84458940 94052687 115410790 145958915 182798743 217794076 238965973 236858368
1615.4 236858368 208838686 176191151 151650891 136795476 136909932 149094820 164153263 172844782
1631.7 172844782 172871649 168989494 176576436 201000795 235412195 268268287 289209098 288865983
1648 288865983 273241967 240157604 185957417 151838988 133869231 121454589 114263982 111593574
1664.3 111593574 111443743 112487487 114057429 115516014 117159575 119109496 121401973 124350496
1680.7 124350496 130116791 142023236 157106549 174799174 197228387 220917374 249029234
1694.9 249029234 280939013 311476499 344434679 371285319 395541161 422207743 446737915
1709.2 446737915 469382584 491535962 514584899 539967000 561858475 577949524 593071580
1723.5 593071580 608051300 621469021 633719444 644874930 655964911 664386630 668849170 671591938
1739.8 671591938 672093153 670230448 667848945 666749656 667763054 670957208 675806999 682296753
1756.1 682296753 689085543 694420815 697982728 699572384 699910283 699615538 698662281 696236789 692660928
1774.5 692660928 689755440 688387811 688288927 688734412 689449430 690624177 692380250 694384933 695693433
1792.8 695693433 696068823 696365118 696586311 696349263 695848405 695573211 695434451 695176184 694808006 694450915
1813.2 694450915 694184899 693967819 693857849 693821251 693641722 693165660 692710996 692141771 691008270 689921439
1833.6 689921439 689379036 689016640 688549697 688227892 687813103 686617076 684757173 682813287 681172907
1852 681172907 679820120 678651035 677904963 677675664 677617729 677621782 677876532 678055167 677471220 676509023
1872.4 676509023 675867975 675547481 675184011 674674511 674253345 673967719 673630416 673088670 672325432 671449840
1892.8 671449840 670279980 668510914 666145027 663046300 659140110 654666841 649779975 645469606
1909.1 645469606 643939376 645528674 648293018 651322126 654833317 658662558 662139416 664263010
1925.4 664263010 664907634 665063560 665675282 666704416 667647362 668523967 669548154 670437336 670725107
1943.8 670725107 670580387 670411229 670250237 670094848 670098364 670205653 670050144 669527948 668992281 668662548
1964.2 668662548 668252170 667481184 666612625 665965378 665517747 665227354 665139437 665116012 664890170 664432049
1984.6 664432049 663933456 663382053 662545621 661395073 660242617 659211934 658075571 656817675 655599952
2002.9 655599952 654331505 652757466 650812268 648556471 646037877 643672645 642453313 642912686
2019.2 642912686 644151807 644871116 644834340 644620478 644239366 643320262 641998291 640556633 639028609
2037.6 639028609 637425125 635868192 634358823 632743239 631000519 629422307 628297269 627661467
2053.9 627661467 627528906 627957046 628789067 629710853 630611479 631539881 632394850 632912457 632968187 632594764
2074.3 632594764 631782413 630569398 629267633 628257155 627606452 627153277 626789153 626514912 626268029
2092.7 626268029 625969172 625682235 625454247 625101089 624445021 623549700 622545898 621440172 620192587
2111 620192587 618863583 617488801 615992010 614367306 612757266 611256063 609832406 608496726 607351601
2129.4 607351601 606391251 605495930 604671299 604029298 603591442 603257656 602961063 602714777 602477789 602125108
2149.8 602125108 601651371 601185322 600767255 600340962 599934161 599652231 599445343 599127531 598658204 598179758
2170.2 598179758 597688258 597023249 596206725 595374942 594514668 593548715 592516184 591510296 590512097
2188.5 590512097 589445412 588367820 587344646 586271405 585018158 583625734 582203865 580783010
2204.8 580783010 579418302 578256309 577432275 576965690 576773942 576722622 576595366 576167464 575418472
2223.2 575418472 574501872 573547423 572608232 571757317 571085393 570530832 569917560 569184422 568410337 567633808
2243.6 567633808 566796124 565866053 564889908 563865244 562759936 561690867 560848594 560235143 559656382
2262 559656382 558967054 558165491 557284296 556337297 555354059 554348528 553320289 552275419 551217735
2280.3 551217735 550171435 549173295 548242033 547373176 546535552 545652509 544642448 543463647 542168736
2298.7 542168736 540899098 539783955 538843036 538017631 537279010 536595404 535911143 535225332 534541249
2317 534541249 533793092 532964528 532125235 531338215 530553281 529653311 528624296 527513564 526313007
2335.4 526313007 525000274 523589551 522088408 520451605 518695056 517260671 516343117 515599966 514682114
2353.7 514682114 513553202 512247741 510692537 508948326 507112324 505222678 503359497 501656413
2370.1 501656413 500165462 498826474 497587532 496425837 495307654 494189471 493036807 491827577 490578115
2388.4 490578115 489291728 487933934 486491948 484985650 483450085 481910467 480414718 479055554
2404.7 479055554 477863431 476773798 475747108 474782318 473854423 472903937 471914679 470926434 469909012
2423.1 469909012 468748868 467401236 465937734 464377195 462650537 460758209 458766133 456680059
2439.4 456680059 454501957 452339709 450342119 448558927 446941435 445490003 444271445 443291485
2455.7 443291485 442509443 441935658 441563129 441280305 440946758 440484941 439830184 438885748 437591672
2474.1 437591672 435981929 434107214 431993634 429796219 427826136 426295787 425144821 424161792
2490.4 424161792 423144460 421939462 420451403 418679386 416721344 414654464 412453592 410120308
2506.7 410120308 407756358 405423224 403108895 400819063 398587406 396388859 394135803 391797036
2523 391797036 389414817 386985749 384425879 381725580 378959984 376151025 373306870 370515943 367953628
2541.4 367953628 365814388 364233762 363308370 363071799 363431454 364271313 365632594 367727488 370742261
2559.7 370742261 374711633 379527718 384933889 390484780 395657808 400068074 403455794 405581474
2576 405581474 406322449 405767918 404107064 401514262 398268968 394942284 392285854 390966117 391414255
2594.4 391414255 393732488 397568494 402115136 406480402 410060972 412507594 413622618 413445145
2610.7 413445145 412218869 410192877 407578826 404633254 401646078 398849845 396410108 394537657
2627 394537657 393430054 393001884 392836422 392520666 391880363 390843630 389358550 387504637 385519356
2645.4 385519356 383590668 381754875 380058795 378545493 377142340 375755429 374416053 373261333
2661.7 373261333 372339010 371588141 371031433 370745152 370706707 370877802 371387422 372487903 374433696
2680.1 374433696 377489239 381870478 387539685 394113541 401063621 407925308 414293557 419797093
2696.4 419797093 424250573 427730620 430375725 432212919 433304489 433905214 434226215 434290230 434104621
2714.7 434104621 433732569 433199793 432465494 431572169 430726081 430095971 429714203 429611802 429735839 429850221
2735.1 429850221 429711670 429261446 428611130 427801281 426715106 425272197 423496395 421431899 419145286
2753.5 419145286 416780651 414460689 412192643 410012156 408048362 406401455 405026793 403775901
2769.8 403775901 402569532 401350170 399937391 398216307 396319300 394429862 392607927 390882611
2786.1 390882611 389329135 387950420 386666924 385453403 384347111 383316487 382215679 380939603
2802.4 380939603 379462540 377763599 375823319 373653740 371345907 369013458 366718590 364601344
2818.8 364601344 362927645 361918956 361646205 362021565 362869531 364020765 365362436 366907001 368739188
2837.1 368739188 370833367 372982383 374888033 376275629 376945049 376835614 376069039 374844074 373342693
2855.5 373342693 371739686 370195359 368846059 367779046 366994053 366458118 366138816 365968376 365891814
2873.8 365891814 365930319 366159290 366620928 367269486 368013650 368785262 369568229 370347977 371100724 371815294
2894.2 371815294 372393101 372663021 372588217 372234732 371548772 370502770 369322866 368364692 367869347
2912.6 367869347 367824942 368142575 368769735 369627267 370669335 371796012 372847289 373603642 373703003
2930.9 373703003 373035818 371803790 370126784 368174940 366294026 364679366 363209218 361727864
2947.2 361727864 360349864 359245002 358212471 357036412 355880111 354881704 354031354 353331596 352801949
2965.6 352801949 352453023 352260470 352247745 352449566 352820903 353365302 354084671 354863375 355701089 356705904
2986 356705904 357903719 359280884 360707760 361961693 363026291 364021450 365051895 366273373 367773771
3004.4 367773771 369544953 371521980 373494357 375194818 376534939 377599478 378554195 379573435
3020.7 379573435 380678356 381725758 382600009 383333594 383946329 384375632 384584069 384617060 384574145 384435385
3041.1 384435385 383987963 382867515 380750030 378166467 376601130 376746893 378053427 380118072 382734329
3059.4 382734329 385394692 387769252 389947653 392079353 394182354 396226376 398187399 400116324
3075.7 400116324 402129591 404227763 406310201 408354908 410420597 412561387 414752096 416921675
3092.1 416921675 419093728 421326935 423605025 425874561 428079873 430193841 432209104 434094042
3108.4 434094042 435843259 437558711 439328045 441111267 442881167 444687635 446540475 448389620
3124.7 448389620 450172096 451871932 453536749 455147177 456632525 457970262 459144652 460131347
3141 460131347 460971564 461881161 463151067 464828432 466637254 468237728 469469458 470391214 471148282
3159.4 471148282 471800059 472335368 472776473 473153293 473484725 473806083 474153847 474513978 474814802 475054592
3179.8 475054592 475279301 475435793 475391358 475084513 474544257 473735392 472571224 471014857 469068319
3198.1 469068319 466796488 464338273 461819082 459370703 457152814 455240875 453591764 452005982
3214.4 452005982 450059861 447284192 443396658 438353449 432465374 426606864 422189534 420649379
3230.7 420649379 422725588 428037941 435309917 443134338 450522691 456916988 462144822 466442019
3247.1 466442019 470302641 474198252 478437960 483122140 488016784 492628992 496566385 499702454
3263.4 499702454 502009571 503494442 504303217 504673362 504702985 504395187 503825903 503032267 502004683
3281.7 502004683 500758588 499341965 497807920 496134400 494264841 492222965 490079105 487816215
3298 487816215 485353142 482660711 479786247 476787508 473666191 470359862 466730058 462628156 457996160
3316.4 457996160 452810824 447086424 440870196 434201598 427153140 419746995 411952436 403754145
3332.7 403754145 395088524 385860264 376036137 365502447 354008466 341288239 326996326 310857087
3349 310857087 292789131 272748947 250943571 228521049 207954794 192840397 187263682 194482565
3365.4 194482565 214883476 244170666 273777962 293945223 298356950 288253844 273085862
3379.6 273085862 265800238 275067031 301028460 338122606 379826516 419953048 453166187 477205276
3395.9 477205276 493180603 503295481 509416938 512721956 513953090 513698757 512344122 510101318
3412.3 510101318 507162154 503715634 499836504 495441139 490515441 485231310 479665846 473689735
3428.6 473689735 467157722 460219651 453116089 445779979 438063115 429849386 420839965 410426915
3444.9 410426915 397505373 380855441 359317362 332100630 301240146 273055285 256080687
3459.2 256080687 256395668 272888303 296272427 314907700 322944999 323275536 323511362 329778016
3475.5 329778016 343905598 364448220 388442814 412341863 433604538 451311827 465305537
3489.8 465305537 476148546 484819770 491974652 497847348 502756536 507074237 510782957 513920069
3506.1 513920069 516835451 519621968 522179544 524465203 526452482 528270304 530128002 532066762
3522.4 532066762 533780456 535085440 536245525 537429035 538672626 540080369 541500151 542709351
3538.7 542709351 543932676 545375228 546747386 547670662 548341870 549165785 550088763 550989747 551993132
3557.1 551993132 553181112 554512799 555904627 557296932 558511913 559375048 560150027 561113954 562313795
3575.4 562313795 563656986 565039039 566502810 568186641 569970846 571375191 572423220 573699474
3591.7 573699474 575277746 576860189 578369558 579814315 581184506 582638144 584209681 585787356
3608.1 585787356 587355673 588954568 590504289 591937304 593300998 594459176 595372438 596418083
3624.4 596418083 597754836 598937511 599479079 599822044 600288630 600779057 601279438 601835608 602538645
3642.7 602538645 603553236 604816020 605654120 605399311 604818583 604580462 604558825 604495704 604306579 604129732
3663.1 604129732 604244530 604588091 604716778 604521036 604265332 603488386 602110445 601044297 600560009
3681.5 600560009 600710988 601477563 602515876 602917910 602312863 601603389 601265907 601222336 601247072 600997090
3701.9 600997090 600541711 600415230 600711823 600881994 600324690 599435329 598875642 598691702 598695576 598609388
3722.3 598609388 598215163 597637832 597359717 597624540 598107934 598106027 597326875 596529067 596239209 596095920
3742.7 596095920 595622659 595224202 595047295 594331145 593169093 592451453 592140555 591757596 591242731
3761 591242731 590932667 590799928 590618193 590286672 589747548 589203298 588961422 588998914 588877976 588405848
3781.4 588405848 587931991 587509155 587058127 586724520 586542726 586453140 586382449 586295605 586133301 585633636
3801.8 585633636 584926605 584181488 583254635 582541823 582367599 582461119 582405031 582229912 581809282 580823183
3822.2 580823183 579923034 579424143 579075933 578849196 578847647 579056263 579130888 578725457 578106880 577531874
3842.6 577531874 576995790 576734602 576986790 577563941 577537298 576478302 575694561 575455844 575457811 575474322
3863 575474322 575366855 575198114 574928820 574522555 574050128 573571205 573330581 573326588 573277295 573078632
3883.4 573078632 572656929 572166800 571865559 571514487 571074069 570912123 570975602 570916533 570574045 569971204
3903.8 569971204 569292009 568787158 568463326 568283677 568245053 568189263 567948222 567658365 567491770 567331731
3924.2 567331731 567086220 566876352 566730857 566499233 566158950 565854609 565655649 565517247 565369904 565214038
3944.6 565214038 565056622 564823389 564500988 564231336 564050138 563837945 563595474 563423395 563264549 563036382
3965 563036382 562808335 562642992 562490344 562276244 562060714 561889708 561684489 561447084 561210871 560962915
3985.4 560962915 560714722 560460985 560201883 559959352 559687436 559384882
3997.6 559384882
##END=$$ End of the data block
