##TITLE=P4 $$ Begin of the data block
##JCAMP-DX=5.00 $$ ACD/SpecManager v 10.08
##SPECTROMETER/DATA SYSTEM=Alpha
##DATE=26 Feb 2015 09:50:54
##DATA TYPE=INFRARED SPECTRUM
##DATA CLASS=XYDATA
##ORIGIN=
##OWNER=
##NPOINTS=1667
##FIRSTX=599.57470703
##LASTX=3997.16503906
##MAXX=3997.16503906
##MINX=599.57470703
##MAXY=0.98618460
##MINY=0.25975689
##XFACTOR=1.0000000000
##YFACTOR=1.000000000000000e-9
##FIRSTY=0.53648466
##DELTAX=2.03937006
##XUNITS=1/CM
##YUNITS=ARBITRARY UNITS
##XYDATA=(X++(Y..Y))
599.6E36484659J37984Q552075J6423106K1444857K2582054K0467937J6239405J1893809
615.9F54225886R240270P956862O901026O244063O410062O921530O692291N671560
632.2G10263550M218817K804399K116024K215624K783120L948032N574704O752729
648.5G40676999O669521N342126M123628M011035M836083N545199N317807M175603
664.8G80698001K978683J610637R5963m28677j40547M74930Q04066J007021J144409
683.2G88244486J150429J275182J859307K784610L526688L817915L487349K986610
699.5H09132576L079057L593385L859162L878057L782273L323257K724826K185225
715.8H35557818J829505K149225L226041M264594M776895M817843M551947M219115
$$ plain form
599.6 536484659 536622643 545174718 561597824 583042681 605624735 626092672 642332077 654225886
615.9 654225886 663466156 671423018 678324044 684568107 690978169 697899699 704591990 710263550
632.2 710263550 714482367 717286766 719402790 721618414 724401534 728349566 733924270 740676999
648.5 740676999 747346520 752688646 756812274 760823309 765659392 771204591 776522398 780698001
664.8 780698001 783676684 785287321 785383284 784954607 784814060 785288990 786093056 787100077 788244486
683.2 788244486 789394915 790670097 792529404 795314014 798840702 802658617 806145966 809132576
699.5 809132576 812211633 815805018 819664180 823542237 827324510 830647767 833372593 835557818
715.8 835557818 837387323 839536548 842762589 847027183 851804078 856621921 861173868 865392983
732.1H65392983L810942L263354K506853J643896R60648Q13424J120687J384497J386761
750.5H82284045J072407O57380P74681J198471J135468Q74937O63280N79059P17283
768.8H89957011O30617M34160L25143J55330K30491P24316J043856P46310K19405m9591
789.2H94417048L8206K65837K87592J15931M3273J42873K23219J03533j38998k34842
809.6H95263672j76549j40250j51276l99232r17912j368701j612187j980304k756954
828H85760307l482997l760755l638745k927243j564920J23858J637280K422452K396703
846.3H76965940J998961J384616L53932q60989j876294k876163m135728n704641p751286
864.7H57498348j0269523j2720048j4188707j3715327j1058927p298767l940821j902640
$$ plain form
732.1 865392983 869203925 872467279 874974132 876618028 877578676 878392100 879512787 880897284 882284045
750.5 882284045 883356452 884013832 884788513 885986984 887122452 887997389 888660669 889239728 889957011
768.8 889957011 890587628 891021788 891346931 891502261 891732752 892457068 893500924 894247234 894466639 894417048
789.2 894417048 894455254 894721091 895008683 895124614 895167887 895310760 895533979 895637512 895498514 895263672
809.6 895263672 895087123 894946873 894795597 894396365 893478453 892109752 890497565 888517261 885760307
828 885760307 882277310 878516555 874877810 871950567 870385647 870509505 872146785 874569237 876965940
846.3 876965940 878964901 880349517 880703449 879842460 877966166 875090003 870954275 865249634 857498348
864.7 857498348 847228825 834508777 820320070 806604743 795545816 788247049 784306228 782403588
881G82403588j867830l961921p420600j1622548j6192555j9887448k0649671j7202497
897.3F83598518j0350227k456665M524410R712279J2830257J4041722J3688743J2176871
913.6G37765908J0143459Q397222P509648P375360P468343P431447O893873N840958
930G98826218M559755K939582J065314o88017k364218m180610n920768p254481p935047
948.3G79047728p497251n768478l294945j094818l86656j934588n689084j1022449
964.6G42359459j6603648k0810485k2776306k2721469k1463514j9837737j8290519
978.9E99855781j6794503j5409947j4135062j2626648j1199832j0630906j1303365
993.2E07755518j3414621j6575158j9539624k1274329k1769196k1534532k0761341
$$ plain form
881 782403588 780535758 776573837 769153237 757530689 741338134 721450686 700801015 683598518
897.3 683598518 673248291 670791626 675316036 685028315 697858572 711900294 725589037 737765908
913.6 737765908 747909367 756306589 763816237 771191597 778659940 786091387 792985260 798826218
930 798826218 803385973 806325555 807390869 806702852 804338634 800158024 794237256 786982775 779047728
948.3 779047728 771550477 765781999 762487054 761392236 761005580 759070992 753381908 742359459
964.6 742359459 725755811 704945326 682169020 659447551 637984037 618146300 599855781
978.9 599855781 583061278 567651331 553516269 540889621 529689789 519058883 507755518
993.2 507755518 494340897 477765739 458226115 436951786 415182590 393648058 372886717
1007.4C72886717j9542813j8137366j6489237j4574975j2619436j0612011q483469
1021.7B72427410o368816m290491k011210P65204L959298O886781Q868873R731024
1038B89968073R733618R413182R513349J0333866J1767625J3701588J5833766J7841339
1054.4C88106406J9173652J9206881J7835289J5483350J3066322J1712640J1820018
1068.6D96404558J2893767J4089703J4803410J5040815J5043020J5018940J5065372
1082.9E98359585J5274226J5716970J6211808J6386807J5997648J5010298J3308346
1097.2G06265688J0879457Q094430N317271K854228R68158m29511j479507k173900
1113.5G30296314k605319k854288k636850j598298K25842K542555M959106P105530
$$ plain form
1007.4 372886717 353343904 335206538 318717301 304142326 291522890 280910879 272427410
1021.7 272427410 266058594 261768103 259756893 260522097 264481395 271368176 280237049 289968073
1038 289968073 299701691 309114873 318628222 328962088 340729713 354431301 370265067 388106406
1054.4 388106406 407280058 426486939 444322228 459805578 472871900 484584540 496404558
1068.6 496404558 509298325 523388028 538191438 553232253 568275273 583294213 598359585
1082.9 598359585 613633811 629350781 645562589 661949396 677947044 692957342 706265688
1097.2 706265688 717145145 725239575 730556846 733411074 734379232 733949721 732470214 730296314
1113.5 730296314 727690995 724836707 722199857 720601559 720827401 723369956 728329062 735434592
1129.8G35434592Q459031Q592725P746697O260633M161775J371861k247334o334245
1146.1G63445735r914815j2108267j2411654j0836899p915080m340410p06792K499521
1162.4G07711339M903376O300032O912351P278144P580996P774651P623136O795585
1178.8G62879610N204141K555967j550436p102550j3883292k1983624l1290173m0693701
1195.1F54135942m8645019n3557277n3911418m9171090m0535509l0263067k0316749
1209.4C57735813j1795134n077123j87874L038913M961669N988986O439358O775528
1225.7C67880136P560670R149879J1382878J3921946J6392410J8412561K0023167K1220117
1242D85943764K1823436K2076130K2368193K2596717K2608697K2441566K2119880K1719158
$$ plain form
1129.8 735434592 743893623 752486348 760233045 766493678 770655453 772027314 769779980 763445735
1146.1 763445735 753530920 741422653 729010999 718174100 710259020 705918610 705211818 707711339
1162.4 707711339 712614715 718914747 725827098 733105242 740686238 748460889 756084025 762879610
1178.8 762879610 768083751 770639718 769089282 761986732 748103440 726119816 694829643 654135942
1195.1 654135942 605490923 551933646 498022228 448851138 408315629 378052562 357735813
1209.4 357735813 345940679 340863556 340675682 343714595 348676264 354665250 361104608 367880136
1225.7 367880136 375440806 384590685 395973563 409895509 426287919 444700480 464723647 485943764
1242 485943764 507767200 529843330 552211523 574808240 597416937 619858503 641978383 663697541
1258.3F63697541K1254122K0544112J9628107J8771053J8012285J7341912J6585886
1272.6G95835018J5519142J4291764J3038992J1665106J0137379Q599103P288337O266296
1288.9H82641137N510628M960835M573405M179775L462196K510965J504600M12941
1305.2I09756482o31631j436353j981437k151966j896977j370251o11544K89082J025439
1323.6I00990844J529634J921475K130687K044320J642466J132011O24776J38223m30286
1341.9I11724150j368761k709329m655123p695615j2253702j8718540k6233674l2064020
1358.2H06025386l4658313l2897472k3439706j0593831q20220N835057J0074257J2774229
1374.5G32299387J3189435J3220549J4929891J7074406J8549323K0324826K0293176
$$ plain form
1258.3 663697541 684951663 705495775 725123882 743894935 761907220 779249132 795835018
1272.6 795835018 811354160 825645924 838684916 850350022 860487401 869086504 876374841 882641137
1288.9 882641137 888151765 893112600 897686005 901865780 905327976 907838941 909343541 909756482
1305.2 909756482 909124851 907688498 905707061 903555095 901658118 900287867 899676323 899965405 900990844
1323.6 900990844 902520478 904441953 906572640 908616960 910259426 911391437 912016213 912154436 911724150
1341.9 911724150 910355389 907646060 902990937 895295322 883041620 864323080 838089406 806025386
1358.2 806025386 771367073 738469601 715029895 704436064 703615844 709450901 719525158 732299387
1374.5 732299387 745488822 758709371 773639262 790713668 809262991 829587817 849880993
1388.8H49880993J6461671J3230383J1374176Q463919N475163L135205J141905k6285
1405.1I09137130o12855j160920j650154k005101k400219k966762l355622k940238
1421.5H92045259k645730k544642k098918j511455m07099Q76069K236068L799617M050792
1439.8H93799961L855168L732264L412247L167093K796829K163768J588940J877844
1456.1I16394114L404439L772974L347576L721118M221141L757715L249705L645241
1472.4I45514023L792346K973735K249897J733482J294851P69079K67922J19806N77867
1490.8I59293008P47740K94626l9935O9558J92225J4067p01308j297474l0696N98669
1511.2I59140480J85012k57432k87056j02520J2279J37269L5286j3649j1683k69234
$$ plain form
1388.8 849880993 866342664 879573047 890947223 899411142 904886305 908021510 909163415 909137130
1405.1 909137130 908524275 907363355 905713201 903708100 901307881 898341119 894985497 892045259
1421.5 892045259 889399529 886854887 884755969 883244514 882837415 883713484 885949552 889749169 893799961
1439.8 893799961 897655129 901387393 904799640 907966733 910763562 912927330 914516270 916394114
1456.1 916394114 919798553 923571527 926919103 930640221 934861362 938619077 941868782 945514023
1472.4 945514023 949306369 952280104 954530001 956263483 957558334 958327413 958595335 958715141 959293008
1490.8 959293008 960040748 960335374 960295439 960364997 960557222 960571289 959869981 958572507 958541811 959140480
1511.2 959140480 959325492 959068060 958781004 958678484 958690763 958828032 958863318 958849669 958837986 958568752
1531.6I58568752l25978J09196P8678n62489p44820q3089K77102J8835k81453k13265
1552I56841469j66714l29078m65572K84195P95961M44531J94907P3672J23560J93715
1572.4I57990646j65224n08606k47657j29223l97504n90145p00474q04186r40263j066804
1592.8I52440560j199365j438141j685440j956880k138257k330125k680480k981782
1609.1I36030090k990842k834141l032208l563583l024935k500654k725780k379536
1625.4I12978411j778603j408577j033664r30130r81033l26991K05874J89782J44243
1643.7I07059312K27153Q20577J024545R59694J871824K206385J696408J393080J337647
1662.1I18596625J347959J030267N94914N48362M98891J49250k63393o30617j110315
$$ plain form
1531.6 958568752 958242774 958351970 958430648 957868159 957123339 957040250 957317352 957336187 957054734 956841469
1552 956841469 956674755 956345677 955880105 956164300 956960261 957404792 957599699 957673371 957796931 957990646
1572.4 957990646 957825422 957316816 957069159 956939936 956542432 955952287 955251813 954447627 953507364 952440560
1592.8 952440560 951241195 949803054 948117614 946160734 944022477 941692352 939011872 936030090
1609.1 936030090 933039248 930205107 927172899 923609316 920584381 918083727 915357947 912978411
1625.4 912978411 911199808 909791231 908757567 907827437 906846404 906519413 906725287 906915069 907059312
1643.7 907059312 907286465 908107042 909131587 910091281 911963105 914169490 915865898 917258978 918596625
1662.1 918596625 919944584 920974851 921569765 922118127 922617018 922766268 922502875 921872258 920761943
1680.5I20761943j822353k507209k255500k432584l352523l789127n484402p452309
1696.8H91665936q559585j1798084j2053430j3670325j8549919k1028459k3245395
1711.1G82760739k6264906l0343592l7011027l5284698k5344193k1122873j8714964
1725.3E88674486j4091850j0168969o458581k922654P48396L404498O118000Q462846
1741.6E73766172R559274J0737478J2154758J5339077J8934965K0494044K4736464
1755.9F85722232L0852198L3972323L8330675L6137223K8763950K4199664J9347906
1770.2H97326171J5710533J1948049P977128O073535N232751M260659L568292K999127
1786.5I55096245K300322J775861J922905J846075J340211J113653J090765J267731
$$ plain form
1680.5 920761943 918939590 916432381 914176881 911744297 908391774 904602647 899118245 891665936
1696.8 891665936 883106351 871308267 859254837 845584512 827034593 806006134 782760739
1711.1 782760739 756495833 726152241 689141214 653856516 628512323 607389450 588674486
1725.3 588674486 574582636 564413667 557955086 555032432 555780828 559185326 565303326 573766172
1741.6 573766172 583325446 594062924 606217682 621556759 640491724 660985768 685722232
1755.9 685722232 716574430 750546753 788877428 825014651 853778601 877978265 897326171
1770.2 897326171 913036704 924984753 932961881 939035416 944268167 948528826 952097118 955096245
1786.5 955096245 957396567 959172428 961095333 962941408 964281619 965395272 966486037 967753768
1802.8I67753768J171768R32574P36713Q69453R99809Q54790O38783P22289P74264
1821.2I75454211L96312K55644L87132N31614N93841M82201K47896K82526L24130J03772
1841.6I79059279l0458J20819L22520L88027L80396J10269p0751m4286N5313R1970
1862I80383098j0967k14338k54274J38045L92794L11673J55926R3102O139k0146K7776
1884.4I81008828l2127j52827o4134J12831N6506N841k9564p7307j15156j51933j94728
1906.8I80366230j82509m9472K6285q9347j84417q9407q5890q2850L2484P8797N1141
1929.3I79791045K861l4928p272k6941j94907k48790j7882J44542M8279J9849P2121
1951.7I79547977M4108J3292Q9824J36733N7518p74l7790j9431J02818J93656J53064
$$ plain form
1802.8 967753768 968925536 969858110 970594823 971464276 972464085 973318875 973957658 974679947 975454211
1821.2 975454211 975850523 976106167 976493299 977024913 977618754 978100955 978348851 978631377 978955507 979059279
1841.6 979059279 979028821 979149640 979472160 979860187 980240583 980350852 980280101 980235815 980291128 980383098
1862 980383098 980372131 980157793 979903519 980041564 980434358 980746031 980901957 980995059 981001198 980981052 981008828
1884.4 981008828 980976701 980823874 980759740 980872571 980929077 980934918 980905354 980828047 980712891 980560958 980366230
1906.8 980366230 980183721 980134249 980160534 980071187 979886770 979797363 979711473 979628623 979661107 979739904 979791045
1929.3 979791045 979793906 979758978 979751706 979724765 979529858 979281068 979263186 979407728 979456007 979475856 979547977
1951.7 979547977 979592085 979605377 979695201 979831934 979889452 979888678 979850888 979831457 979934275 980127931 980280995
1974.1I80280995N3406J6511O6578N7518m112K3603N9426K9564j5616k8968k0147J9014
1998.6I80537772L3796K2948J8835o7413j50740j10507p7367j14620q7321K5094O8605
2021I80099082J6332r179m2797j04487r9897m6611L5584R0599m410j30237j01268j0431
2045.5I79692280M0651L5166k026K4915R1791O3359n4776j16050j13070o7354L4094
2067.9I79628980J9491o4075j4603K3007o1691j55270j79887j27077q2194p7963l9399
2090.4I78869319k0027n9545j35720j79291j02043l8505j10507j94907j65522j22189
2110.8I77741063j23144p0869N1200J11520J9431o7949m113P2956Q7321J31428R0242
2133.2I78039086k8074k0146Q4459J26124Q7619R6023J38044P8857j2040M8995J93894
$$ plain form
1974.1 980280995 980334401 980350912 980417490 980475008 980470896 980494499 980553925 980583489 980567873 980538905 980518758 980537772
1998.6 980537772 980571568 980594516 980613351 980545938 980395198 980284691 980207324 980092704 980005383 980030477 980099082
2021 980099082 980115414 980106235 980063438 979958951 979859054 979812443 979848027 979938626 979934216 979803979 979702711 979692280
2045.5 979692280 979732931 979768097 979766071 979790986 979882777 979946136 979891360 979775310 979662240 979594886 979628980
2067.9 979628980 979648471 979584396 979569793 979592800 979531109 979375839 979195952 979068875 978986681 978908718 978869319
2090.4 978869319 978849292 978789747 978654027 978474736 978372693 978334188 978223681 978028774 977863252 977741063
2110.8 977741063 977617919 977547050 977598250 977709770 977729201 977661252 977657139 977730095 977817416 977948844 978039086
2133.2 978039086 978011012 977990866 978075325 978201449 978289068 978385091 978523135 978601992 978589952 978638947 978832841
2155.6I78832841K81572K09451K4974L2425J46806P1347M5002J54376J21295P9394
2176I79999483J07884P7903R4116J69396J62006J20103P9811P093k5392k9862J5378
2198.5I80777919R1970O8605j132j4425N067N8710Q6248M7028J3829m6492m0650O1988
2222.9I81108665P7606N0485J00434J03295n6506j81973j17004L517R6619J11878K7001
2245.4I81324017J4663P510r0301r4652l8386k6226L398K6047L2425Q3148M3512r2566
2269.8I81192589p2241P8857J48237M7266j15096r1255N7042P5221L4511J18136J86861
2292.3I81660128K8073j57177j19209l219N6565P6949L0756m6372q7857q6367k8015
2314.7I81324255Q2732J36316P2360M112m6193j8239Q2969J45316K40982J96219j6630
$$ plain form
2155.6 978832841 979114413 979323864 979348838 979381263 979528069 979599416 979644418 979798794 979920089 979999483
2176 979999483 980107367 980185270 980279386 980448782 980610788 980730891 980810702 980817795 980792403 980762541 980777919
2198.5 980777919 980869889 980938494 980937362 980922937 980928004 980986714 981072962 981119990 981133819 981087327 981046677 981108665
2222.9 981108665 981186271 981236756 981337190 981440485 981383979 981202006 981085002 981088519 981185138 981297016 981324017
2245.4 981324017 981338680 981346190 981255889 981161237 981122851 981096625 981100023 981126070 981158495 981241643 981285155 981192589
2269.8 981192589 981120348 981199205 981347442 981394708 981279612 981188357 981245399 981320620 981355131 981473267 981660128
2292.3 981660128 981688201 981531024 981411815 981408596 981465161 981542110 981572866 981526494 981438637 981352270 981324255
2314.7 981324255 981406987 981543303 981615663 981619775 981573582 981555343 981638312 981783628 982024610 982220829 982204199
2337.1I82204199j94609k86877k04862j69575j17600J10209J93417K9385o3657j6153
2357.5I81483877N603J18553J64449q1598k66970k29060j66595L6299J90914K4140
2377.9I81279612m2260J56820J81496Q762k2769L3200K7597P74l7372o1393m0888r4891
2402.4I81388688k01881j30117M4823Q8334P75o497L2067l8028q8810l0935P6115N2035
2426.9I81186569l6419M1485J39356N901j78993p9393J04486O0559n1260o8963j01924
2449.3I81021404j11043n5611k4140j3828l0160L4153J00315p16p1466n2332l7790
2471.7I80758786l4928n1975L8266J47760R2208l6776j44243j14024L2485Q7201J5319
2494.2I80790079o8128o8844N1618J23918M6730L4511O8843n364n2154l4094m9889
$$ plain form
2337.1 982204199 982009590 981722713 981517851 981348276 981230676 981340885 981534302 981563687 981500030 981483877
2357.5 981483877 981489480 981608033 981772482 981690884 981423914 981194854 981028259 981064558 981255472 981279612
2377.9 981279612 981237352 981394172 981575668 981584430 981561661 981594861 981622458 981623232 981585860 981524467 981483579 981388688
2402.4 981388688 981186807 981056690 981101513 981189847 981190622 981184125 981216192 981178164 981089354 981058419 981134534 981186569
2426.9 981186569 981150150 981191635 981330991 981336892 981157899 981078506 981182992 981243551 981192291 981123328 981021404
2449.3 981021404 980910361 980854750 980830610 980816782 980786622 980820775 980921090 980920374 980848908 980796576 980758786
2471.7 980758786 980723858 980671883 980710149 980857909 980950117 980913341 980769098 980655074 980687559 980774760 980790079
2494.2 980790079 980721951 980653107 980704725 980828643 980875373 980909884 980978727 980973363 980921209 980887115 980837226
2516.6I80837226J0848N2154m3273l6836L9757N364m1306O080M6372K5511K2948P1108
2541.1I80995953N7697j04189j69813k0504Q5831J9669n3227n1558o1095n1438J2218
2563.5I80659544K5571n3942j03653l636J07050r53j50800j51634j21355m8459N2273
2585.9I80210006K3842q9824j06931j8060K6822k6584l7729M8101O5386k1398p3970
2608.4I79999661p7247p4923m5836j2756l755n4598q6426j1623M1902J8060m2260j07348
2632.8I79542851j54018j49429k8848J20282R6023l4809n9069L6061J16289O5625q047
2655.3I79542911N603K3782r537k5212o199R536J6511l4153q6248n8413p808Q166L5345
2681.8I79414284L0458n4717j00076q3089m1962n0783j11818q1301n1081p5459j8180
$$ plain form
2516.6 980837226 980848074 980900228 980856955 980820119 980859876 980865240 980823934 980830014 980876386 980901897 980924845 980995953
2541.1 980995953 981053650 980949461 980779648 980759144 980844975 980864644 980811417 980759859 980698764 980647326 980659544
2563.5 980659544 980685115 980631173 980527520 980523884 980630934 980629981 980479181 980327547 980206192 980157733 980210006
2585.9 980210006 980233848 980144024 980037093 980019033 980045855 980019271 979981542 980029643 980095029 980073631 979999661
2608.4 979999661 979922414 979847491 979801655 979788899 979785144 979730546 979644120 979632497 979674399 979692459 979650199 979542851
2632.8 979542851 979388833 979239404 979210556 979330838 979426861 979392052 979332983 979369044 979485333 979550958 979542911
2655.3 979542911 979548514 979572296 979562759 979537547 979531348 979540884 979557395 979523242 979436994 979378581 979370773 979378939 979414284
2681.8 979414284 979444742 979390025 979289949 979206860 979164898 979114115 979002297 978920996 978869915 978794456 978776276
2704.2I78776276J6630k8789q1480p7426J0609L58n1320j5020k5928p7426m0174Q285
2728.7I78414595n0604o2049P272L3081L218k086O0559R477r5368q285J09434P1645
2753.2I78490889P15Q226J9371o4611j33276p7248j609J9133k9027j10448j17779n8949
2777.6I77945387k3961l4392p5340j69039k02059r2090p7843j30713o3479o139J78
2800.1I77070510l2007j28091j76549j60336j20759j3471R418j02163j19865j13606
2820.5I76113081j94669k55167k56539k14696j81019k48790l51131l50177m26650o66678
2840.8I72967565q51750r97782j095533r09746n01096j60516p6890k64108l87251k72095
2861.2I67450798k24472l51846m23550m08769m40359m60029l49819k12193k16603k43604
$$ plain form
2704.2 978776276 978792906 978764117 978682637 978605211 978615820 978616178 978564858 978549838 978523910 978446484 978406310 978414595
2728.7 978414595 978363991 978301942 978309214 978342295 978345513 978343427 978403986 978413463 978318095 978309810 978419244 978490889
2753.2 978490889 978491604 978499830 978519201 978454590 978321314 978244066 978242457 978261590 978232563 978122115 978004336 977945387
2777.6 977945387 977921426 977887034 977811694 977642655 977440596 977348506 977270663 977139950 977076471 977070332 977070510
2800.1 977070510 977038503 976910412 976733863 976573527 976452768 976439297 976448715 976346552 976226687 976113081
2820.5 976113081 975918412 975663245 975406706 975192010 975010991 974762201 974411070 974060893 973634243 972967565
2840.8 972967565 972115815 971118033 970022500 969112754 968611658 968451142 968374252 968110144 967722893 967450798
2861.2 967450798 967226326 966874480 966450930 966042161 965601802 965141773 964791954 964579761 964363158 964119554
2881.6I64119554k02299k03013j54018l7790n7220j69933j76728r4652k5272k5392
2902I62973237j03950j91033k61665l97026n42939n31197l34501j34587j17123j28091
2922.4I60231125m5836J6928q404j70767l53635m33266l96430k20061N6923L02970
2942.8I58979547L74496L20494K67446K11835J80900J89841J66893J96874L38078M62889
2963.2I61689293O09816Q97943J193822J285791J160860R18210O60777N46336N25415
2981.6I69488263L84689L08513L92437K92122J85133L08811L16680J95324J71781K37822
3002I72281575K64824J88768Q3208M3153R2447R6798M3035N603L8147J28746J13666
3024.4I73379970M3571N0604P6890R3460J45257K12430J97411P3671K0504P0692N0246
$$ plain form
2881.6 964119554 963917255 963714242 963560224 963522434 963465214 963295281 963118553 963023901 962998629 962973237
2902 962973237 962869287 962678254 962416589 962019563 961476624 960945427 960610926 960476339 960359216 960231125
2922.4 960231125 960185289 960202217 960193813 960023046 959669411 959236145 958839715 958619654 958676577 958979547
2942.8 958979547 959354043 959674537 959941983 960153818 960334718 960524559 960691452 960888326 961226404 961689293
2963.2 961689293 962299109 963197052 964390874 965676665 966837525 967755735 968416512 968962848 969488263
2981.6 969488263 969872952 970181465 970573902 970866024 971051157 971359968 971676648 971871972 972043753 972281575
3002 972281575 972546399 972735167 972818375 972861528 972953975 973050773 973093808 973099411 973137558 973266304 973379970
3024.4 973379970 973423541 973474145 973551035 973644495 973789752 974002182 974199593 974273264 974293768 974364460 974414706
3046.8I74414706j9490m9472K6524J64747J40011K5273l5346j46151j92642o9022N2214
3069.2I74311352J13547J08718M3214k265m4584r3401p4983j4424J729k1398j06037
3091.7I74221468j99080j12831O4075J05321J9014p8916p7546L1590N0307p4983j41740
3114.1I73806679j55806j59622o6101J3769k2233p5877j00374j80542k57194j14680
3134.5I72688019J16587J21057k1935j19209j44243j53124k17796k51770j60336r3282
3154.9I71763968j38998j63435j88411k12371j15216J79n0902k15412k41816j26779
3175.3I70310807r7394j79291k09212j71602j41680j15216j41203j90079k02477j59383
3195.7I68703270o1512p1049j96099l06487l70205l27587k22385j57654j30713j22189
$$ plain form
3046.8 974414706 974395216 974345744 974372268 974537015 974677026 974702299 974666953 974520802 974328160 974259138 974311352
3069.2 974311352 974424899 974533617 974576831 974574566 974529982 974436581 974361598 974347174 974348903 974327505 974221468
3091.7 974221468 974022388 973909557 973973632 974078953 974097967 974019051 973941505 973973095 974023402 973948419 973806679
3114.1 973806679 973650873 973491251 973425150 973438919 973416686 973340809 973240435 973059893 972802699 972688019
3134.5 972688019 972804606 972925663 972903728 972784519 972640276 972487152 972269356 972017586 971857250 971763968
3154.9 971763968 971624970 971461535 971273124 971060753 970945537 970945716 970894814 970679402 970437586 970310807
3175.3 970310807 970213413 970034122 969824910 969653308 969511628 969396412 969255209 969065130 968862653 968703270
3195.7 968703270 968641758 968570709 968374610 968068123 967697918 967370331 967147946 966990292 966859579 966737390
3216.1I66737390j25766j09256q6188j45972k22802k05099j65761j64986j62005j03414
3236.5I65246141n3644j21832k89500l77893j74344M0650m2736j30415j17421j44601
3256.9I63834405j79589k16901j72019o1274p1645j65641j87754p5281Q5711R2566
3277.3I62882578o4969k31564k47240m8995N1856r2387j75834j52528j31905j04487
3297.7I61684525n9307j7345l0815l040K7299j43886k58624q5652J3113p8619j26898
3320.1I60920751j80900j96040p8976p0751k04443k41995j43051q7262k09152l69013
3340.5I59139168l29613r4653P4149k4856k18510k42353j57237j01268j50383k48432
3360.9I57646012k17378j49429j84297k61247k28823j23024j88171k85984k08854j33634
$$ plain form
3216.1 966737390 966611624 966502368 966416180 966270208 966047406 965842307 965676546 965511560 965349555 965246141
3236.5 965246141 965192497 965070665 964781165 964403272 964228928 964269578 964226842 964096427 963979006 963834405
3256.9 963834405 963654816 963437915 963265896 963204622 963132977 962967336 962779582 962704301 962790012 962882578
3277.3 962882578 962817609 962586045 962338805 962289810 962341666 962249279 962073445 961920917 961789012 961684525
3297.7 961684525 961625218 961607873 961577058 961574018 961601317 961457431 961198807 961113155 961126268 961047649 960920751
3320.1 960920751 960739851 960543811 960464835 960394084 960189641 959947646 959804595 959717333 959508181 959139168
3340.5 959139168 958809555 958714902 958789051 958764195 958545685 958303332 958146095 958044827 957894444 957646012
3360.9 957646012 957428634 957279205 957094908 956833661 956604838 956481814 956293643 956007659 955798805 955665171
3381.3I55665171j63197j64748m4047j8299k03192k60294r9778L576l7193j98126k97427
3403.7I54182446j80006j68800k35021j29343o9856q7619j38760j86622j52409o7294
3424.1I52766716j013j49250l60727l22580j20521L6657P3135K2411l6716j82271k86520
3446.5I51439321q4758O3837L0875K3425q0228k11597j98543q0466m2081q4340o7831
3469I50707614n6386q344J11699J96814K23220J93596J09791P3433J33217J66178J63137
3491.4I52013969J14680N7399J54197K39432J78635K12670K75313J56939J54853L17097
3511.8I53875184L49104K63155J47045R0062P2778J72019L48687K95341K59936L16143
3532.2I56189454K27391K13862K39312J76490J24812L278J21415N20170N11467L03686
$$ plain form
3381.3 955665171 955501974 955337226 955293179 955274880 955071688 954811394 954711616 954715192 954677999 954479873 954182446
3403.7 954182446 954002440 953833640 953598619 953469276 953399420 953311801 953173041 952986419 952834010 952766716
3424.1 952766716 952765703 952616453 952255726 951933146 951812625 951849282 951922417 951944828 951908112 951725841 951439321
3446.5 951439321 951354563 951418400 951449275 951472700 951392472 951180875 950982332 950901866 950859785 950775445 950707614
3469 950707614 950651228 950642884 950754583 950951397 951174617 951368213 951478004 951551437 951684654 951850832 952013969
3491.4 952013969 952128649 952186048 952340245 952579677 952758312 952970982 953246295 953403234 953558087 953875184
3511.8 953875184 954224288 954487443 954634488 954724550 954797328 954969347 955318034 955613375 955873311 956189454
3532.2 956189454 956416845 956630707 956870019 957046509 957171321 957174599 957296014 957816184 958327651 958631337
3552.6I58631337L75032L82781J53363M8160J43111J24514Q4043L69370O18100N09501
3573I61439312K80797K17140L70383M96507K56002k31505k19464M58717O62387L84390
3593.4I64114666K93493L18587K91526L45946L53038K06351J15753J99854K42948K86639
3613.7I66768801L44217K68042M74870P75516O41764K43246m8160M17471R72151R77576
3634.1I71835494P49826N14925M88281N60045M05014K980l2186Q11159J199663P99656
3654.5I77334857O16908P61926O48856N15283O34849N18858Q2195m1723P3611J71423
3674.9I81317043O27458P56860N68748M55856J91987j77980k38538K38538M60863L56376
3695.3I84557211L26991K06650J36018K41637R1672k42651l96907k90334M4226K28107
$$ plain form
3552.6 958631337 959006369 959389150 959542513 959590673 959733784 959858298 959942341 960311711 960929811 961439312
3573 961439312 961720109 961937249 962307632 962804139 963060141 962828636 962609172 963067889 963730276 964114666
3593.4 964114666 964408159 964726746 965018272 965364218 965717256 965923607 966039360 966239214 966482162 966768801
3613.7 966768801 967113018 967381060 967855930 968631446 969273210 969516456 969468296 969885767 970857918 971835494
3634.1 971835494 972585320 973100245 973588526 974148571 974553585 974556565 974524379 975335538 976535201 977334857
3654.5 977334857 977951765 978713691 979362547 979877830 980512679 981031537 981113732 981072009 981145620 981317043
3674.9 981317043 981944501 982701361 983270109 983725965 983917952 983739972 983501434 983739972 984200835 984557211
3695.3 984557211 984884202 985090852 985226870 985468507 985560179 985317528 984920621 984630287 984674513 984902620
3715.7I84902620Q2195j51276k39194l6836L21389L95119m530n84662p85410k04504
3736.1I83694911M16040L68834j09494m07398J36436K80082j87457j2815L75331K69651
3756.5I84824121J33157K05576J94252J11580J27673Q1002O7890J26839Q166k02537
3776.9I85677719j92582M2617K2232n5790N4181O6459J22547J19806j70172k68757
3797.3I85418260j5139J59382J69099J13010J47045J92940k503l45648n60641l87609
3817.7I84888196k34365M7743M44352K53022l4988q9705j41322r2984l0934r5606J5795
3840.1I84929204J56283K09928K20358J1623l33309o71625l76999L52144L68654N7936
3860.5I84924197j02520J25647L27170k4319l27945k5213K15412P9393k38657l12924
$$ plain form
3715.7 984902620 984984815 984833539 984594345 984557509 984878898 985274017 985269487 984684825 983899415 983694911
3736.1 983694911 984110951 984479785 984370291 983962893 984099329 984379411 984191954 984179139 984554470 984824121
3756.5 984824121 984957278 985162854 985357106 985468686 985596359 985677361 985745251 985872090 985880256 985677719
3776.9 985677719 985485137 985527754 985549986 985494196 985548377 985614836 985737383 985857189 985687017 985418260
3797.3 985418260 985403121 985562503 985731602 985844612 985991657 986184597 986182094 985836446 985275805 984888196
3817.7 984888196 984653831 984701574 985145926 985398948 985363960 985274255 985132933 985039949 985009015 984913409 984929204
3840.1 984929204 985085487 985295415 985515773 985527396 985194087 984522462 984145463 984497607 984866261 984924197
3860.5 984924197 984821677 984947324 985274494 985250175 984922230 984897017 985112429 985191822 984953165 984640241
3880.9I84640241o5387J69695L78847R7513k71797M4525J87277k35140m87327m25101
3901.3I84033346j68085M07875O78599M42922J60515r5964k89499k65479j15514n8413
3921.7I84730303m828K61665L12388r0540k93374m4286J73747K19882J04904j07109
3942.1I85262752j76132k43366j60158L36469N25593J37389j43409p8380j2994n3227
3962.5I85394537j27852j75535m9472J36316J92404J88350L6061k54512j79708J53959
3982.9I85314548J77026l278j00375j29819q4281M9770R0838
3997.1I85314429
$$ plain form
3880.9 984640241 984574854 984744549 985123396 985220909 984949112 984993637 985180914 984945774 984458447 984033346
3901.3 984033346 983865261 984273136 984951735 985394657 985555172 985459208 985169709 984904230 984788716 984730303
3921.7 984730303 984725475 984987140 985299528 985208988 984915614 984871328 985045075 985264957 985369861 985262752
3942.1 985262752 985086620 984843254 984683096 985019565 985545158 985682547 985539138 985460758 985447764 985394537
3962.5 985394537 985266685 985091150 985041678 985177994 985370398 985558748 985594809 985340297 985160589 985314548
3982.9 985314548 985491574 985488296 985387921 985258102 985173821 985223591 985314429
3997.1 985314429
##END=$$ End of the data block
