##TITLE=P3 $$ Begin of the data block
##JCAMP-DX=5.00 $$ ACD/SpecManager v 10.08
##SPECTROMETER/DATA SYSTEM=Alpha
##DATE=26 Feb 2015 09:50:54
##DATA TYPE=INFRARED SPECTRUM
##DATA CLASS=XYDATA
##ORIGIN=
##OWNER=
##NPOINTS=1667
##FIRSTX=599.57470703
##LASTX=3997.16503906
##MAXX=3997.16503906
##MINX=599.57470703
##MAXY=0.98752499
##MINY=0.19937599
##XFACTOR=1.0000000000
##YFACTOR=1.000000000000000e-9
##FIRSTY=0.50468606
##DELTAX=2.03937006
##XUNITS=1/CM
##YUNITS=ARBITRARY UNITS
##XYDATA=(X++(Y..Y))
599.6E04686058K4139R331465J7884851K2809565K3360133K0689487J6422034J2417972
$$ 504686058 504710197 514041662 531926513 554736078 578096211 598785698 615207732 627625704
615.9F27625704R777188Q249223P005334O334245O723345P262051O696820N418182
$$ 627625704 637402892 645652115 652657449 658991694 665715039 672977090 679673910 685092092
632.2F85092092M159092L011048K314985K388835K915680M075885N862177P149219
$$ 685092092 689251184 692262232 694577217 696966052 699881732 703957617 709819794 716969013
648.5G16969013O844759N238712M326284M822016N780637O236434N758703M395663
$$ 716969013 723813772 729052484 733378768 738200784 743981421 750217855 755976558 760372221
664.8G60372221L010929J570165L01779j27912j81258J63257O38247J047015J370907
$$ 760372221 763383150 764953315 765255094 765127182 764945924 765109181 765747428 766794443 768165350
683.2G68165350J464069J512229J927495K653659L349602L806054L798008L559649
$$ 768165350 769629419 771141648 773069143 775722802 779072404 782878458 786676466 790236115
699.5G90236115L592551L791154L899693M013062L979325L576755L032625K439797
$$ 790236115 793828666 797619820 801519513 805532575 809511900 813088655 816121280 818561077
715.8H18561077K086103K443194L365756M312396N117774N592763N455136M819215
$$ 818561077 820647180 823090374 826456130 830768526 835886300 841479063 846934199 851753414
732.1H51753414L911853L172814K635062J906395J330316J301587J384079J354873
$$ 851753414 855665267 858838081 861473143 863379538 864709854 866011441 867395520 868750393
748.4H68750393J362265J290857J139045J182914J258790J012504O52016M93407O98388
$$ 868750393 870112658 871403515 872542560 873725474 874984264 875996768 876648784 877142191 877840579
766.8H77840579R27388P28071M04060K40922K53260L97503M36128M50551M63843L25025
$$ 877840579 878767967 879496038 879900098 880141020 880394280 880791783 881227911 881678462 882142305 882467330
787.2H82467330J33335j50502l19361j69754j43350l76522l33369M5359K74420K14040
$$ 882467330 882600665 882450163 882130802 881961048 881817698 881441176 881107807 881153166 881427586 881641626
807.6H81641626J09554Q2552N9664j8537l13401p65383j125097j377643j802980k606690
$$ 881641626 881751180 881833732 881893396 881874859 881561458 880796075 879670978 878293335 876490355 873883665
828H73883665l413856l762544l554046k804875j505613J79290J697302K578616K807975
$$ 873883665 870469809 866707265 863153219 860348344 858842731 859022021 860719323 863297939 866105914
846.3H66105914K491951J656592L91185q51512j860141l002167m472852o315947q573710
$$ 866105914 868597865 870254457 870645642 869794130 867933989 864931822 860458970 854143023 845569313
864.7H45569313j1126638j3672769j5473723j5349746j2731314q599937m676044k183854
$$ 845569313 834442675 820769906 805296183 789946437 777215123 768615186 763939142 761755288
881G61755288j900494m047633p933318j2665808j7538846k1521032k2666693j9242763
$$ 761755288 759854794 755807161 747873843 735208035 717669189 696148157 673481464 654238701
897.3F54238701j1802614k912223M823983J0265111J3640464J5220642J5022099J3449013
$$ 654238701 642436087 639523864 644347847 654612958 668253422 683474064 698496163 711945176
913.6G11945176J1334837R481787Q441568Q212566Q195341Q046090P562280O549895
$$ 711945176 723280013 732761800 741203368 749415934 757611275 765657365 773219645 779769540
930G79769540N160332L448367J495301n37097k582610m594147o494701p928967q478403
$$ 779769540 784929872 788378239 789873540 789336443 786753833 782159686 775664985 767736018 759257615
948.3G59257615p889748o048441l326595q25822P6234j400530n336702j1196256j7414331
$$ 759257615 751367867 745319426 741992831 741167009 741243243 739842713 734506011 723309755 705895424
966.7G05895424k2125661k4441958k4613440k3413479k1673441k0023227j8509746
$$ 705895424 683769763 659327805 634714365 611300886 589627445 569604218 551094472
980.9E51094472j7057359j5696168j4084458j2394101j1541038j2207955j4548541
$$ 551094472 534037113 518340945 504256487 491862386 480321348 468113393 453564852
995.2D53564852j7862856k0902246k2811443k3462236k3299485k2600740k1316409
$$ 453564852 435701996 414799750 391988307 368526071 345226586 322625846 301309437
1009.5C01309437j9638181j7818928j5848234j3655529j1399194r202913p058859m874661
$$ 301309437 281671256 263852328 248004094 234348565 222949371 213746458 206687599 201812938
1025.8B01812938k436951M63799L783241O889224R034365R937853R996742R942159
$$ 201812938 199375987 199839786 203623027 210512251 219546616 229484469 239481211 249423370
1042.1B49423370J0230765J0907530J2232840J4353931J6658187J8637508J9892276
$$ 249423370 259654135 270561665 282794505 297148436 313806623 332444131 352336407
1056.4C52336407J9813388J8267215J5822708J3473809J2349814J2740791J3939053
$$ 352336407 372149795 390417010 406239718 419713527 432063341 444804132 458743185
1070.7D58743185J5076577J5761674J6095132J6103804J5957057J6061723J6532243
$$ 458743185 473819762 489581436 505676568 521780372 537737429 553799152 570331395
1084.9E70331395J7060935J7467737J7692566J7389536J6269386J4307678J1692822
$$ 570331395 587392330 604860067 622552633 639942169 656211555 670519233 682212055
1099.2F82212055Q760035N847037L215253R99808o69777j699746k338588k896488l273010
$$ 682212055 690972090 696819127 700034380 701034188 700364411 698664665 696326077 693429589 690156579
1117.6F90156579l008723j819611J27256K610445N298793P633388R074569R338796
$$ 690156579 687147856 685328245 685455501 688065946 693364739 700998127 710072696 719411492
1133.9G19411492Q592904P076502M743814J546085k481460o979943j0943055j3344705
$$ 719411492 728004396 735080898 739824712 741370797 738889337 731909394 720966339 707621634
1150.2G07621634j3790965j2327373r235740n233466j116336K474368N072832O650746
$$ 707621634 693830669 681503296 672267556 667034090 665917754 668392122 673464954 680115700
1166.5F80115700P437169P807017Q041203Q228063Q219183P611751N983949L024876
$$ 680115700 687552869 695359886 703401089 711629152 719848335 727460086 733444035 736468911
1182.8G36468911j489758p681191j5405536k4464846l4509837m4569254n3039074n8001459
$$ 736468911 734979153 727297962 711892426 687427580 652917743 608348489 555309415 497307956
1199.2D97307956n7928711n2563578m3263107l2265604k1616876j2562156n465507
$$ 497307956 439379245 386815667 343552560 311286956 289670080 277107924 271642417
1213.4B71642417j77145L514111N829245P037490P511199P962912Q925617J0635972
$$ 271642417 271465272 274979383 280808628 287846118 295357317 303320229 312245846 322881818
1229.7C22881818J3041556J5723765J8211215K0309389K1979481K3098737K3724616
$$ 322881818 335923374 351647139 369858354 390167743 412147224 435245961 458970577
1244D58970577K4030745K4203926K4313927K4317979K4105192K3682355K3239673K2848487
$$ 458970577 483001322 507205248 531519175 555837154 579942346 603624701 626864374 649712861
1260.3F49712861K2326111K1562279K0727217J9950151J9240916J8425584J7338633
$$ 649712861 672038972 693601251 714328468 734278619 753519535 771945119 789283752
1274.6G89283752J6081036J4639437J2977004J1304915R712159Q320928P224619O333113
$$ 789283752 805364788 820004225 832981229 844286144 853998303 862319231 869543850 875876963
1290.9H75876963N611897N124509M679739L919423K949715J862943N76317o41703j567305
$$ 875876963 881488860 886613369 891293108 895212531 898162246 900025189 900601506 899959803 898392498
1309.3H98392498k276599k594232k403617j932025j150906r2805Q56459J601816K202808
$$ 898392498 896115899 893521667 891118050 889186025 888035119 887942314 888798773 890400589 892603397
1327.6H92603397K540827K530694K187669J633943R49621K61545n23150j670897l247261
$$ 892603397 895144224 897674918 899862587 901496530 902446151 902707696 902184546 900513649 897266388
1346H97266388n510271r013176j4369189k1919549l0512333l7149370m0061295l7965655
$$ 897266388 891756117 882742941 868373752 846454203 815941870 778792500 738731205 700765550
1362.3G00765550k7144849j2303353q91089O828010J1685252J4687836J5081287J5098691
$$ 700765550 673620701 661317348 660426259 667254269 678939521 693627357 708708644 723807335
1378.6G23807335J7030477J9564450K1494627K3664057K3553312J9195795J5655458
$$ 723807335 740837812 760402262 781896889 805560946 829114258 848310053 863965511
1392.9H63965511J3510466R921551O280243L529072J332879L934p68006j365006j919985
$$ 863965511 877475977 887397528 893677771 897206843 898539722 898543656 897775650 896410644 894490659
1411.3H94490659k400458k788603l356159l958702l599822l306508l295184k643466
$$ 894490659 892090201 889301598 885945439 881986737 878386915 875080407 871785223 869141757
1427.6H69141757j681983l04580J127959K591669M210651M541695M481316M410624
$$ 869141757 867459774 867155194 868283153 870874822 875085473 879627168 884108484 888519108
1443.9H88519108M105151L827512L291071K558112K056479K469123L851413M058600
$$ 888519108 892624259 896451771 899742842 902300954 904357433 906826556 910677969 914736569
1460.2I14736569L862381M555166N113780M521787M045725M501760M382134L310084
$$ 914736569 918598950 923154116 928267896 932789683 936835408 941337168 945719302 949029386
1476.5I49029386K539277J984477J506150J041233O68467M88102O91712P74920M94063
$$ 949029386 951568663 953553140 955059290 956100523 956768990 957257092 957948804 958723724 959217787
1494.9I59217787K27511J95920K55287J91986j74284o56962p0333M30226K76327r7334
$$ 959217787 959445298 959641218 959896505 960088491 959914207 959257245 959186912 959617138 959893465 959796131
1515.3I59796131k17080m2379j2160j1801O8962Q3566l6657k74599l28958M2558J35660
$$ 959796131 959579051 959536672 959524512 959512711 959581673 959665239 959628582 959353983 959025025 959067583 959203243
1537.7I59203243k36392n57601l73066j42991j19508j81376j71662j80662k72274m45127
$$ 959203243 958966851 958409250 958036184 957893193 957773685 957592309 957420647 957239985 956967711 956522584
1558.1I56522584k04504L05236K73049J96099J04487l6061l1292j66297m86911m45783
$$ 956522584 956318080 956623316 956896365 957092464 957196951 957160890 957129598 956963301 956476390 956030607
1578.5I56030607k72810m38035o48796q55506j009881j088441j241326j514673j831591
$$ 956030607 955757797 955319762 954670966 953815460 952805579 951717138 950475812 948961139 947129548
1596.8I47129548k030254k288103k612829k902031l260315l693282l737450l455937
$$ 947129548 945099294 942811191 940198362 937296331 934036016 930342734 926605284 923149347
1613.2I23149347l820300m759908m023194l195464l511668l153741k414107j948655
$$ 923149347 919329047 914569139 910545945 907350481 903838813 900685072 898270965 896322310
1629.5H96322310j402617j156449j218855n86331R0778K15471K72870M02689R41872
$$ 896322310 894919693 893763244 892544389 891958058 892048836 892264307 892537177 892939866 893881738
1647.8H93881738J215875J338125K067983K101004J727939J647889J726270J619279
$$ 893881738 895097613 896435738 898503721 900604725 902332664 903980553 905706823 907326102
1664.1I07326102J188457Q07643P75218O53982K95520j87278o72936j145184j890481
$$ 907326102 908514559 909322202 910097420 910751402 911046922 910859644 910186708 909041524 907151043
1682.5I07151043l048360l114998l164530m119575m568994o465018q667827j0150432
$$ 907151043 904102683 900987685 897823155 893703580 889134586 882669568 874001741 863851309
1698.8H63851309j4440477j4734447j6720414k2888124k5779546k8096795l1391024
$$ 863851309 849410832 834676385 817955971 795067847 769288301 741191506 709800482
1713.1G09800482l6121071m4233679m1831613k9168546k3813129k0890712j5334070
$$ 709800482 673679411 629445732 587614119 558445573 534632444 513741732 498407662
1727.4D98407662j0565639o235838k775460J321286M939824P880926J0302931J1637152
$$ 498407662 487842023 481606185 478830725 480152011 485091835 492972761 503275692 514912844
1743.7E14912844J2995243J4575004J8076361K2079944K3998738K8852224L5665035
$$ 514912844 527908087 542483091 560559452 582639396 606638134 635490358 671155393
1758F71155393L9075136M3896914M1462660L3323705K8295636K2762537J8403530J3836801
$$ 671155393 710230529 754127443 795590103 828913808 857209444 879971981 898375511 912212312
1774.3I12212312R252370P158577O255031N121350M256546L556788K852321K345145
$$ 912212312 921464682 928623259 934878290 939999640 944256186 947812974 950665295 953010440
1790.6I53010440K361953K181471J723229J509607J417160J481176J344025J220405
$$ 953010440 955372393 957553864 959277093 960786700 962203860 963685036 965029061 966249466
1806.9I66249466J066863J123488J176060J030564Q42690Q80123R18209O84202O24716
$$ 966249466 967316329 968439817 969615877 970646441 971489131 972369254 973287463 973971665 974596381
1825.3I74596381O11365O02007O11305N99265M29869M02927M15385K60234J17838J61708
$$ 974596381 975207746 975809753 976421058 977020323 977450192 977853119 978268504 978528738 978646576 978808284
1845.7I78808284L18110K83360K19345O2764p451K1101J03175J39237O4730o6459j03891
$$ 978808284 979126394 979409754 979629099 979691863 979684412 979705513 979808688 979947925 980012655 979946196 979842305
1868.1I79842305J55151K90215J99080R3996J09673O8664K0862K6107J19n1320P75
$$ 979842305 979997456 980287671 980486751 980580747 980690420 980759084 980779946 980806053 980806172 980754852 980755627
1890.5I80755627M6849p0214m0293J4127l3200j13666j64688k02298k01464j26898
$$ 980755627 980802476 980732262 980691969 980706096 980672896 980559230 980394542 980192244 979990780 979863882
1910.9I79863882m1425l1531j28090j16349k8491J4127j967m2618p2598n0426k5034
$$ 979863882 979822457 979790926 979662836 979546487 979517996 979532123 979530156 979487538 979414940 979364514 979339480
1933.3I79339480J4842J2875j54257k38955o9976J13308P1943K2233J02937J37329
$$ 979339480 979354322 979367197 979212940 978973985 978904009 979017317 979089260 979111493 979214430 979351759
1953.7I79351759K6345J8716J16050O8188L8564N4121O4433J59263K34485J57535O9738
$$ 979351759 979378104 979396820 979512870 979581058 979619622 979673743 979738176 979897439 980131924 980289459 980359197
1976.2I80359197R2387Q6307j9669o9976N245M7446P092P332L5226K0504L7372L1948
$$ 980359197 980451584 980537891 980518222 980448246 980453491 980500937 980508029 980515361 980550587 980571091 980608463 980640411
2000.6I80640411m828j4901m8816j02580j19566r0898r8824j00017l7372j609j4067
$$ 980640411 980635583 980620682 980571866 980469286 980349720 980258822 980159998 980059981 980022609 980021000 980006933
2023.1I80006933m8041n6565K3723Q5592K0444n6922l8922l5941r3401o5684P689M5955
$$ 980006933 979958892 979902327 979926050 980011642 980032086 979975164 979936242 979900301 979806900 979741216 979748905 979794860
2047.6I79794860O3121J7464k5034K0862O2466%o4493o3359r4295j05560q4281n4419
$$ 979794860 979857981 979875445 979850411 979871273 979933739 979933739 979869246 979805887 979711592 979606032 979521751 979467332
2072I79467332M7386R2983j1325j70469k12252j17958j00970j46150r9838p9751j24157
$$ 979467332 979514718 979607701 979596376 979425907 979213655 979095697 978994727 978848577 978748739 978668988 978544831
2094.5I78544831j70648j86503j10924p9095j43826j97411j97232j31428o9737o4016
$$ 978544831 978374183 978187680 978076756 977997661 977853835 977656424 977459192 977327764 977258027 977194011
2114.9I77194011o0022k6285L8981L8564l0636j6392M3929J09970J23501L9816M3810
$$ 977194011 977133989 977107704 977146685 977185249 977154613 977138221 977182150 977292120 977415621 977455437 977499247
2137.3I77499247J76012K27094J87218J61648J36554J10865Q3744J16348K12133K50698
$$ 977499247 977675259 977902353 978089571 978251219 978387773 978498638 978582382 978698730 978910863 979161561
2157.7I79161561J19924k9743R8884K98858K05875L9458K2471K3186J38521L22819
$$ 979161561 979281485 979251742 979350626 979649484 979855359 979894817 979917288 979940474 980078995 980401814
2178.1I80401814L01182J68443J42634J16050K9683N6625P3909l4451j01924M0948
$$ 980401814 980702996 980871439 981014073 981130123 981159806 981216431 981290340 981255889 981153965 981194913
2198.5I81194913K19286J18792k3007k6942l8147O0559J85132J30832J1146r5725j36793
$$ 981194913 981414199 981532991 981509984 981483042 981444895 981505454 981690586 981821418 981832564 981736839 981600046
2220.9I81600046j9789J41502J59085J38104J01447o2347j38104k4259R5129J27673
$$ 981600046 981580257 981721759 981880844 982018948 982120395 982058048 981919944 981895685 981990814 982118487
2241.3I82118487P1764K6524Q4043M2200j38521j57833m9591k9683j2100O4671O9141
$$ 982118487 982190251 982216775 982300818 982343018 982204497 982046664 981997073 981967390 981955290 982019961 982089102
2263.7I82089102K3425J3053J8478N5730P8917q35p9214m1843L696L3378J01805J29282
$$ 982089102 982112527 982125580 982144058 982199788 982278705 982277870 982198656 982156813 982160509 982193887 982295692 982424974
2288.2I82424974J46389J74523J00434j7286l9160m8160p6175N36L8624n5134j18912
$$ 982424974 982571363 982745886 982846320 982829034 982789874 982741714 982665539 982666075 982704699 982649565 982530653
2310.6I82530653m6134J44721K70009K73943J54972j45197l61324j86562J93238L62098
$$ 982530653 982484519 982629240 982899249 983173192 983328164 983182967 982821643 982635081 982828319 983190417
2331I83190417K53201P3910j11342j94847j90557k44379j92463j01089n2631Q9705
$$ 983190417 983443618 983517528 983406186 983211339 983020782 982776403 982583940 982482851 982430220 982519925
2351.4I82519925J65462k2709j69635l6478N3465l636M6432P093j38461j56045m2498
$$ 982519925 982685387 982662678 982493043 982456565 982510030 982506394 982552826 982559919 982421458 982265413 982222915
2373.8I82222915Q3983J07288J01984J03652O9082K7418L993l457K623j9073o0976
$$ 982222915 982306898 982414186 982516170 982619822 982688904 982716322 982720315 982716858 982719481 982700408 982639432
2396.3I82639432n1022n6982o4790l7908r5070j54972j02162R775R0897M2796l2365
$$ 982639432 982588410 982531428 982466638 982428730 982333660 982178688 982076526 982086301 982177198 982219994 982187629
2418.7I82187629l7134j5855O080k563L3438R2983N9784o1214j40488n3704Q2791P7367
$$ 982187629 982150495 982134640 982140720 982138157 982171595 982264578 982324362 982263148 982122660 982068956 982151747 982229114
2443.2I82229114o140k4438n7935j30713j27793K981J10089O2287J5915Q344m1127
$$ 982229114 982222974 982198536 982140601 982009888 981882095 981885076 981995165 982057452 982073367 982081711 982040584
2465.6I82040584j11878j48117p0393L4034M4167O1750Q7023P2658o914j30653p2360
$$ 982040584 981928706 981780589 981710196 981744230 981788397 981850147 981937170 982009828 982002914 981872261 981799901
2488I81799901N0127M3571M2498N3942M6492M1366j5319l8087P6055J25468M590o9976
$$ 981799901 981850028 981893599 981936097 981990039 982036531 982077897 982062578 982024491 982100546 982226014 982230604 982160628
2512.5I82160628m7326m5359L516L1114k8014L8385J58072R1612o2227p2956k1577
$$ 982160628 982113302 982067943 982071459 982102573 982074559 982112944 982271016 982362628 982300401 982227445 982205868
2535I82205868j5617N5731J55627R0659j15991j68681k3007P1287J8299m5598o0737
$$ 982205868 982190251 982245982 982401609 982492268 982376277 982207596 982184589 982255876 982274175 982228577 982167840
2557.4I82167840r3818n7518M7624M5061p6294r2089N5790Q9407m1008q3983m3631
$$ 982167840 982074022 982016504 982064128 982109189 982032895 981940806 981996596 982086003 982044995 981961012 981917381
2579.8I81917381p9453j23322j03473n4300l4809q1480r1851n0068j5914J4782K742
$$ 981917381 981837928 981714606 981611133 981556833 981522024 981440544 981348693 981298625 981282711 981297493 981300235
2602.2I81300235m1366o8724o9022j4901M2021J79m5836J2040j3232q5831l7312l4273
$$ 981300235 981258869 981190145 981121123 981106222 981148243 981148422 981102586 981114626 981101394 981015563 980978251 980943978
2626.7I80943978o6638q0109j54376j47104k265Q5592N3704N722l3200k6226O6757
$$ 980943978 980877340 980797231 980642855 980495751 980493486 980579078 980632782 980638504 980605304 980579078 980645835
2649.2I80645835Q5891o9261j39892j0848J16348J25110M0472n0306l0518L9101l4452
$$ 980645835 980731726 980662465 980522573 980511725 980628073 980753183 980793655 980743349 980712831 980751932 980717480
2671.6I80717480j17957o1632L9518J07467P5460P75l8386j02937j36375q3804q9109
$$ 980717480 980599523 980537891 980577409 980684876 980760336 980761111 980722725 980619788 980483413 980399609 980310500
2694I80310500j24395n8115l0458j04010j03056J8537J25348O3718r8586j74642j41621
$$ 980310500 980186105 980127990 980097532 979993522 979890466 979909003 980034351 980098069 979999483 979824841 979683220
2716.4I79683220m8518m5001j63555j70470K3663J40369L1591k1935J9551k9624n0843
$$ 979683220 979634702 979589701 979426146 979255676 979279339 979419708 979451299 979429364 979448915 979419291 979368448
2738.9I79368448P5698J55866M4346p1049j3828J13130J27256j0848j20223q6427o8009
$$ 979368448 979444146 979600012 979644358 979573309 979559481 979672611 979799867 979789019 979668796 979582369 979514360
2761.3I79514360o5386J1325K4140k3604l1054r3758j50084q7440q8871j40249q1182
$$ 979514360 979448974 979460299 979484439 979460835 979429781 979336023 979185939 979098499 979009628 978869379 978788197
2783.7I78788197o8545j46866j34528j20222j31309p0811k1457l5167j25706k04981
$$ 978788197 978719652 978572786 978438258 978318036 978186727 978115916 978094459 978059292 977933586 977728605
2804.1I77728605k10166j96695j37746o5208n1379k8312Q225j00136k96175l30925
$$ 977728605 977518439 977321744 977183998 977118790 977067411 977039099 977047324 976947188 976651013 976320088
2824.5I76320088k28167j94609j87278j85549l12865m75943o32882q20994r38595j028716
$$ 976320088 976091921 975897312 975710034 975524485 975211620 974735677 974102795 973281801 972343206 971314490
2844.9I71314490j130402j019657p29799n14805m36783n32329o17207m63843l17275
$$ 971314490 970184088 969164431 968434632 967919827 967483044 966950715 966333508 965869665 965552390
2863.3I65552390m48883o18637o10947n89907o00219n29289m08054l28302k50638j76966
$$ 965552390 965103507 964484870 963873923 963284016 962683797 962154508 961746454 961418152 961167514 960990548
2883.7I60990548j81973j48117J2397M3989j12176j50502l6597O5088J6212r1135j33514
$$ 960990548 960808575 960660458 960672855 960716844 960604668 960454166 960417569 960482657 960498869 960407734 960274220
2906.1I60274220k58446l84450m09246m27425l63826k45810j61528n1201n8710k46227
$$ 960274220 960015774 959631324 959222078 958794653 958430827 958185017 958023489 957972288 957913578 957667351
2926.5I57667351l97802n37097p43985q11458o45697m13179j18912J82987L14354L80159
$$ 957667351 957269549 956732452 955988467 955177009 954531312 954118133 953999221 954182208 954496562 954876721
2946.9I54876721L88443K05219M8161J07526J84775J85549K84255N68151R35376J260638
$$ 954876721 955265164 955470383 955518544 955626070 955810845 955996394 956280649 956848800 957784176 959044814
2967.3I59044814J523435J666486J515270J178443R92596Q72136O62446M67121L92079
$$ 959044814 960568249 962234735 963750005 964928448 965921044 966793180 967455626 967922747 968314826
2985.6I68314826M60089M22179K87474K57015K80022L67165M37319M18127L33786J80066
$$ 968314826 968774915 969197094 969484568 969741583 970021605 970388770 970826089 971244216 971578002 971758068
3006I71758068P4684J01447J62781J49250K7835o8068M8041J84834J67787J43170J67966
$$ 971758068 971832752 971934199 972096980 972246230 972274065 972205997 972254038 972438872 972606659 972749829 972917795
3028.5I72917795J82152J74701J89364K16484J89364J30356J30891J53363J25051J08718
$$ 972917795 973099947 973274648 973464012 973680496 973869860 974000216 974131107 974284470 974409521 974518239
3048.9I74518239J14680M9710j4543J5735O7175L1113r6976j02878j4186j7941r477
$$ 974518239 974632919 974682629 974668086 974683821 974750996 974782109 974685133 974582255 974568069 974550128 974540651
3071.3I74540651K9504L0637N2810P4029j0670j15156p9512K3603J4603j22011k22623
$$ 974540651 974570155 974600792 974653602 974727631 974716961 974601805 974522293 974545896 974560499 974438488 974215865
3093.7I74215865j54972j5557O1035M7625j8836m0173k7597o0737j28687j05559k5928
$$ 974215865 974060893 974045336 974106371 974153996 974135160 974094987 974067390 974006653 973877966 973772407 973746479
3116.2I73746479n0486q0764m5836p4744j76370j84536j21713j28209p0811o556j11699
$$ 973746479 973695993 973615229 973569393 973494649 973318279 973133743 973012030 972883821 972813010 972806454 972694755
3138.6I72694755j53840j34706j70947j62243j99616k19942j12235o3777j62661j63973
$$ 972694755 972540915 972406209 972235262 972073019 971873403 971653461 971541226 971477449 971314788 971150815
3159I71150815j10685k33889l05235k16961j56105k25305k49029j10030m2796j25289
$$ 971150815 971040130 970806241 970501006 970284045 970127940 969902635 969653606 969543576 969500780 969375491
3179.4I69375491k04086k00629k26319k83420k76387k27809j67429j44124j75179k53856
$$ 969375491 969171405 968970776 968744457 968461037 968184650 967956841 967789412 967645288 967470109 967216253
3199.8I67216253k99453k83421k93910l07024k75433k40743k49147k25961j82331k46704
$$ 967216253 966916800 966633379 966339469 966032445 965757012 965516269 965267122 965041161 964858830 964612126
3220.2I64612126l12507k32756q7380j03236k97427l62038j97351o6579j26779j79946
$$ 964612126 964299619 964066863 963979483 963876247 963578820 963216782 963019431 962952852 962826073 962646127
3240.6I62646127k09332l06666k05397k9743j14739k18570k13683k46703k13027j14978
$$ 962646127 962436795 962130129 961924732 961894989 961780250 961561680 961347997 961101294 960888267 960773289
3260.9I60773289q3864r6678j05858j21236j26183r8050j49309j95146j43945j19984
$$ 960773289 960689425 960592747 960486889 960365653 960239470 960141420 959992111 959796965 959653020 959533036
3281.3I59533036o7175J6928p9811k60472k45452k11775k13504j12593r4891j35481
$$ 959533036 959465861 959482789 959402978 959142506 958897054 958685279 958471775 958359182 958264291 958128810
3301.7I58128810j30355j92941l07381l58999k10821j2040n6863j06991q8512k97368
$$ 958128810 957998455 957805514 957498133 957139134 956928313 956916273 956859410 956752419 956663907 956366539
3322.1I56366539m59015k25306L9160m5776k79188l85583l12447k18392k78055m16458
$$ 956366539 955907524 955682218 955721378 955675602 955396414 955010831 954698384 954479992 954201937 953785479
3342.5I53785479m41492l71217l55244l05593j48654n2810j76370l29852l74675m73320
$$ 953785479 953343987 952972770 952617526 952311933 952163279 952110469 951934099 951604247 951229572 950756252
3362.9I50756252m95970l59714k69354j81019j36674l54349m89772k71141j57952l43681
$$ 950756252 950260282 949900568 949631214 949450195 949313521 948959172 948469400 948198259 948040307 947696626
3383.3I47696626l60489j43349k14159m14491l14176j55866k24769l62993k98083j63555
$$ 947696626 947336137 947192788 946978629 946564138 946249962 946094096 945869327 945506334 945208251 945044696
3403.7I45044696j40667k52485l94642l36051k03371j82271k07544k56657k88070j64032
$$ 945044696 944904029 944651544 944256902 943920851 943717480 943535209 943327665 943071008 942782938 942618906
3424.1I42618906j04069l25859m30107l15964l07620k65121p3314K0325o3419k68698
$$ 942618906 942514837 942188978 941758871 941442907 941135287 940870166 940796852 940817177 940753758 940485060
3444.5I40485060l75569j67310k0444j15931j25826o3657n2035j15812k17617j87099
$$ 940485060 940109491 939942181 939921737 939805806 939679980 939616323 939564288 939448476 939230859 939043760
3464.9I39043760n0723j490q2970m6551J02997J43587J42813J65284J03354K5690J44064
$$ 939043760 938993037 938991547 938908577 938862026 938965023 939108610 939251423 939416707 939520061 939545751 939689815
3487.3I39689815K76566K29835J35541Q8394J86443K92778K40624L08156L89218K27273
$$ 939689815 939966381 940196216 940331757 940420151 940606594 940899372 941139996 941448152 941837370 942064643
3507.7I42064643J56343J93953K45989L32773K57551J91391J86979J16051J67668L65018
$$ 942064643 942220986 942414939 942660928 942993701 943251252 943442643 943629622 943745673 943913341 944278359
3528.1I44278359M85242L17156J66476L21865L82245K23934J52409J56939K66850N25833
$$ 944278359 944763601 945080757 945247233 945569098 945951343 946175277 946327686 946484625 946751475 947277308
3548.5I47277308N43653M28796M73440L28779J07825K08378L35157L16560L22640L60727
$$ 947277308 947820961 948249757 948723197 949051976 949159801 949368179 949703336 950019896 950342536 950703263
3568.9I50703263M74572M43876K43366K26259L93152N29945L97385N9723R6679O05643
$$ 950703263 951177835 951621711 951865077 952091336 952484488 953014433 953411818 953471541 953568220 954173863
3589.3I54173863P47025M97818L31223L25680L34918L90113M13000K19524J58310M61996
$$ 954173863 954920888 955418706 955749929 956075609 956410527 956800640 957213640 957433164 957591474 958053470
3609.7I58053470N60760L62575K74003L35395O42538R95219J042783Q21233M08471
$$ 958053470 958614230 958976805 959250808 959586203 960228741 961223960 962266743 963087976 963496447
3628I63496447L90231Q04842R98676J011073R71377Q89659P98941P16865N19931M71294
$$ 963496447 963886678 964691520 965690196 966701269 967672646 968562305 969361246 970078111 970598042 971069336
3648.4I71069336R72331J318514J239240J110554R21666O61850N99504Q33452Q92400
$$ 971069336 972041667 973360181 974599421 975709975 976631641 977293491 977892995 978726447 979618847
3666.8I79618847N91755L91007L33249L41297P42256Q45134N84543M27962K28166n007
$$ 979618847 980210602 980601609 980934858 981276155 982018411 982863545 983448088 983876050 984104216 984099209
3687.2I84099209Q3089M36604M22299K64466L18229K54452K2531P9811K13205Q6844
$$ 984099209 984182298 984618902 985041201 985305667 985623896 985878348 985900879 985980690 986193895 986280739
3707.6I86280739j08242k92897j44064J76608J13487p7605k8252R2446J43350J92463
$$ 986280739 986172497 985879600 985735536 985912144 986025631 985948026 985919774 986012220 986155570 986348033
3727.9I86348033J10924k15471n13076k62857J44243K04206P5221j48654L8981K25425
$$ 986348033 986458957 986243486 985730410 985467553 985611796 985816002 985891223 985742569 985781550 986006975
3748.3I86006975k23398l15428K17498L75151K37107K28048K05338M8339L5286O3360
$$ 986006975 985783577 985468149 985685647 986060798 986297905 986525953 986731291 986779630 986814916 986878276
3768.7I86878276J08659J56641k2054j94966j30058j9431o9201l5703J03474J79052
$$ 986878276 986986935 987143576 987121522 986926556 986796498 986777067 986707866 986672163 986775637 986954689
3789.1I86954689J61946j5140j82390j76966j09375q5354J62840L94822K76148J27852
$$ 986954689 987116635 987101495 986919105 986742139 986632764 986547410 986710250 987105072 987381220 987509072
3809.5I87509072J5914k94387n86271l93808j35303N5969L66747K60055k4199j22249
$$ 987509072 987524986 987230599 986644328 986250520 986115217 986171186 986537933 986797988 986773789 986651540
3829.9I86651540j81556m6432J98722N6386k07424j09077J69397K76029J01864j30772
$$ 986651540 986469984 986423552 986622274 986678660 986471236 986362159 986531556 986807585 986909449 986778677
3850.3I86778677m15266m25935R9838K92957K15649P3791l8922n36l0995k06589j51039
$$ 986778677 986363411 985937476 986037314 986330271 986545920 986619711 986580789 986580253 986549258 986342669 986191630
3872.7I86191630O4552k086k65717j65582J37448J69754K80142J66655k58744j62304
$$ 986191630 986256182 986254096 985988379 985822797 985960245 986129999 986410141 986576796 986318052 986155748
3893.1I86155748R1017j09256k71797k02775J8835M06504N40912L85284J22428j60217
$$ 986155748 986246765 986137509 985865712 985662937 985681772 986088276 986629188 987014472 987136900 986976683
3913.5I86976683k78234k04563m6254q1718k07901M3273K76208O3062j18554p9333
$$ 986976683 986698449 986493886 986447632 986365914 986158013 986201286 986477494 986540556 986422002 986342669
3933.9I86342669q8633l7074O3360p868j1563O2406L099Q4103K62022J69754q4460
$$ 986342669 986254036 986216962 986280322 986272454 986260891 986323297 986326396 986410499 986672521 986842275 986757815
3956.3I86757815j71900q6963o3062j41680q2970J13070J90556P3433r0420j46508
$$ 986757815 986585915 986498952 986435890 986294210 986211240 986324310 986514866 986588299 986497879 986351371
3976.7I86351371j74582o8486J64688J80125N0545j7882o7293n424K04146J81078
$$ 986351371 986176789 986108303 986272991 986453116 986503661 986485779 986418486 986413062 986617208 986798286
3997.1I86798286
$$ 986798286
##END=$$ End of the data block
