##TITLE=P2 $$ Begin of the data block
##JCAMP-DX=5.00 $$ ACD/SpecManager v 10.08
##SPECTROMETER/DATA SYSTEM=Alpha
##DATE=26 Feb 2015 09:50:54
##DATA TYPE=INFRARED SPECTRUM
##DATA CLASS=XYDATA
##ORIGIN=
##OWNER=
##NPOINTS=1667
##FIRSTX=599.57470703
##LASTX=3997.16503906
##MAXX=3997.16503906
##MINX=599.57470703
##MAXY=0.98590142
##MINY=0.17017116
##XFACTOR=1.0000000000
##YFACTOR=1.000000000000000e-9
##FIRSTY=0.47652182
##DELTAX=2.03937006
##XUNITS=1/CM
##YUNITS=ARBITRARY UNITS
##XYDATA=(X++(Y..Y))
599.6 476521820 475902885 484282196 501022458 523264110 546772718 567247987 583074808 595452368
615.9 595452368 605670154 613631725 619832695 625897825 632500052 639229417 645714462 651763856
632.2 651763856 656708419 660365343 663233042 665903747 668861568 672682703 678212464 685081840
648.5 685081840 691681743 697129011 701827586 706585467 712071359 718091428 723776221 728267133
664.8 728267133 731701016 733712673 733987331 733935535 734145343 734830618 735818684 736906886 738215804
683.2 738215804 739537239 740828395 742859423 746065319 749925137 753738105 757227361 760729074
699.5 760729074 764660776 768933773 773292482 777875543 782570243 786612213 789587021 791795850
715.8 791795850 793882668 796453357 800046742 804893613 810521841 816117167 821286380 826029897
732.1 826029897 830299318 833910763 836725116 838842392 840539038 842160344 843786657 845358312
748.4 845358312 846943498 848635077 850216746 851547778 852862418 854125619 855253696 856415570
764.8 856415570 857642591 858749270 859749258 860718310 861628354 862578273 863558054 864342511 864880085
783.1 864880085 865345657 865888536 866621733 867353320 867822230 868124962 868392766 868664086 868965626 869171500
803.5 869171500 869235992 869448066 869889438 870075762 869862199 869749069 869770110 869524539 868719518 867323518
823.9 867323518 865440309 862833261 859387934 855554521 851935506 849122465 847755253 848029077 849614859
842.3 849614859 852034032 854669154 856961191 858618557 859361708 858821094 856968880 854014993 849739075
860.6 849739075 843652129 835352659 824352384 810623646 795199573 779927135 766903460 757709146
876.9 757709146 752756655 750899494 749617517 746259093 739078343 727033317 709667504 687625587
893.2 687625587 663640320 642364323 628121257 622914493 626096904 635543466 649049580 664623141
909.6 664623141 680267692 694376349 706402838 716671646 725837529 734585583 743252993 751816094
925.9 751816094 760029614 767345726 773147225 777098954 779127598 779151082 777051389 772830069 766580820
944.2 766580820 758562028 749546111 740988851 734484196 731060624 730691671 731882036 732025385 728292286
962.6 728292286 718461215 701869249 679857552 654901326 629358053 604866564 582084000 560935974
978.9 560935974 541252613 522952974 506080329 490912169 477647245 465700388 453452259
993.2 453452259 439036250 421271116 400097996 376557112 352110565 327747971 304003805
1007.4 304003805 281400472 260397345 241293609 224216327 209377959 197036803 187134430
1021.7 187134430 179369792 173686460 170460373 170171157 173180103 179366931 187839448 197346404
1038 197346404 207073465 216835633 226886392 237675309 249757245 263800174 280284733 299165756
1054.4 299165756 319581866 340000182 358844370 375182956 389062166 401578695 414272428
1068.6 414272428 428151429 443381429 459505260 475871056 492155194 508583486 525373995
1082.9 525373995 542523265 560165524 578494489 597292006 615848720 633327425 648858905
1097.2 648858905 661638737 671200335 677509665 680882633 681815863 680874884 678661406 675571799
1113.5 675571799 671805620 667766988 664082885 661474228 660833657 663061857 668502688 676663518
1129.8 676663518 686493039 696780622 706425369 714458048 719958782 721988559 719554126 712042689
1146.1 712042689 699891984 684714258 668915868 654926836 644578338 638851941 637823164 640834689
1162.4 640834689 646803796 654574156 663168013 672066748 681147277 690432131 699763775 708557189
1178.8 708557189 715868711 720245779 719932139 713280380 698731005 674927592 640929520 596488059
1195.1 596488059 542692780 482683837 421598226 365179032 317917734 282025367 257380098
1209.4 257380098 242378220 235027209 233407512 235861108 241006419 247676060 255146027 263294190
1225.7 263294190 272358716 282943964 295820534 311360955 329389960 349561900 371446908
1239.9 371446908 394539833 418486089 442867935 467378467 492010623 516792715 541640818
1254.2 541640818 566368520 590819716 614930451 638522089 661459565 683791816 705464125
1268.5 705464125 726469159 746789992 766079605 784010887 800468862 815187335 827969432
1282.8 827969432 838960946 848459840 856715560 863937557 870388091 876304805 881662130 886188984
1299.1 886188984 889632344 891750574 892390251 891668856 889907598 887388587 884495199 881783128 879753351
1317.4 879753351 878762841 878823876 879707515 881290317 883478463 886063457 888728023 891086936 892897785
1335.8 892897785 893961370 894040048 893099308 891095042 887509227 881389618 871359587 855489492
1352.1 855489492 831431806 797858238 756889820 712850273 671207309 641238689 627278745
1366.4 627278745 625810862 632949531 645428061 661117554 677240729 693405807 711685777 732802451
1382.7 732802451 756296813 782643199 809290051 831322432 849578083 865636289 877709985
1397 877709985 885447621 889795363 891561329 891804218 891096354 889610767 887341738 884417951 881128728
1415.3 881128728 877292097 872664690 868291318 864304781 860344470 856998682 854711294 854112029
1431.6 854112029 855299830 858361125 863379836 868593991 873589158 878399253 882783949 886852562
1448 886852562 890150368 892460704 894408882 897182226 901443899 905662954 909852803 915163457 921122372
1466.3 921122372 926294565 931006908 936128914 940792382 944203138 946785092 948769152 950361490
1482.6 950361490 951597869 952469766 953072131 953758240 954482436 954985738 955314875 955491602 955563009 955639303
1503 955639303 955570936 955200613 955182850 955481410 955756664 955906570 955955565 955913901 955734789 955591619 955527365
1525.5 955527365 955496013 955585539 955660045 955544174 955532849 955618024 955452263 955143988 955042303 955082238 955070078
1547.9 955070078 954961479 954896808 954770625 954465270 954201996 954314232 954581141 954638243 954510808 954136789
1568.3 954136789 953597546 953304827 952977598 952285647 951685071 951222599 950477779 949523091 948477447
1586.6 948477447 947368026 946109653 944552124 942744613 940728426 938432097 935722947 932649314
1603 932649314 929299951 925635934 921540618 917325795 913338959 908803463 903095245 898362339 894598424
1621.3 894598424 890306532 886363089 883363724 880983174 879287958 877995551 876688421 875978470
1637.6 875978470 876117587 876553476 877210140 878200829 879669368 881197035 883001924 885847032 888592243
1656 888592243 890932381 893203080 895547390 897826076 899613678 900941372 902213275 903253913 903693736
1674.3 903693736 903421998 902623892 901378036 899184287 895450056 891692936 887921035 882789016 877005637
1692.7 877005637 869144261 858567119 846046865 828450024 810624659 790692091 763615549
1707 763615549 733147502 700085521 663540184 622346938 573490381 528227568 497042149 472406298
1723.3 472406298 451641738 437032640 427558064 422637463 422162920 426140338 432499260 441878378
1739.6 441878378 454087436 467321604 481743932 497824341 517909050 542485714 568974912
1753.9 568974912 600676775 639786184 682621539 730783105 776086628 812513530 843708932
1768.2 843708932 868736982 888779223 903774738 913726628 921376407 927995682 933413863 937976897
1784.5 937976897 941766083 944845140 947483480 950094461 952459812 954415143 956203341 957849264
1800.8 957849264 959497452 960943997 962250471 963417053 964588583 965777099 966940939 968001425
1817.1 968001425 968996882 969986916 970830560 971628904 972298920 972926497 973579466 974198341 974667907 975162864
1837.5 975162864 975630641 975844920 975993812 976275623 976592660 976807714 977055669 977293968 977442503 977451265
1857.9 977451265 977517426 977734685 977924347 977928698 977806866 977848709 978036344 978280008 978429735 978449106
1878.3 978449106 978397965 978343010 978326201 978410006 978527367 978544414 978501081 978470266 978507578 978471220 978325725
1900.7 978325725 978138685 977967441 977767527 977566481 977471650 977437019 977335811 977141738 976993978 976831973
1921.1 976831973 976684153 976659119 976676226 976639211 976565719 976500690 976452947 976413786 976336002 976198196 976114035
1943.5 976114035 976216793 976351202 976388752 976341665 976295054 976345778 976434886 976465046 976512611 976652384 976790726
1966 976790726 976911962 977030158 977155626 977326095 977550745 977761567 977876663 977904797 977928936 977974057
1986.4 977974057 977947712 977868736 977829397 977863610 977897406 977850258 977782130 977745295 977735281 977793753 977874875
2008.8 977874875 977823317 977622807 977396011 977249205 977189660 977150679 977087021 976975918 976879656 976872563 976907253
2031.2 976907253 976933360 976918578 976867914 976817071 976789713 976780951 976745248 976717174 976735294 976736963 976687014 976650238
2055.7 976650238 976617157 976545990 976502836 976516843 976529241 976484418 976385117 976289928 976238608 976212204 976201773
2078.1 976201773 976173997 976092041 975974202 975823820 975643039 975432515 975183666 974938035 974737048 974596798
2098.5 974596798 974491656 974346936 974150121 973946512 973769963 973623037 973460436 973292410 973217726 973182678
2118.9 973182678 973144889 973190963 973237813 973242879 973301053 973412633 973498702 973569334 973717451 973920822 974074721
2141.4 974074721 974172771 974239409 974329948 974570811 974903047 975155413 975318789 975516081 975761950 976004899
2161.8 976004899 976269066 976495326 976641893 976775050 976925194 977110922 977366805 977610707 977749586 977838218
2182.2 977838218 977943599 978060603 978198111 978348017 978420496 978446126 978549063 978692412 978799522 978905857
2202.5 978905857 978983939 979008019 979033530 979048669 979071736 979152858 979246080 979327559 979396701 979414880 979439676
2225 979439676 979552388 979696870 979734004 979670525 979658306 979751825 979832411 979782343 979725897 979789436 979886413
2247.4 979886413 979895949 979798377 979730904 979772508 979811072 979780734 979723215 979672611 979636788 979624152 979625702 979633808
2271.9 979633808 979711175 979810476 979838014 979888976 979962349 979983866 980042517 980170310 980307221 980455220 980600417
2294.3 980600417 980679750 980709851 980786681 980888069 980913460 980876565 980810165 980716646 980675280 980700612 980724931
2316.7 980724931 980753183 980781913 980830073 980910182 980965614 981021941 981194675 981412172 981434584 981318176 981249094
2339.2 981249094 981142819 980894446 980644643 980584025 980719388 980892599 980894268 980834723 980928898 981000125 981061757
2361.6 981061757 981210053 981198311 981035173 980941176 980881155 980801404 980726063 980620205 980525911 980535269 980614543
2384 980614543 980695724 980772853 980848908 980874717 980819821 980737269 980614841 980472684 980416954 980413795 980366707 980304837
2408.5 980304837 980330288 980367839 980291009 980176032 980108559 980101109 980125546 980129659 980123878 980130851 980110765 980066478
2433 980066478 980069518 980128050 980136573 980040431 979950905 979908407 979864836 979868650 979903400 979865849 979791760 979734480
2457.5 979734480 979670584 979606807 979538679 979498982 979537010 979598343 979612112 979620814 979676366 979659557 979537249
2479.9 979537249 979521811 979644239 979758084 979858279 979933858 979947567 979949117 979900062 979763806 979695439 979749322
2502.3 979749322 979861379 979996204 980089009 980158150 980263948 980339229 980279863 980175018 980185747 980301321
2522.7 980301321 980397224 980394125 980344296 980329275 980336487 980319440 980328381 980391562 980443001 980427027 980363727 980342150
2547.2 980342150 980346024 980346203 980362892 980375350 980396152 980365217 980221331 980080068 980020761 980010152 980013490 980019450
2571.7 980019450 980056226 980018616 979872823 979807675 979810417 979784191 979760766 979722738 979654372 979645908 979691088 979647994
2596.1 979647994 979528308 979429424 979365826 979326665 979284763 979225457 979176044 979122400 979021370 978938699 978968203
2618.6 978968203 979013860 978978515 978946507 978908956 978797913 978627920 978467941 978400350 978387058 978355289 978313744
2641 978313744 978302121 978306353 978311181 978297651 978243887 978241742 978308201 978360236 978380382 978361070 978346348 978396893
2665.5 978396893 978450119 978434980 978412390 978426397 978437543 978416383 978331566 978226006 978202939 978221416 978174508
2687.9 978174508 978103995 978060067 978016675 977988064 977969885 977946699 977911174 977814853 977651298 977497399 977421165
2710.3 977421165 977419853 977414131 977348685 977261603 977084219 976829648 976736903 976805151 976823807 976755738 976709485
2732.8 976709485 976749599 976840854 976929665 976941705 976921260 977025330 977145553 977169216 977230191 977301240 977305412
2755.2 977305412 977313817 977306843 977305412 977334380 977293789 977231801 977197051 977143943 977128744 977132320 977004766 976783216
2779.7 976783216 976643920 976605535 976579845 976478517 976219237 975840569 975565732 975516021 975542545 975517392
2800.1 975517392 975436032 975253880 974962652 974706769 974624753 974703908 974743903 974579155 974278688 973989844
2820.5 973989844 973792434 973630905 973449588 973269939 973004580 972626507 972237587 971786678 971170068 970432580
2840.8 970432580 969629288 968733907 967708588 966564298 965411484 964320600 963278055 962369323 961611450
2859.2 961611450 960849822 960001588 959077835 958155632 957325995 956585884 955894530 955249906 954716921 954325676
2879.6 954325676 954034090 953775823 953508198 953305662 953192949 953141034 953171372 953230262 953345239 953565478
2900 953565478 953721046 953786910 953933656 954063475 953953803 953641593 953297913 953000784 952679515 952207208
2920.4 952207208 951635599 951100886 950566351 949943066 949148834 948098421 946949244 946029782 945440531
2938.7 945440531 945115924 945111632 945472777 946021855 946451902 946601748 946660638 946872830 947121561 947284937
2959.1 947284937 947641194 948425889 949560285 951030493 952888727 954952240 956928134 958667338 960095763
2977.5 960095763 961173594 962016761 962713957 963209808 963624299 964150906 964753747 965263009 965608180
2995.8 965608180 965981364 966526687 967070043 967410803 967602432 967773974 967878103 967933536 968081057 968266428
3016.2 968266428 968322694 968283594 968331873 968518972 968825638 969227731 969570160 969851613 970194697 970468342
3036.6 970468342 970607996 970787704 971009433 971157253 971283019 971372306 971357346 971349716 971419334 971474230 971464753
3059.1 971464753 971462250 971466362 971382678 971288681 971338153 971430957 971459508 971460342 971389532 971206546 971019685 970932543
3083.5 970932543 970940948 970959246 970804572 970546305 970408201 970313251 970149517 969978809 969890416 969876528 969816983
3106 969816983 969685018 969561219 969445288 969331026 969242036 969126105 968951166 968754292 968545794 968373835
3126.3 968373835 968274593 968147635 967934430 967685044 967500687 967400730 967294753 967119098 966785848 966293633
3146.7 966293633 965920806 965821862 965692997 965435326 965234578 965000153 964646578 964305878 964014292 963709652
3167.1 963709652 963413119 963097632 962736547 962443233 962238550 961982012 961592674 961102784 960637808 960322320
3187.5 960322320 960076213 959777355 959408283 959002316 958675027 958447695 958107173 957652390 957260787 956828773
3207.9 956828773 956327319 955876350 955522597 955213428 954786599 954293311 953867972 953456640 952983916 952495992
3228.3 952495992 952101827 951888025 951814175 951625645 951246798 950847626 950416386 949945927 949608922 949433863
3248.7 949433863 949235320 948877394 948525369 948333204 948072255 947629809 947272062 947100639 946972847 946868896
3269.1 946868896 946739256 946443975 946083784 945836246 945688844 945496559 945118964 944693863 944437623 944303811
3289.5 944303811 944120407 943823159 943612397 943551004 943421185 943144858 942744672 942336380 942075789 941909194
3309.9 941909194 941651344 941229403 940777421 940506697 940368891 940037608 939515650 939109385 938836753 938539922
3330.3 938539922 938180804 937742352 937217891 936723948 936267793 935777247 935303509 934865236 934442222 933961153
3350.7 933961153 933450699 933041811 932596743 932039022 931554973 931137145 930658102 930104375 929483175 928903162
3371.1 928903162 928440511 927964985 927439153 927016497 926675260 926221013 925719798 925383687 925130308 924706995
3391.5 924706995 924154997 923651814 923218489 922817230 922450662 922165394 921888411 921554685 921126187 920613408
3411.9 920613408 920233965 919955432 919556201 919100463 918778181 918578982 918269992 917816579 917407036 917010725
3432.2 917010725 916581154 916291654 916174710 916033685 915869296 915775895 915615916 915428877 915365875 915256083
3452.6 915256083 915006161 914769530 914515674 914223254 914055109 913933456 913726628 913607538 913767934 914002061
3473 914002061 914026141 913949251 913999677 914230585 914467156 914680183 915018499 915367603 915559947 915631950 915776968
3495.5 915776968 916158915 916561902 916754723 917098582 917734027 918150604 918249249 918407679 918705940 919049203
3515.9 919049203 919451118 919821084 920077324 920321763 920695543 921116650 921419859 921645463 921884716 922221780
3536.3 922221780 922685206 923106492 923375785 923643589 924062729 924619853 925170481 925612807 925986767 926424801
3556.6 926424801 926970720 927409112 927576840 927704573 928234041 928986192 929451585 929789603 930313230 930949211
3577 930949211 931483269 931981504 932453394 932767808 933118522 933768868 934458733 934950471 935365856 935867250
3597.4 935867250 936453164 937170982 937903106 938404977 938902557 939644277 940438807 941223264 942020059 942825019
3617.8 942825019 943789601 944853306 945799232 946678817 947728217 949072421 950515330 952023089 953487873
3636.2 953487873 954812288 956105769 957399368 958682358 960000157 961357772 962829471 964400113
3652.5 964400113 965844989 967219830 968712449 970272481 971579432 972449541 973220110 974281788 975503862
3670.8 975503862 976325870 976879656 977826953 978962481 979897618 980644941 981143832 981461704 981885552
3689.2 981885552 982455492 982846081 983009815 983214498 983538330 983833253 984117627 984437406 984555006 984231293
3709.6 984231293 983798504 983880043 984235883 984404683 984375954 984278679 984189808 984349489 984719992 984832048
3730 984832048 984520435 984132171 984088004 984211624 984197438 984024525 983884752 984025240 984126627 984051168
3750.4 984051168 984147727 984465539 984801352 985088527 985375881 985522151 985399187 985262275 985236526 985283494
3770.8 985283494 985440254 985563636 985635400 985673785 985635638 985634625 985642374 985578179 985506594 985509753 985621750
3793.2 985621750 985690057 985684931 985733986 985618114 985430181 985606253 985901415 985790312 985525370 985510826
3813.6 985510826 985674500 985768676 985643566 985365391 985246241 985280871 985344708 985381663 985405922 985558271
3834 985558271 985748649 985770106 985717595 985687554 985690475 985654056 985466659 985208392 984900355 984644115 984840512
3856.4 984840512 985298157 985668540 985663116 985342979 985105753 984969795 984877050 984849811 984913230 985069513
3876.8 985069513 985110402 985069573 985133588 985226214 985258818 985133767 984987736 985152185 985463023 985511720 985148251
3899.2 985148251 984732151 984663188 984970152 985440910 985708535 985679805 985510230 985345006 985291064 985388398
3919.6 985388398 985485315 985458553 985492885 985557377 985414147 985187709 985133588 985219538 985251546 985144377 985018790
3942.1 985018790 985049784 985161424 985235453 985307336 985312879 985190690 985085666 985086083 985044718 984893203 984810531
3964.5 984810531 984958768 985189140 985161304 984856248 984574914 984527051 984706521 984889507 984870255 984766781
3984.9 984766781 984784484 984908760 984996974 984968364 984903574 984874368
3997.1 984874368
##END=$$ End of the data block
