##TITLE=P1 $$ Begin of the data block
##JCAMP-DX=5.00 $$ ACD/SpecManager v 10.08
##SPECTROMETER/DATA SYSTEM=Alpha
##DATE=26 Feb 2015 09:50:54
##DATA TYPE=INFRARED SPECTRUM
##DATA CLASS=XYDATA
##ORIGIN=
##OWNER=
##NPOINTS=1667
##FIRSTX=599.57470703
##LASTX=3997.16503906
##MAXX=3997.16503906
##MINX=599.57470703
##MAXY=0.98513550
##MINY=0.14120889
##XFACTOR=1.0000000000
##YFACTOR=1.000000000000000e-9
##FIRSTY=0.47401074
##DELTAX=2.03937006
##XUNITS=1/CM
##YUNITS=ARBITRARY UNITS
##XYDATA=(X++(Y..Y))
599.6D74010736j90884R218991J7976224K4035156K5316715K2253335J7541468J2974381
$$ 474010736 473819852 483038843 501015067 525050223 550366938 572620273 590161741 603136122
615.9F03136122R789050Q205235P307589O777048O798565P256687P040680O112337
$$ 603136122 612925172 621130407 628437996 635215044 642013609 649270296 656310976 662423313
632.2F62423313M848778L491402K578377K349079K740741M081070O323397P847011
$$ 662423313 667272091 670763493 673341870 675690949 678431690 682512760 688836157 696683168
648.5F96683168P545472O010651M847944M998028N966485O624281O218255M681349
$$ 696683168 704228640 710239291 715087235 720085263 726051748 732676029 738894284 743575633
664.8G43575633L344476J722097l77357p61747k00629L04281M18544O69956J094103
$$ 743575633 746920109 748642206 748264849 747503102 747302473 747606754 748025298 748695254 749789357
683.2G49789357J342952J531959K083838K981007L858149M397750M177511L759205
$$ 749789357 751132309 752664268 754748106 757729113 761587262 765985012 770162523 773921728
699.5G73921728L802061M129052M429996M515171M399598L937602L242195K560317
$$ 773921728 777723789 781852841 786282837 790798008 795197606 799135208 802377403 804937720
715.8H04937720K274156K714693L722430M810750N618274O113351O298959N908310
$$ 804937720 807211876 809926569 813648999 818459749 824078023 830191374 836490333 842398643
732.1H42398643M924417L944695L009558K026260J413047J391172J534820J434386
$$ 842398643 847323060 851267755 854277313 856303573 857716620 859107792 860642612 862076998
748.4H62076998J336992J386284J369715J282811J152039J031041J152635J138210
$$ 862076998 863413990 864800274 866169989 867452800 868604839 869635880 870788515 871926725
764.8H71926725Q45253M67718j12891l15309K73109J135885J703144J749336J330912
$$ 871926725 872771978 873239696 873126805 872811496 873084605 874220490 875923634 877672970 879003882
783.1H79003882O99819L10123K56657K35677K30074J66476n0486j16944K5928J21772
$$ 879003882 879703701 880013824 880270481 880506158 880736232 880902708 880852222 880735278 880761206 880882978
803.5H80882978q046l27587m93229m27007m83931p34567q86917j041770j555741k361179
$$ 880882978 880874932 880547345 880054116 879627109 879143178 878408611 877521694 876479924 874924183 872563004
823.9H72563004l356397m415929n255580n687952n345583m130244k275407l4929J860619
$$ 872563004 869206607 864790678 859535098 853847146 848501563 844371319 842095912 842060983 843921602
842.3H43921602K941787L247678K844811J935780O07133q08120k043545l335953m951954
$$ 843921602 846863389 850111067 852955878 854891658 855498791 854690671 852647126 849311173 844359219
860.6H44359219p092118r769917j2888670j6079247j8248200j8053115j5142917j0618270
$$ 844359219 837267101 827497184 814608514 798529267 780281067 762227952 747085035 736466765
876.9G36466765o124019l073335k660453n022168r103775j4157057j9644737k4156392
$$ 736466765 730342746 727269411 724608958 719586790 710483015 696325958 676681221 652524829
893.2F52524829k5387883k1584571j3308227l349364N450368J1818469J5686631J7321825
$$ 652524829 627136946 605552375 592244148 588894784 594345152 606163621 621850252 639172077
909.6F39172077J7019510J5260995J2862801J0801614R703159R492099R573341R388506
$$ 639172077 656191587 671452582 684315383 695116997 704820156 714312255 723885596 733274102
925.9G33274102Q648575P375598N789876L915727J766443n38707k864420n044163p069289
$$ 733274102 741922677 749298275 755088151 759003878 760770321 760231614 757367194 752323031 745253742
944.2G45253742q714259r372055q641720o562531l575504p58290L39925j216412n481243
$$ 745253742 736539483 727167428 718525708 711963177 708387673 707629383 707969308 706752896 701271653
962.6G01271653j1825859j8679083k4144351k7027250k7380168k6057482k3981154
$$ 701271653 689445794 670766711 646622360 619595110 592214942 566157460 542176306
976.9E42176306k1974087k0297020j8655420j6926199j5151828j3449073j2422532
$$ 542176306 520202219 499905199 481249779 464323580 449171752 435722679 423300147
991.1D23300147j2903035j5054702j8133611k1084517k3104459k3784220k3281277
$$ 423300147 410397112 395342410 377208799 356124282 333019823 309235603 285954326
1005.4B85954326k2140860k0768479j9272357j7533407j5562891j3517395j1439055
$$ 285954326 263813466 243044987 223772630 206239223 190676332 177158937 165719882
1019.7A65719882r317652p247403n167961k777979N7682L242955O258279Q334533R288236
$$ 165719882 156402230 149154827 143986866 141208887 141266569 144509524 150767803 159102336 168390572
1038A68390572R560332R651139J0052964J0928318J2266547J4070257J6131297J8060595
$$ 168390572 177950904 187602043 197655007 208583325 220849872 234920129 251051426 269112021
1054.4B69112021J9177437J8900096J7241001J4925629J2836158J1829585J2367815
$$ 269112021 288289458 307189554 324430555 339356184 352192342 364021927 376389742
1068.6C76389742J3833702J5284389J6289055J6799152J6887397J6856521J7075390
$$ 376389742 390223444 405507833 421796888 438596040 455483437 472339958 489415348
1082.9D89415348J7599582J8272698J8931329J9244731J8939137J7855466J5827179
$$ 489415348 507014930 525287628 544218957 563463688 582402825 600258291 616085470
1097.2F16085470J3021707R804189O548346L576993J062036q84056k162039k879858
$$ 616085470 629107177 638911366 645459712 649036705 650098741 649214685 647052646 644172788
1113.5F44172788l385544l738821l526807k376675k66791K504051N475342Q177460
$$ 644172788 640787244 637048423 633521616 631144941 630878150 633382201 638857543 647035003
1129.8F47035003R991228J0495603R871126Q351564N870044K330542k216637p349849
$$ 647035003 657026231 667521834 677392960 685744524 691614568 693945110 691728473 684378624
1146.1F84378624j2125135j5420794j6418397j5024960j1769176p387936k742171J422822
$$ 684378624 672253489 656832695 640414298 625389338 613620162 606232226 603490055 604912877
1162.4F04912877M728973P076859Q536220R313285R675861R905755R903372R193360
$$ 604912877 609641850 616718709 625254929 634568214 644244075 654149830 664053202 673246562
1178.8F73246562P441938M228056j049698q475780j7638981k8225720l9662600n0520420
$$ 673246562 680688500 684916556 683866858 675391078 657752097 629526377 589863777 539343357
1195.1E39343357n8875501o2871397o1154753n3826779m2943835l1181857k0358235
$$ 539343357 480467856 417596459 356441706 302614927 259671092 228489235 208131000
1209.4B08131000j1390477m480809O96167M338026O554887P734120Q347854R060428
$$ 208131000 196740523 192259714 192955881 197293907 203848794 211582914 219930768 228991196
1225.7B28991196J0356083J2324125J4840394J7602295K0225375K2426278K3979336
$$ 228991196 239347279 251671404 266511798 284114093 304339468 326765746 350745082
1239.9C50745082K4907827K5495023K5791585K5895268K5948495K5963813K5855958
$$ 350745082 375652909 401147932 426939517 452834785 478783280 504747093 530603051
1254.2E30603051K5529444K5061429K4622023K4000764K3106098K2249222K1408975
$$ 530603051 556132495 581193924 605815947 629816711 652922809 675172031 696581006
1268.5F96581006K0596445J9759297J8690765J7450809J5996874J4294505J2578964
$$ 696581006 717177451 736936748 755627513 773078322 789075196 803369701 815948665
1282.8H15948665J0953427R495913Q291603P328093O574452O071627N642175M847229
$$ 815948665 826902092 836398005 844689608 852017701 858592153 864663780 870305955 875153184
1299.1H75153184L644466K238453O91950q17239j905561k470851k615809k379119j806260
$$ 875153184 878797650 881036103 881728053 880910814 879005253 876534402 873918593 871539474 869733214
1317.4H69733214r63866j2517Q49604J552403K127409K463579K410651K080083J605331
$$ 869733214 868769348 868756831 869606435 871158838 873286247 875749826 878160477 880240560 881845891
1335.8H81845891Q47638j37031j206934k537787m421652p251024j1693180j8494725
$$ 881845891 882693529 882556498 881349564 878811777 874390125 867139101 855445921 836951196
1352.1H36951196k8062939l8807750m6593428m9126267m5326293l1613052j3838768
$$ 836951196 808888257 770080507 723487079 674360812 629034519 597421467 583582699
1366.4E83582699k50101Q947790J4750302J8454790J8911004J8907726K1237194K4047196
$$ 583582699 583332598 592280388 607030690 625485480 644396484 663304210 684541404 708588600
1382.7G08588600K6131749K8784871K8725505K3521602J9435704J7045081J2684703
$$ 708588600 734720349 763505220 792230725 815752327 835188031 852233112 864917815
1397H64917815Q067727M467547J646936J5557r43840j707971k438545l077925l538549
$$ 864917815 872985542 877453089 879100025 879115582 878171742 876463771 874025226 870947301 867408752
1415.3H67408752m238963n267024n203366m988372n062044m236281k954364j031935
$$ 867408752 863169789 857902765 852699399 847711027 842648983 838412702 835458338 834426403
1431.6H34426403J176298L509044N728901N914211N822241N820036N378783M905820
$$ 834426403 835602701 839111745 844840646 850754857 856577098 862397134 867775917 872681737
1448H72681737M068017L081202K592743L434420N174040M966021M684269N843938O641865
$$ 872681737 876749754 879830956 882423699 885858119 891032159 895998180 900682449 906526387 913168252
1466.3I13168252N819022N264878N703807N272270L892958K957523K341270J870751
$$ 913168252 918987274 924252152 929955959 935228229 939121187 942078710 944419980 946290731
1482.6I46290731J371026J060069R47356Q91269P31349N11467L52263K82705K44141
$$ 946290731 947661757 948721826 949669182 950560451 951291800 951803267 952155530 952438235 952682376
1501I52682376J75297m351l07977j13547M8041j132n1975K1755K47419L21269K04027
$$ 952682376 952857673 952853322 952545345 952431798 952479839 952478707 952426732 952448487 952695906 953017175 953221202
1523.4I53221202J21534M5299p9155j75237j68801Q6367J60397j62065m17054r5546
$$ 953221202 953342736 953388035 953308880 953133643 952964842 953051209 953211606 953049541 952632487 952536941
1543.8I52536941J33574P8141J2815N4598Q0526l8505k98082l17574R0361P2658n6029
$$ 952536941 952670515 952748656 952761471 952816069 952896595 952858090 952560008 952242434 952332795 952405453 952349424
1566.3I52349424j80184l54946k81632l20673o82294p36773n33462o57022q89719j109540
$$ 952349424 952169240 951814294 951532662 951211989 950529695 949792922 949259460 948602438 947712719 946603179
1586.6I46603179j244307j277923j284599j420141j800000k144278k496004k884626
$$ 946603179 945358872 944080949 942796350 941376209 939576209 937431931 934935927 932051301
1603I32051301l268600l638982l896535l738224l356934l702760m834055m402698l657281
$$ 932051301 928782701 925143719 921247184 917508960 914152026 910449266 905615211 901212513 897555232
1621.3H97555232m035532l701449k904951k361536j686097j236200j027107m39525
$$ 897555232 893519700 889818251 886913300 884551764 882865667 881629467 880602360 880162835
1637.6H80162835J05858L38256N79059R20773J479089J496971J816988K976417K528966
$$ 880162835 880268693 880606949 881186008 882106781 883585870 885082841 886899829 889876246 892405212
1656H92405212J960277K040804K198100J969397J435816J050234Q23915M54128K2173
$$ 892405212 894365489 896406293 898604393 900573790 902009606 903059840 903883755 904337883 904360056
1674.3I04360056o46472j255214j704634k648234m427373m751861m784942o100595
$$ 904360056 903713584 902458370 900753736 898105502 893678129 888926268 884141326 878040731
1690.7H78040731o643832q814394j1631191j3621330j9049645j9361734k1548569k9054404
$$ 878040731 871396899 862582505 850951314 837329984 818280339 798918605 777370036 748315632
1707G48315632l2794833l5806000l9757133m5060455n3936005n0658971l5748512k9021680
$$ 748315632 715520799 679714799 639957666 594897211 540961206 490302235 454553723 425532043
1723.3D25532043k5116414j8433183j2741149p631838k741724K198130N065769Q700549
$$ 425532043 400415629 381982446 369241297 361609459 358867735 361065865 366131634 374832183
1739.6C74832183J2313426J3813972J5448451J7669141K2271067K6911825K8439552
$$ 374832183 387145609 400959581 416408032 434077173 456348240 483260065 511699617
1753.9E11699617L3845246M1936218M6159089N2608669N0386667M1212142L5852611
$$ 511699617 545544863 587481081 633640170 686248839 736635506 777847648 813700259
1768.2H13700259K9366553K4166405J8328309J2115478R379685Q312285O847382N660176
$$ 813700259 843066812 867233217 885561526 897677004 907056689 915368974 922216356 927876532
1784.5I27876532M695118L807425L256857L217042K789259K174795K037644J967549
$$ 927876532 932571650 936379075 939635932 942852974 945642233 947817028 949854672 951822221
1800.8I51822221J973391J775503J617372J451016J551330J533866J314401J152933
$$ 951822221 953795612 955571115 957188487 958639503 960190833 961724699 963039100 964192033
1817.1I64192033J141488J159668R93610R30905Q03173P95483Q16107P67171N82755
$$ 964192033 965333521 966493189 967486799 968417704 969220877 970016360 970832467 971599638 972182393
1835.5I72182393N27918N11170L70502K51413K44736M14431M14610K87593P0393P2181
$$ 972182393 972710311 973221481 973591983 973843396 974088132 974502563 974917173 975204766 975275159 975347340
1855.9I75347340J62006J99854J87576J44362P9155L3379J98304K44141J63853R8407
$$ 975347340 975509346 975709200 975896776 976041138 976120293 976153672 976351976 976596117 976759970 976858377
1876.2I76858377J33455R1315K1755K5690O3240M4227o556k981n1439l9696q7619j60277
$$ 976858377 976991832 977083147 977104902 977130592 977193832 977238059 977231503 977228522 977177083 977137387 977049768 976889491
1900.7I76889491j98781k15114k15709k13027j96099r8825j6927r1613j23024j17421
$$ 976889491 976690710 976475596 976259887 976046860 975850761 975751936 975735009 975643396 975520372 975402951
1921.1I75402951r7811o5625k3246Q35j9729p3493j08301j24336j42812r2209L398
$$ 975402951 975305140 975239515 975216269 975217104 975197375 975123882 975015581 974891245 974748433 974656224 974659622
1943.5I74659622J01268Q2254M3095M6372L3259J2458P6055J46866J24931J63436J73688
$$ 974659622 974760890 974843144 974886239 974932611 974965870 974978328 975054383 975201249 975326180 975489616 975663304
1966I75663304J73271K36988K23041J35541R4950J06335J20401P2837K1100R9599J86026
$$ 975663304 975836575 976073563 976296604 976432145 976527095 976633430 976753831 976826668 976847768 976947367 977133393
1988.4I77133393J54555K0504j11401j26898m8399j6213o3359r4295j04904j30713
$$ 977133393 977287948 977308452 977197051 977070153 977021754 977005541 976942182 976847887 976742983 976612270
2008.8I76612270j22845o8784n8591p9811q4639q9287q7619o6340n4121n4717n2929
$$ 976612270 976489425 976420641 976362050 976282239 976197600 976108313 976020694 975954354 975900233 975845516 975792587
2031.2I75792587l6955L0160O5446p2599j78992m3512Q6785Q1896L7492l4392m2618
$$ 975792587 975755632 975785792 975851238 975778639 975599647 975556135 975642920 975724816 975762308 975727916 975685298
2053.7I75685298K8491M0114P868l8564j38700j89126r5665j609j5378m7744l2901
$$ 975685298 975713789 975753903 975761771 975723207 975584507 975395381 975299716 975298107 975282729 975234985 975202084
2076.1I75202084n1201j85132k56359j98603j92463k13087k13385k05815j58131k39670
$$ 975202084 975150883 974965751 974709392 974510789 974318326 974105239 973891854 973686039 973527908 973288238
2096.5I73288238l63409k68758j21474j33932k56657l07739k61009k02834j48774n2750
$$ 973288238 972924829 972656071 972534597 972400665 972144008 971836269 971575260 971372426 971223652 971170902
2116.9I71170902N663k7776r894O2227J03771J05680J20878P5698J0490J21772K85626
$$ 971170902 971176565 971148789 971138895 971201122 971304893 971410573 971531451 971607149 971617639 971739411 972025037
2139.3I72025037L38912L61681L26216K33412J89245J44243J16706J70767L33190L38137
$$ 972025037 972363949 972725630 973051846 973285258 973474503 973618746 973735452 973906219 974239409 974577546
2159.7I74577546J41621J86801L24189K13564P9870J49608K68221L06725K63631J76013
$$ 974577546 974719167 974905968 975230157 975443721 975523591 975673199 975941420 976248145 976511776 976687789
2180.1I76687789J70767K68460K43246O7353q34L4809J02758J57059J23858N3764J7344
$$ 976687789 976858556 977127016 977370262 977437615 977436781 977471590 977574348 977731407 977855265 977909029 977926373
2202.5I77926373O0678J35899J24335P9811R9301Q4102O974n0903o6876Q464J18315
$$ 977926373 977987051 978122950 978247285 978327096 978426397 978510499 978517473 978466570 978399694 978408158 978526473
2225I78526473J17421J31905J61290K5034m6193N3227J6570j00255m7743J3887M1664
$$ 978526473 978643894 978775799 978937089 978962123 978915930 978969157 978985727 978885472 978837729 978851616 978893280
2247.4I78893280P9632j1683j01626r0479q3030l6239k265k6763J7703L4392O854N9128
$$ 978893280 978972912 978961229 978859603 978769124 978686094 978649855 978647590 978620827 978638530 978672922 978679776 978738904
2271.9I78738904J28865J66178Q8215q2076o4790J31130J83106J21534J78217K08676
$$ 978738904 978867769 979033947 979122162 979040086 978975296 979106426 979289532 979411066 979589283 979797959
2292.3I79797959P5996j1086R775J5855Q6784J95801J39714K0146o6996j83105j18375
$$ 979797959 979873955 979862869 979872644 979888499 979975283 980171084 980310798 980330944 980263948 980080843 979962468
2314.7I79962468J77860K67804j0431j87814n4479R8944J46747J69754K53498J71125
$$ 979962468 980140328 980408132 980397701 980209887 980155408 980254352 980401099 980570853 980824351 980995476
2335.1I80995476k28822l73721r1195o4433l87549l60847N4717L30866K49147p5340
$$ 980995476 980766654 980392933 980301738 980237305 979849756 979488909 979543626 979874492 980123639 980048299
2355.5I80048299k81036q9824R0062k9802o1572j1205N1915J15812J15216R5725N543
$$ 980048299 979767263 979677439 979767501 979737699 979676127 979664922 979716837 979832649 979947865 980043590 980049133
2377.9I80049133o9916m9651m2736j7405Q6904R0182l0518r7275j04010r1254j06931
$$ 980049133 979979217 979929566 979886830 979869425 979956329 980046511 980015993 979918718 979814708 979723454 979616523
2400.4I79616523j54197j43052o6936m4643j40310j70290k2650M2200l1710m6253o676
$$ 979616523 979462326 979319274 979252338 979207695 979067385 978897095 978874445 978916645 978884935 978838682 978832006
2422.8I78832006N8532P2897K2471k742j967j7703m9770k4914L5584M3511P808N365
$$ 978832006 978890538 978963435 978985906 978983164 978981197 978963494 978913724 978888810 978924394 978967905 978975713 978981078
2447.3I78981078J490m9293n9724o914J4066J1087J7226n126o080m4465j30057o2168
$$ 978981078 978982568 978933275 978873551 978866637 978880703 978891790 978909016 978903890 978897810 978853345 978723288 978661120
2471.7I78661120N0545J0311L3021J25349Q7678M2856q941n7637j7524K4736J01506
$$ 978661120 978711665 978721976 978754997 978880346 978968024 979010880 979001939 978944302 978926778 978951514 979053020
2494.2I79053020J19865K7419L8862O2346L0816R3937J36673P2241O616j9431l1412
$$ 979053020 979172885 979200304 979239166 979301512 979332328 979426265 979562938 979635179 979641795 979622364 979590952
2516.6I79590952O438P6770R6441Q2075O1572K3127j5855l5644l5882M7386J39177
$$ 979590952 979597390 979674160 979770601 979852676 979914248 979937375 979921520 979885876 979849994 979897380 980036557
2539I80036557R2983%n8115p7903o1869k7776J2994k802p6830j33395j03236j1623
$$ 980036557 980129540 980129540 980071425 979993522 979931653 979903877 979916871 979914069 979837239 979703844 979600608 979588985
2563.5I79588985K7657l6001j06752j7762Q5234k2173j00791l1948o1631j61291j51395
$$ 979588985 979616642 979580641 979473889 979456127 979541361 979519188 979418397 979386449 979324818 979163527 979012132
2585.9I79012132r9242j21057j25647l1054O2228L9815l9339l4034p4982j51217l8684
$$ 979012132 978912890 978791833 978666186 978635132 978697360 978737175 978697836 978663802 978588820 978437603 978398919
2608.4I78398919M4823l7372q4400o8784l7909o1869j24097j00136m5180n4479j18733
$$ 978398919 978443742 978406370 978321970 978253186 978215277 978153408 978029311 977929175 977883995 977829516 977710783
2630.8I77710783j91152k03967j38998k3246R0123Q9526k9266p4863L7789J31547L8565
$$ 977710783 977519631 977315664 977176666 977153420 977243543 977333069 977303803 977228940 977266729 977398276 977436841
2653.2I77436841q6368m1306M5896M2498k384l9399J2577J04666M7087n9604o4493
$$ 977436841 977350473 977309167 977355063 977397561 977395177 977355778 977368355 977473021 977520108 977460504 977396011
2675.7I77396011l8802k0504k6584l4869m5776j16110j11461j1444k3901q7798o4552
$$ 977396011 977357209 977336705 977310121 977275252 977229476 977113366 977001905 976990461 976966560 976878762 976814210
2698.1I76814210o7293j04249p6055o2347p5996j52051k55525j51515l1412j06215
$$ 976814210 976746917 976642668 976566613 976504266 976428270 976276219 976020694 975869179 975837767 975731552
2718.5I75731552j81616k00808j65343K3067J85072O8188n7697J6570M3750J6629O6162
$$ 975731552 975549936 975349128 975183785 975206852 975391924 975460112 975402415 975418985 975462735 975479364 975545526
2740.9I75545526R9837L7194n1558O497J64508J82569O9738k0504o2466q9705q6903
$$ 975545526 975645363 975682557 975630999 975637496 975802004 975984573 976054311 976033807 975971341 975881636 975794733
2763.4I75794733k6524K3901l8803j57594j67311k5451M9591o8366j52529j20401j53541
$$ 975794733 975768209 975792110 975753307 975595713 975428402 975402951 975452542 975384176 975231647 975111246 974957705
2785.8I74957705k18213j86145k03431k38657j60098j13070j45912k05696k58148k54035
$$ 974957705 974739492 974553347 974349916 974111259 973951161 973838091 973692179 973486483 973228335 972974300
2806.2I72974300j93238r6738o4016j62959k28524j68562j77145k89261l52800l35217
$$ 972974300 972781062 972684324 972620308 972457349 972228825 972060263 971883118 971593857 971241057 970905840
2826.6I70905840k74777k34783l25560n20587o75977q30292j005292j173675j448035
$$ 970905840 970631063 970396280 970070720 969550133 968874156 968043864 967038572 965864897 964416862
2844.9I64416862j716078j697063j435519j192390j041890j007378j046896r84788
$$ 964416862 962700784 961003721 959568202 958375812 957333922 956326544 955279648 954294860
2861.2I54294860r48906j074135j166403j115084j015007r21190q22783p32004o11127
$$ 954294860 953345954 952271819 951105416 949990332 948975325 948054135 947231352 946499348 945888221
2879.6I45888221m62413m04536l68417j64508J5378j0908k1815P8797K14279L20196
$$ 945888221 945425808 945021272 944652855 944488347 944503725 944492817 944471002 944549799 944764078 945084274
2900I45084274K94089J93298J30713o080k54273m96686o85632o78718n37515m77433
$$ 945084274 945378363 945571661 945702374 945696294 945442021 944945335 944259703 943580985 943043470 942566037
2920.4I42566037l92377k76387l43800o12914r39429j208305j326382j229763q92222
$$ 942566037 942173660 941897273 941553473 940940559 940001130 938792825 937466443 936236680 935344458
2938.7I35344458l86835O4373L41714M98772N65230N11289L80457L34501L77118L97146
$$ 935344458 934957623 935021996 935363710 935862482 936427712 936939001 937319458 937653959 938031077 938428223
2959.1I38428223N74827J056373J577199J993000K372444K566576K412498K052426
$$ 938428223 939003050 940059423 941636622 943629622 946002066 948568642 950981140 953033566
2975.4I53033566J749337J494646J100064P02679O09100O74963N68568M70698N67496
$$ 953033566 954782903 956277549 957377613 958080292 958689392 959364355 959932923 960403621 960971117
2993.8I60971117O54757O59466N88894N14686N15640M72247L59416K85208K39075J34349
$$ 960971117 961625874 962285340 962874234 963388920 963904560 964376807 964736223 965021431 965260506 965394855
3014.2I65394855L3080m053M4465K24531L84271M30167M44352L97980L69549M27425
$$ 965394855 965427935 965423882 965468347 965692878 966077149 966507316 966951668 967349648 967719197 968146622
3034.6I68146622M20928L43323L19481L39806L15607K30252J33217O9558K9445N6565
$$ 968146622 968567550 968910873 969230354 969570160 969885767 970116019 970249236 970318794 970348239 970404804
3055I70404804J15812J16348J10388N7816J1802L7849J6570R894N0426j3590q6308
$$ 970404804 970520616 970636964 970747352 970805168 970816970 970854819 970871389 970881283 970931709 970918119 970831811
3077.4I70831811k8967k4438p1526j7047J6391j8596p1526j58429j80304j34706j45972
$$ 970831811 970802844 970778406 970706880 970689833 970706224 970687628 970616102 970457673 970277369 970142663 969996691
3099.8I69996691k11060j79887l934O1572n5194j21117n7697j8001p8797j11282j05679
$$ 969996691 969785631 969605744 969601810 969663382 969608188 969487071 969429374 969411373 969332576 969221294 969115615
3122.3I69115615j50323j83582j67847j80841k42114k62260k05338j27435o7591j49250
$$ 969115615 968965292 968781710 968613863 968433022 968190908 967928648 967723310 967595875 967528284 967379034
3142.7I67379034k65718k28226k51174l39031k73109j32143j25230k12371k98023l58165
$$ 967379034 967113316 966885090 966633916 966294885 966021776 965889633 965764403 965552032 965254009 964895844
3163.1I64895844k73704j42932j71781l20136l78788l16202l24011l71099l17692k73049
$$ 964895844 964622140 964479208 964307427 963987291 963608503 963292301 962968290 962597191 962279499 962006450
3183.5I62006450l13998l58700l99888m16756l94880l22581k30729k71559m43876n29051
$$ 962006450 961692452 961333752 960933864 960517108 960122228 959799647 959568918 959297359 958853483 958324432
3203.8I58324432m61161m37915m72963m52280l80337l31760l58939l68476l26454l04342
$$ 958324432 957863271 957425356 956952393 956500113 956119776 955788016 955429077 955060601 954734147 954429805
3224.2I54429805l44276m20690m22299l17752k74241l28302l49641l16799l23474m06742
$$ 954429805 954085529 953664839 953242540 952924788 952650547 952322245 951972604 951655805 951332331 950925589
3244.6I50925589m34935m43101m60864l32117j85906k32518l47913l40282k90990k96176
$$ 950925589 950490654 950047553 949586689 949254572 949068666 948836148 948488235 948147953 947856963 947560787
3265I47560787l26514l86894l43859j67727j74642l02732k65777j96278k04563k53916
$$ 947560787 947234273 946847379 946503520 946335793 946161151 945858419 945592642 945396364 945191801 944937885
3285.4I44937885l44694l83198l39806l21448l05653l12507l98397l79741j88292j33037
$$ 944937885 944593191 944209993 943870187 943548739 943243086 942930579 942532182 942152441 941964149 941831112
3305.8I41831112l85642o11842n10573k40505j40488k66612m13000m69685m81903m72427
$$ 941831112 941445470 940833628 940323055 940082550 939942062 939675450 939262450 938792765 938310862 937838435
3326.2I37838435m03821l80397m59075n16176m61340m28617n81563o88433n40317l53634
$$ 937838435 937434614 937054217 936595142 936078966 935617626 935189009 934607446 933919013 933378696 933025062
3346.6I33025062m00364n57602n61893n28991n81324n65529m78268n40435p18296p10248
$$ 933025062 932624698 932067096 931505203 930976212 930394888 929829359 929351091 928810656 928092360 927382112
3367I27382112n18084m02093m80294o36399o38545m42802l06368m82798p50542o52551
$$ 927382112 926864028 926461935 925981641 925345242 924706697 924263895 923957527 923474729 922724187 922071636
3387.4I22071636l60489l40223n00918n63383n61476n55753n13494m58539l71099m18543
$$ 922071636 921711147 921370924 920870006 920306623 919745147 919189394 918675900 918217361 917846262 917427719
3407.8I17427719o05882n88238m73499m64440m59015m69386n18799m34697l39508n43833
$$ 917427719 916821837 916233599 915760100 915295660 914836645 914367259 913848460 913413763 913074255 912530422
3428.2I12530422p83920p23064n24998l33547j51396j27196l39807n52296n03123l40164
$$ 912530422 911746502 911023438 910498440 910164893 910013497 909886301 909546494 908994198 908491075 908150911
3448.6I08150911l54230m11093l49164l51966m08113l60191k97546k75552k67446k50101
$$ 908150911 907796681 907385588 907036424 906684458 906276345 905916154 905618608 905343056 905075610 904825509
3469I04825509k11537q5652Q8692N3644j8001J54913K11000Q4937J88291L50475L51429
$$ 904825509 904613972 904528320 904617012 904670656 904652655 904807568 905018568 905103505 905291796 905642271 905993700
3491.4I05993700L12448K07781K45035L99649K96354K95043N29528N32746L95000K96474
$$ 905993700 906306148 906513929 906758964 907158613 907454967 907750010 908279538 908812284 909207284 909503758
3511.8I09503758K84195L71218L77357L35693L66271M15921M62532M70221N04553M80473
$$ 909503758 909787953 910159171 910536528 910872221 911238492 911654413 912116945 912587166 913091719 913572192
3532.2I13572192L58939L96252M42267L74257L75688M28260N43832O78599P17759O82533
$$ 913572192 913931131 914327383 914769650 915143907 915519595 915947855 916491687 917170286 917888045 918570578
3552.6I18570578N70834M87685N25296O30080O61910N74172M93586M92692O14047O59823
$$ 918570578 919141412 919629097 920154393 920784473 921446383 922020555 922514141 923006833 923620880 924280703
3573I24280703N92113O38067P35164P52687N84126M00960N12898O71149O13749N02407
$$ 924280703 924872816 925510883 926246047 926998734 927582860 927983820 928496718 929167867 929781616 930284023
3593.4I30284023M89056P03454Q43049O44266M33684M82499O29246P03633P04765O64890
$$ 930284023 930773079 931476533 932319582 932963848 933397532 933880031 934509277 935212910 935917675 936582565
3613.7I36582565O95825Q26597J018405J065433R76980R26435J097560J440406J352906
$$ 936582565 937278390 938104987 939123392 940188825 941165805 942092240 943189800 944630206 945983112
3632.1I45983112J197040J205087J355588J522005J498401J430571J396537J539230
$$ 945983112 947180152 948385239 949740827 951262832 952761233 954191804 955588341 957127571
3648.4I57127571J832306J661242J437783J594722J664579J469672J330852J353145
$$ 957127571 958959877 960621119 962058902 963653624 965318203 966787875 968118727 969471872
3664.7I69471872J348793J239539J080930R22739J192153J378953R62734P51436O98328
$$ 969471872 970820665 972060204 973141134 974063873 975256026 976634979 977597713 978349149 979047477
3683.1I79047477N32270L49462L58581N98252N67019L85821M08053L67940K03013K33770
$$ 979047477 979579747 979929209 980287790 980886042 981453061 981838882 982246935 982614875 982817888 983051658
3703.5I83051658L12507J64151j02103k26676P3731L20792J19448j15753r0241P8082
$$ 983051658 983364165 983528316 983426213 983199537 983273268 983594060 983713508 983597755 983507514 983585596
3723.9I83585596K62320K71082R4056j32739l60847k77460Q1897K07126R4057n6506
$$ 983585596 983847916 984118998 984213054 984080315 983719468 983442008 983523905 983731031 983825088 983768582
3744.3I83768582P8261J86801k4736n4419J85490K19762J06096Q0050R2744Q9765J52171
$$ 983768582 983846843 984033644 984008908 983954489 984139979 984359741 984465837 984545887 984638631 984728396 984880567
3766.7I84880567O5386o1452k6286j45137k28167j4782K27273K62677J02878q4758
$$ 984880567 984945953 984884501 984858215 984713078 984484911 984470129 984697402 984960079 985062957 984978199
3787.1I84978199o8307O2764R4056N3108J5676l2723j29581q5115P2300Q0586J3232
$$ 984978199 984909892 984972656 985066712 985119820 985135496 985102773 984973192 984888077 984960377 985040963 985054195
3809.5I85054195k4915j30296k77936j42217M8995K0147J32262K56241J53839j07228
$$ 985054195 985029280 984898984 984621048 984478831 984527826 984547973 984680235 984936476 985090315 984983087
3829.9I84983087l19720q1837K75016L2842j77562R4235J80661M7386J2696j6570k81453
$$ 984983087 984663367 984581530 984856546 984889388 984711826 984806061 984986722 985034108 985046804 985030234 984748781
3852.3I84748781l96252N662J97411J75834P9572o8128j1027J16348q9705k68161j07884
$$ 984748781 984352529 984358191 984555602 984731436 984811008 984742880 984731853 984848201 984758496 984490335 984382451
3874.8I84382451j3829j36614r2744N5551N2691K05636J57773j90317j30237J24634
$$ 984382451 984368622 984232008 984139264 984194815 984247506 984453142 984610915 984420598 984290361 984414995
3895.2I84414995M2915r2089j48416q4340K28524L18348J76788N1439j08660j61946
$$ 984414995 984457910 984365821 984217405 984133065 984361589 984679937 984856725 984908164 984799504 984637558
3915.6I84637558j61886k10106k26379k07662N2094L08514J41680j77204k22207L4631
$$ 984637558 984475672 984265566 984039187 983831525 983883619 984192133 984333813 984156609 983934402 983969033
3936I83969033K75731J75178j84298k81572l1173J30534J95086K39432L6418j45435
$$ 983969033 984244764 984419942 984235644 983954072 983922899 984053433 984248519 984487951 984524369 984378934
3956.3I84378934l2008l6835k13504k43306r5666Q5116P4982q3566o3657o5565k04683
$$ 984378934 984346926 984310091 984096587 983853281 983757615 983842731 983917713 983834147 983770490 983704925 983500242
3978.8I83500242L7909L79324K79963o0976k17855j21236j00731j0968J46509
$$ 983500242 983538151 983917475 984197438 984136462 983918607 983797371 983696640 983685672 983832181
3997.1I83832181
$$ 983832181
##END=$$ End of the data block
