##TITLE=P1 $$ Begin of the data block
##JCAMP-DX=5.00 $$ ACD/SpecManager v 10.08
##SPECTROMETER/DATA SYSTEM=Alpha
##DATE=26 Feb 2015 09:50:54
##DATA TYPE=INFRARED SPECTRUM
##DATA CLASS=XYDATA
##ORIGIN=
##OWNER=
##NPOINTS=1667
##FIRSTX=599.57470703
##LASTX=3997.16503906
##MAXX=3997.16503906
##MINX=599.57470703
##MAXY=0.98592299
##MINY=0.14597039
##XFACTOR=1.0000000000
##YFACTOR=1.000000000000000e-9
##FIRSTY=0.47766602
##DELTAX=2.03937006
##XUNITS=1/CM
##YUNITS=ARBITRARY UNITS
##XYDATA=(X++(Y..Y))
$$ plain form
599.6 477666020 478018492 487686336 506113708 529826224 554863930 577193499 594382882 607159913
615.9 607159913 617067158 625201225 632517934 639569163 646396935 653349757 660402298 666709363
632.2 666709363 671436965 674911022 677948058 680627227 683232844 687038660 693092346 700749815
648.5 700749815 708065987 713882744 718903124 724069178 729951501 736673236 743144929 747875333
664.8 747875333 750947475 752245188 752009094 751684427 751455486 751497924 752088487 752942085 754038215
683.2 754038215 755305231 756440520 758074641 760949433 764930427 769317091 773280025 776795149
699.5 776795149 780546725 784854114 789562583 794388473 798867166 802625477 805631280 807838321
715.8 807838321 809630215 812054574 815944910 821243167 827221036 833171904 838796437 844015002
$$ packed form
599.6D77666020L52472R667844J8427372K3712516K5037706K2329569J7189383J2777031
615.9F07159913R907245Q134067P316709P051229O827772O952822P052541O307065
632.2F66709363M727602L474057L037036K679169K605617L805816O053686P657469
648.5G00749815P316172N816757N020380N166054N882323O721735O471693M730404
664.8G47875333L072142J297713k36094l24667k28941M2438N90563Q53598J096130
683.2G54038215J267016J135289J634121K874792L980994M386664L962934L515124
699.5G76795149L751576M307389M708469M825890M478693L758311L005803K207041
715.8H07838321J791894K424359L890336N298257N977869N950868N624533N218565
$$ plain form
732.1 844015002 848733664 852594197 855551183 857980013 859812379 861107409 862300634 863667130
748.4 863667130 865136206 866548300 867784858 868753791 869662642 870732725 871847272 872758329 873378813
766.8 873378813 873770177 873987675 874090433 874561667 875927567 877836347 879324794 880019903 880359530
785.2 880359530 880601168 880802691 881081462 881281674 881168187 880939007 880944908 881193280 881370962 881256700
805.6 881256700 880996048 880797446 880653024 880377352 879816294 878952563 877839804 876306117 874188483
823.9 874188483 871345758 867406487 862402499 856941402 851807296 847881258 845961750 846098423 847726047
842.3 847726047 850311399 853384852 856289208 858250260 858952165 858415127 856572807 853395224 848601639
860.6 848601639 841674566 832293212 819977403 804557443 787090600 769704044 754973054 744723260
$$ packed form
732.1H44015002M718662L860533K956986K428830J832366J295030J193225J366496
748.4H63667130J469076J412094J236558R68933R08851J070083J114547R11057O20484
766.8H73378813L91364K17498J02758M71234J365900J908780J488447O95109L39627
785.2H80359530K41638K01523K78771K00212j13487k29180N901K48372J77682j14262
805.6H81256700k60652j98602j44422k75672n61058q63731j112759j533687k117634
823.9H74188483k842725l939271n003988n461097n134106l926038j919508J36673J627624
842.3H47726047K585352L073453K904356J961052P01905n37038j842320l177583m793585
860.6H48601639o927073r381354j2315809j5419960j7466843j7386556j4730990j0249794
$$ plain form
876.9 744723260 739034235 736198366 733545125 728658557 719895840 706140220 686971605 663404167
893.2 663404167 638646841 617612779 604557693 601052582 606091797 617475927 632836998 649938822
909.6 649938822 666722655 681594133 693973005 704423606 713990629 723314106 732529759 741525590
925.9 741525590 749893785 757080197 762710392 766549408 768358350 767937779 765263081 760450006 753594100
944.2 753594100 745034575 735664964 726998687 720601797 717170417 716265738 716407239 715202689 709753215
962.6 709753215 697895288 679361165 655702412 629304945 602389634 576575577 552649081
976.9 552649081 530709326 510620952 492144436 475157529 459932595 446543783 434141189
991.1 434141189 421153486 405931860 387407064 365739554 342148542 317994177 294247895
$$ packed form
876.9G44723260n689025k835869k653241m886568q762717j3755620j9168615k3567438
893.2F63404167k4757326k1034062j3055086l505111N039215J1384130J5361071J7101824
909.6F49938822J6783833J4871478J2378872J0450601R567023R323477R215653Q995831
925.9G41525590Q368195P186412N630195L839016J808942m20571k674698m813075o855906
944.2G53594100q559525r369611q666277o396890l431380r04679J41501j204550n449474
962.6G09753215j1857927j8534123k3658753k6397467k6915311k5814057k3926496
976.9E52649081k1939755k0088374j8476516j6986907j5224934j3388812j2402594
991.1D34141189j2987703j5221626j8524796k1667510k3591012k4154365k3746282
$$ plain form
1005.4 294247895 271494359 250108629 230329946 212339997 196293041 182364792 170670763
1019.7 170670763 161164373 153806955 148671478 145970389 146143734 149566472 155979231 164559722
1036 164559722 174251646 184195265 194084540 204243734 215346485 227942899 242420897 258977741
1052.3 258977741 277384251 296905190 316361636 334307313 349801362 363077968 375370175
1066.6 375370175 388121128 402211726 417679638 434011936 450753570 467658192 484652370
1080.9 484652370 501856327 519473672 537696481 556612015 575893939 594799817 612489164
1095.1 612489164 628024876 640658855 650198817 656691968 660255134 661383450 660723805 658777714
1111.5 658777714 656020641 652823865 649498641 646462202 644386053 644211173 646717131 652173221
$$ packed form
1005.4B94247895k2753536k1385730j9778683j7989949j6046956j3928249j1694029
1019.7A70670763r506390p357418n135477k701089J73345L422738O412759Q580491
1036A64559722R691924R943619R889275J0159194J1102751J2596414J4477998J6556844
1052.3B58977741J8406510J9520939J9456446J7945677J5494049J3276606J2292207
1066.6C75370175J2750953J4090598J5467912J6332298J6741634J6904622J6994178
1080.9D84652370J7203957J7617345J8222809J8915534J9281924J8905878J7689347
1095.1F12489164J5535712J2633979R539962O493151L563166J128316o59645j946091
1111.5F58777714k757073l196776l325224l036439k076149j74880K505958N456090
$$ plain form
1127.8 652173221 660256565 670023859 680251658 689867556 698036075 703919709 706460357 704590201
1144.1 704590201 697621107 685859919 670900643 655070841 640651464 629384577 622386992 619986057
1160.4 619986057 621606648 626255214 633061290 641272962 650178194 659397602 668963313 678689241
1176.7 678689241 687831938 695280850 699520707 698658109 690705419 673780859 646256626 607266188
1193 607266188 557301223 498505145 435022712 372733891 317523599 273203611 240884691 219663709
1209.4 219663709 207587719 202614963 203007430 207110584 213446066 220973924 229104906 237889081
1225.7 237889081 247863322 259758800 274227887 291544080 311501622 333655447 357475042
1239.9 357475042 382374913 407960236 433887690 459914088 486000568 512126327 538142979
$$ packed form
1127.8F52173221Q083344R767294J0227799R615898Q168519N883634K540648j870156
1144.1G04590201o969094j1761188j4959276j5829802j4419377j1266887o997585k400935
1160.4F19986057J620591M648566O806076Q211672Q905232R219408R565711R725928
1176.7F78689241R142697P448912M239857q62598p952690j6924560k7524233l8990438
1193F07266188m9964965n8796078o3482433o2288821n5210292m4319988l2318920k1220982
1209.4B19663709j2075990m972756L92467M103154O335482P527858Q130982Q784175
1225.7B37889081R974241J1895478J4469087J7316193J9957542K2153825K3819595
1239.9C57475042K4899871K5585323K5927454K6026398K6086480K6125759K6016652
$$ plain form
1254.2 538142979 563773692 588873208 613470256 637402713 660465837 682629526 703923404
1268.5 703923404 724493563 744268954 762876034 780066729 795724809 809728622 822057664
1282.8 822057664 832813740 842213869 850416720 857583821 864022791 869979501 875418425 880041659
1299.1 880041659 883571208 885755658 886423767 885740280 884084523 881736875 879118085 876820326 875227094
1317.4 875227094 874464750 874469161 875203431 876708806 878819644 881190658 883536577 885538161 886904001
1335.8 886904001 887532413 887402356 886362791 884121060 880140483 873433828 862444580 845016778
1352.1 845016778 818633735 782018304 737588167 690199137 646152198 615226924 601365507
1366.4 601365507 600705147 609101176 623150706 640846312 659068346 677257240 697594285 720581293
$$ packed form
1254.2E38142979K5630713K5099516K4597048K3932457K3063124K2163689K1293878
1268.5G03923404K0570159J9775391J8607080J7190695J5658080J4003813J2329042
1282.8H22057664J0756076R400129Q202851P167101O438970N956710N438924M623234
1299.1H80041659L529549K184450O68109o83487j655757k347648k618790k297759j593232
1317.4H75227094p62344M411P34270J505375K110838K371014K345919K001584J365840
1335.8H86904001O28412j30057j039565k241731l980577o706655j0989248j7427802
1352.1H45016778k6383043l6615431m4430137m7389030m4046939l0925274j3861417
1366.4F01365507o60360Q396029J4049530J7695606J8222034J8188894K0337045K2987008
$$ plain form
1382.7 720581293 745528162 773052156 800684988 823314071 841896653 858195603 870360613
1397 870360613 878077269 882354140 883977592 884128511 883440673 881947219 879600823 876591980 873099983
1415.3 873099983 868884385 863937616 859239876 854736447 850184917 846214473 843311250 842257500
1431.6 842257500 843203008 846360505 851871014 857598066 863097191 868515790 873526633 878168225
1448 878168225 882026613 884851694 887086391 890175045 895257950 900125563 904575944 910205781 916639686
1466.3 916639686 922105610 926869333 932085752 937065959 940861046 943797171 946049392 947826207
1482.6 947826207 949123979 949892163 950401008 951238692 952134430 952592432 952812970 953073859 953325033
1501 953325033 953381598 952926099 952115119 952135682 952472091 952551782 952449441 952482820 952713609 952890873 953029752
$$ packed form
1382.7G20581293K4946869K7523994K7632832K2629083J8582582J6298950J2165010
1397H70360613P716656M276871J623452J50919o87838j493454k346396l008843l491997
1415.3H73099983m215598m946769m697740m503429m551530l970444k903223j053750
1431.6H42257500R45508L157497N510509N727052N499125N418599N010843M641592
1448H78168225L858388K825081K234697L088654N082905M867613M450381N629837O433905
1466.3I16639686N465924M763723N216419M980207L795087K936125K252221J776815
1482.6I47826207J297772P68184N08845Q37684Q95738M58002K20538K60889K51174
1501I53325033N6565m55499q10980K0563L36409P9691j02341L3379K30789J77264J38879
$$ plain form
1523.4 953029752 953170598 953364968 953547597 953511655 953284204 953176916 953018904 952538729 952183962 952333987
1543.8 952333987 952669978 952806711 952794373 952859581 952849507 952575445 952241480 952540517 953083575 953264534
1564.2 953264534 953224659 952996612 952591956 952248216 951820493 951233983 950850904 950542986 949907005 949041307
1584.6 949041307 948031127 946832895 945547462 944236815 942826927 941203892 939260662 936820507
1600.9 936820507 933960795 930820644 927419484 923828363 920410812 917212307 913486362 908837676
1617.2 908837676 904806614 901357055 897502661 894068956 891424298 889269948 887632787 886319041
1633.6 886319041 885242701 884806931 884901941 885183752 885586083 886305451 887751281 889139533 890727460
1651.9 890727460 893764198 896579802 898661256 900582671 902639985 904687107 906175077 907153010
$$ packed form
1523.4I53029752J40846J94370J82629l5942k27451j07288j58012m80175l54767J50025
1543.8I52333987L35991J36733j2338O5208j0074k74062l33965K99037N43058J80959
1564.2I53264534l9875k28047m04656l43740m27723n86510l83079l07918o35981q65698
1584.6I49041307j010180j198232j285433j310647j409888j623035j943230k440155
1600.9I36820507k859712l140151l401160l591121l417551l198505l725945m648686
1617.2I08837676m031062l449559l854394l433705k644658k154350j637161j313746
1633.6H86319041j076340m35770R5010K81811M02331P19368J445830J388252J587927
1651.9H90727460L036738K815604K081454J921415K057314K047122J487970R77933
$$ plain form
1668.2 907153010 908036947 908656180 908840895 908460855 907354891 905599654 903000236 899128675 895147502
1686.6 895147502 891059458 885639429 879446924 871160328 860285282 847676218 830509543 812795281
1702.9 812795281 792632282 765437543 734496772 700347185 662076890 618621051 567006707
1717.2 567006707 518247187 482968986 453972340 428869337 410249501 397112101 388971359
1731.4 388971359 386335492 388779104 393227756 401247650 413014680 426106334 440697432 457468629
1747.8 457468629 479099154 505482733 532870948 565337896 605930388 650694847 701702654
1762 701702654 750356257 789854765 824161828 852252305 875308454 892707765 904137850 912931681
1778.4 912931681 920627892 926928520 932213902 936645031 940157056 943100810 946111083 948805332
$$ packed form
1668.2I07153010Q83937O19233J84715l80040j105964j755237k599418l871561l981173
1686.6H95147502m088044n420029o192505q286596j0875046j2609064j7166675j7714262
1702.9H12795281k0162999k7194739l0940771l4149587l8270295m3455839n1614344
1717.2E67006707m8759520l5278201k8996646k5103003j8619836j3137400q140742
1731.4C88971359k635867K443612M448652Q019894J1767030J3091654J4591098J6771197
1747.8D57468629K1630525K6383579K7388215L2466948M0592492M4764459N1007807
1762G01702654M8653603L9498508L4307063K8090477K3056149J7399311J1430085Q793831
1778.4I12931681P696211O300628N285382M431129L512025K943754L010273K694249
$$ plain form
1794.7 948805332 950908482 952798128 954594195 956507444 958252549 959736526 960945308 962244809
1811 962244809 963630974 964894831 966045678 967147231 968118846 968853533 969677627 970536470 971379697
1829.3 971379697 972162902 972860932 973393798 973882496 974318922 974519670 974675059 975060105 975557506 975862503
1849.7 975862503 976084709 976258159 976387203 976497471 976662636 976830542 976890683 976790786 976653099 976809084
1870.1 976809084 977187872 977596760 977802694 977819741 977767706 977700591 977691770 977767467 977826059 977879822 977934659
1892.6 977934659 977887332 977918148 977977931 977907836 977714598 977501452 977252066 976954341 976793587 976790965 976675153
1915 976675153 976366460 976142228 976007462 975965917 976062894 976156354 976163745 976105571 976040065 976026833 976036727 975923598
1939.5 975923598 975688457 975574374 975690603 975826621 975893140 975920439 975946665 975987732 976051629 976160526
$$ packed form
1794.7I48805332K103150J889646J796067J913249J745105J483977J208782J299501
1811I62244809J386165J263857J150847J101553R71615P34687Q24094Q58843Q43227
1829.3I71379697P83205O98030N32866M88698M36426K00748J55389L85046M97401L04997
1849.7I75862503K22206J73450J29044J10268J65165J67906O0141r9897j37687J55985
1870.1I76809084L78788M08888K05934J7047n2035o7115q821P5697N8592N3763N4837
1892.6I77934659m7327L0816N9783p0095j93238k13146k49386k97725j60754k622j15812
1915I76675153l08693k24232j34766m1545R6977R3460P391n8174o5506j3232R894j13129
1939.5I75923598k35141j14083J16229J36018O6519K7299K6226M1067O3897J08897
$$ plain form
1959.9 976160526 976283729 976386487 976485491 976647675 976835132 977024674 977198660 977352440 977521956 977667570
1980.3 977667570 977751136 977787733 977812648 977845609 977890670 977922976 977927566 977872729 977769494 977706254 977674007
2002.7 977674007 977636456 977651417 977690995 977619171 977416754 977198720 977051675 976987660 976974905 976949751 976897359
2025.1 976897359 976863325 976813734 976726711 976711333 976725638 976672649 976627529 976665676 976719081 976694047 976679683
2047.6 976679683 976734936 976763189 976688981 976573348 976496816 976435959 976412416 976478100 976549387 976495802 976357460
2070 976357460 976254940 976160586 976039767 975947082 975880504 975874662 975869238 975686729 975407004 975150526 974863648
2092.4 974863648 974573970 974356055 974247575 974146605 973893821 973594248 973365664 973162770 973001540 972866535
2112.8 972866535 972686231 972575545 972586751 972626746 972675085 972676456 972663164 972718000 972844422 973005176 973159373
$$ packed form
1959.9I76160526J23203J02758R9004J62184J87457J89542J73986J53780J69516J45614
1980.3I77667570Q3566L6597K4915L2961M5061L2306M590n4837j03235o3240l2247
2002.7I77674007l7551J4961L9578p1824k02417k18034j47045o4015j2755k5154n2392
2025.1I76897359l4034m9591q7023j5378J4305n2989m5120L8147N3405k5034j4364
2047.6I76679683N5253K8253p4208j15633p6532o0857k3543O5684P1287n3585j38342
2070I76357460j02520r4354j20819r2685o6578n842n424j82509k79725k56478k86878
2092.4I74863648k89678k17915j08480j00970k52784k99573k28584k02894j61230j35005
2112.8I72866535j80304j10686J1206L9995M8339J371j3292N4836J26422J60754J54197
$$ plain form
2135.2 973159373 973310888 973475516 973658741 973846853 974008560 974129498 974316359 974630833 974915028 975057602
2155.6 975057602 975195229 975428104 975719690 976013184 976294398 976607800 976840854 976922691 977006376 977215230
2176 977215230 977483869 977700710 977888763 978070855 978209019 978313565 978399575 978409052 978386700 978462100 978606284
2198.5 978606284 978755951 978914618 979000270 979028583 979074419 979105771 979161978 979235709 979292393 979373693 979437292
2220.9 979437292 979429781 979407012 979436994 979503572 979565799 979609191 979599833 979565382 979559004 979571760 979641199 979744136
2245.4 979744136 979804218 979800403 979711413 979645908 979683697 979704916 979644179 979540288 979431510 979343891 979345143
2267.8 979345143 979480267 979619324 979668975 979699731 979772627 979880154 979958951 980000079 980062485 980140269 980222464
2290.2 980222464 980321527 980418324 980520427 980652809 980792165 980843484 980770946 980658770 980563164 980510950 980505586
$$ packed form
2135.2I73159373J51515J64628J83225J88112J61707J20938J86861L14474K84195J42574
2155.6I75057602J37627K32875K91586K93494K81214L13402K33054Q1837Q3685K08854
2176I77215230K68639K16841J88053J82092J38164J04546Q6010R477k2352P5400J44184
2198.5I78606284J49667J58667Q5652K8313M5836L1352N6207P3731N6684Q1300O3599
2220.9I79437292p511k2769K9982O6578O2227M3392r358l4451o378J2756O9439J02937
2245.4I79744136O0082l815q8990o5505L7789K1219o0737j03891j08778q7619J252
2267.8I79345143J35124J39057M9651L0756P2896J07527P8797M1128O2406P7784Q2195
2290.2I80222464R9063R6797J02103J32382J39356N1319p2538j12176r5606n2214n364
$$ plain form
2312.7 980505586 980498374 980484247 980473101 980476797 980628252 980935037 981182933 981290996 981326818 981357813 981424212
2335.1 981424212 981488407 981415391 981178403 980898619 980669141 980602682 980671704 980717719 980714560 980869472 981034517
2357.5 981034517 980918765 980884135 981001854 980978310 980807245 980656266 980620384 980536580 980353057 980270863
2377.9 980270863 980389118 980519712 980529904 980542541 980636060 980732203 980754554 980698943 980600059 980461299 980310559
2400.4 980310559 980222762 980173647 980102539 980042279 980040252 980042219 980001628 979963362 979932427 979916036 979901373 979858398
2424.8 979858398 979859829 979904592 979914069 979949296 980031312 980052173 979953170 979815722 979818046 979880154 979809999 979716539
2449.3 979716539 979725361 979757130 979708374 979597390 979518056 979482472 979424477 979367435 979386568 979422867 979396939
2471.7 979396939 979398727 979499340 979565084 979525089 979515195 979597867 979695678 979758859 979813397 979894698 979972541 979984641
$$ packed form
2312.7I80505586p212j4127j1146L696J51455L06785K47896J08063L5822L0995O6399
2335.1I81424212O4195p3016k36988k79784k29478o6459O9022M6015l159J54912J65045
2357.5I81034517j15752l4630J17719k3544j71065j50979l5882q3804j83523q2194
2377.9I80270863J18255J30594J0192J2637R3519R6143K2351n5611r8884j38760j50740
2400.4I80310559q7797m9115p1108o0260k027J967m0591l8266l0935j6391j4663m2975
2424.8I79858398J431M4763R477L5227Q2016K0861r9003j37448K324O2108p0155r3460
2449.3I79716539Q822L1769m8756j10984p9334l5584n7995n7042J9133L6299k5928
2471.7I79396939J788J00613O5744l9995r894Q2672R7811O3181N4538Q1301P7843J2100
$$ plain form
2496.2 979984641 979951024 979943335 979965270 980047226 980177343 980244398 980257630 980330527 980450094 980485499 980457008
2518.6 980457008 980469286 980514169 980544865 980568290 980596364 980566442 980494559 980496287 980562687 980601311 980589211 980563939
2543.1 980563939 980553448 980545044 980525792 980520308 980584323 980665684 980630755 980549514 980544925 980531931 980449080 980358839
2567.6 980358839 980281472 980209053 980114698 979969025 979898810 979942143 979905427 979781449 979718208 979713976 979719996
2590 979719996 979755819 979770482 979676545 979551256 979501784 979498029 979453981 979354143 979266405 979219139 979193628 979166448
2614.5 979166448 979111850 979073822 979057491 978990436 978922248 978895783 978801310 978598952 978428185 978361785 978338897
2636.9 978338897 978313088 978253484 978195131 978239477 978372216 978383362 978232324 978129506 978141546 978195131 978249848
2659.3 978249848 978342652 978456318 978462040 978415489 978433728 978452265 978452146 978431463 978366196 978324890 978367031 978429437
$$ packed form
2496.2I79984641l3617p689K1935Q1956J30117O7055J3232P2897J19567L5405k8491
2518.6I80457008J2278M4883L0696K3425K8074k9922p1883J728O6400L8624j2100k5272
2543.1I80563939j0491q404j9252n484O4015Q1361l4929q1241m589j2994q2851r0241
2567.6I80358839p7367p2419r4355j45673p0215M3333l6716j23978o3241m232O020
2590I79719996L5823J4663r3937j25289m9472l755m4048r9838q7738m7266k5511k7180
2614.5I79166448n4598l8028j6331o7055o8188k6465r4473k02358j70767o6400k2888
2636.9I78338897k5809n9604n8353M4346J32739J1146j51038j02818J2040N3585N4717
2659.3I78249848R2804J13666N722m6551J8239J8537j19k0683o5267m1306M2141O2406
$$ plain form
2683.8 978429437 978378475 978188455 977979422 977906883 977955222 977929831 977785170 977680564 977646887 977547526 977384746
2706.3 977384746 977298021 977322042 977348149 977246523 977056742 976941943 976847291 976667345 976506531 976449370
2726.6 976449370 976481438 976520121 976554573 976639688 976682842 976651430 976621330 976652563 976810813 976966619 976959765
2749.1 976959765 976917744 976987541 977103889 977144003 977101386 977085769 977084994 976988792 976891398 976872683 976851881 976821899
2773.5 976821899 976751328 976565540 976343155 976205647 976199627 976234019 976161718 975936353 975591123 975327015
2793.9 975327015 975266159 975271404 975248635 975146830 974926949 974660814 974435568 974239826 974076211 973950446
2814.3 973950446 973779798 973537743 973262370 973031104 972889364 972801805 972680867 972363710 971875310 971365809
2834.7 971365809 970764041 969941020 968924165 967755079 966356516 964743614 963224769 962033749 961080074
$$ packed form
2683.8I78429437n0962j90020k09033p2539M8339k5391j44661j04606l3677r9361j62780
2706.3I77384746q6725K4021K6107j01626j89781j14799r4652j79946j60814n7161
2726.6I76449370L2068L8683L4452Q5115M3154l1412l0100L1233J58250J55806o854
2749.1I76959765m2021O9797J16348M0114m2617j5617p75r6202r7394j8715k0802k9982
2773.5I76821899p0571j85788k22385j37508o020L4392p2301k25365l45230k64108
2793.9I75327015o0856N245k2769j01805k19881k66135k25246j95742j63615j25765
2814.3I73950446j70648k42055k75373k31266j41740q7559j20938l17157m88400n09501
2834.7I71365809o01768q23021j016855j169086j398563j612902j518845j191020r53675
$$ plain form
2853.1 961080074 960247934 959422290 958588600 957858026 957087755 956120372 955098093 954169869 953317702
2871.4 953317702 952521443 951811790 951202571 950646281 950168550 949851394 949629843 949469566 949361205 949280500
2891.8 949280500 949269652 949311078 949395716 949598193 949875593 950048506 950053930 949896097 949474216 948732018
2912.2 948732018 947884202 947208941 946707666 946289182 946019948 945877731 945666850 945307136 944698393 943742394
2932.6 943742394 942688763 941809177 941127539 940779567 940910220 941335797 941851914 942338347 942634881
2951 942634881 942829251 943154037 943554938 943911850 944398224 945276499 946612060 948392332 950584233
2969.3 950584233 952907681 955057144 956994951 958639145 959827483 960706770 961478591 962101996 962624013
2987.7 962624013 963129997 963639796 964190602 964730978 965275288 965888321 966458440 966835141 967119098 967451453
$$ packed form
2853.1I61080074q32140q25644q33690p30574p70271r67383j022279r28224q52167
2871.4I53317702p96259p09653o09219n56290m77731l17156k21551j60277j08361q0705
2891.8I49280500j0848M1426Q4638K02477K77400J72913N424j57833m21881p42198
2912.2I48732018q47816o75261n01275m18484k69234j42217k10881l59714o08743r55999
2932.6I43742394j053631q79586o81638l47972J30653M25577N16117M86433K96534
2951I42634881J94370L24786M00901L56912M86374Q78275J335561J780272K191901
2969.3I50584233K323448K149463J937807J644194J188338Q79287P71821O23405N22017
2987.7I62624013N05984N09799N50806N40376N44310O13033N70119L76701K83957L32355
$$ plain form
3008.1 967451453 967684865 967791677 967934966 968102694 968218267 968261838 968352854 968603551 968975484 969416440
3028.5 969416440 969790339 970093250 970426321 970730960 971031487 971321404 971512198 971708059 971960545 972103059
3048.9 972103059 972096741 972099543 972212255 972327590 972329676 972330809 972413063 972462237 972443044 972442091 972470880 972525060
3073.3 972525060 972540855 972490668 972464919 972401619 972256899 972156346 972138584 972084999 971999943 971983254 972014606
3095.8 972014606 971979380 971794963 971601784 971492946 971359193 971251428 971257329 971280098 971281409 971243799 971098423
3118.2 971098423 970914364 970722258 970479190 970297337 970236361 970188379 970079243 969900370 969704986 969586790
3138.6 969586790 969541788 969417691 969145119 968828082 968592644 968487382 968363702 968151391 967945337 967710316
3159 967710316 967431128 967195451 966998100 966802001 966567934 966238201 965881407 965593517 965391636 965180099
$$ packed form
3008.1I67451453K33412J06812J43289J67728J15573M3571R1016K50697L71933M40956
3028.5I69416440L73899L02911L33071L04639L00527K89917J90794J95861K52486J42514
3048.9I72103059o318K802J12712J15335K086J133Q2254M9174j9193r53K8789N4180
3073.3I72525060J5795n0187k5749o3300j44720j00553j7762n3585q5056j6689L1352
3095.8I72014606l5226j84417j93179j08838j33753j07765N901K2769J311l7610j45376
3118.2I71098423j84059j92106k43068j81853o0976m7982j09136j78873j95384j18196
3138.6I69586790m5002j24097k72572l17037k35438j05262j23680k12311k06054k35021
3159I67710316k79188k35677j97351j96099k34067l29733l56794k87890k01881k11537
$$ plain form
3179.4 965180099 964843035 964446127 964071214 963768244 963561296 963284671 962891281 962606966 962431252 962139666
3199.8 962139666 961686194 961264551 961016238 960773051 960347772 959834695 959496796 959318459 959001660 958562315
3220.2 958562315 958205521 957901239 957514763 957074702 956641197 956222653 955964565 955813766 955570221 955330312
3240.6 955330312 955050707 954573393 954145432 953936219 953755796 953487694 953183711 952949345 952709973 952314138
3260.9 952314138 951878250 951602697 951526463 951457977 951250613 950992465 950688899 950336397 950073183 949828386
3281.3 949828386 949441552 949122131 948965549 948776841 948550224 948296964 948038399 947853267 947679996 947433591
3301.7 947433591 947084725 946700454 946413696 946190417 945870996 945501626 945225418 944980264 944649518 944256842
3322.1 944256842 943858981 943513513 943270981 942999303 942587018 942155898 941729307 941234887 940713584 940185905
$$ packed form
3179.4I65180099l37064l96908l74913l02970k06948k76625l93390k84315j75714k91586
3199.8I62139666m53472m21643k48313k43187m25279n13077l37899j78337l16799m39345
3220.2I58562315l56794l04282l86476m40061m33505m18544k58088j50799k43545k39909
3240.6I55330312k79605m77314m27961k09213j80423k68102l03983k34366k39372l95835
3260.9I52314138m35888k75553p6234o8486k07364k58148l03566l52502k63214k44797
3281.3I49828386l86834l19421j56582j88708k26617k53260k58565j85132j73271k46405
3301.7I47433591l48866l84271k86758k23279l19421l69370k76208k45154l30746l92676
3322.1I44256842l97861l45468k42532k71678m12285m31120m26591m94420n21303n27679
$$ plain form
3342.5 940185905 939742565 939485013 939209700 938729763 938234210 937899232 937576830 937044919 936414063 935895264
3362.9 935895264 935376823 934839845 934418499 934099376 933780491 933296978 932730615 932339430 931979477 931427062
3383.3 931427062 930882096 930463493 930012286 929544091 929163992 928785026 928353071 927922606 927534699 927242696
3403.7 927242696 927003086 926709116 926261008 925669849 925130308 924725950 924380600 924063921 923797727 923444450
3424.1 923444450 922887504 922335207 921891868 921400487 920901179 920555115 920335889 920090020 919794917 919571280
3444.5 919571280 919346571 919065535 918813586 918416262 917865336 917528629 917380452 917146027 916870475 916575551
3464.9 916575551 916202426 915888488 915860057 916074634 916173875 916089416 916107178 916340470 916618466 916807771
3485.3 916807771 917029619 917341530 917551696 917626023 917786121 918110430 918357134 918479145 918849826 919381082
$$ packed form
3342.5I40185905m43340k57552k75313m79937m95553l34978l22402n31911o30856n18799
3362.9I35895264n18441n36978m21346l19123l18885m83513n66363l91185l59953n52415
3383.3I31427062n44966m18603m51207m68195l80099l78966m31955m30465l87907k92003
3403.7I27242696k39610k93970m48108n91159n39541m04358l45350l16679k66194l53277
3424.1I23444450n56946n52297m43339m91381m99308l46064k19226k45869k95103k23637
3444.5I19571280k24709k81036k51949l97324n50926l36707j48177k34425k75552k94924
3464.9I16575551l73125l13938k8431K14577R9241q4459J7762K33292K77996J89305
3485.3I16807771K21848L11911K10166P4327J60098L24309K46704J22011L70681N31256
$$ plain form
3505.7 919381082 919705153 919985175 920522511 921146274 921450794 921582997 921877563 922212839 922449231 922747433
3526.1 922747433 923272550 923881590 924306929 924608588 925057650 925564647 925820887 925901651 926137745 926723063
3546.4 926723063 927463353 927982628 928389013 928943515 929586291 930208623 930703878 930936456 930940390 931383610
3566.8 931383610 932481527 933374524 933911443 934417725 934966981 935447156 935820937 936090946 936297297
3585.2 936297297 936830699 937751114 938452423 938908637 939378619 939897001 940516293 941153944 941560626 941772997
3605.6 941772997 942192197 942951560 943767846 944497228 945029020 945560575 946441114 947427154 948163688 948647022
3626 948647022 949487090 951074302 952474356 953624606 954836488 956086218 957338691 958492339 959464014
3644.3 959464014 960371017 961594820 963291883 964899361 966319561 967838228 969335318 970764816
$$ packed form
3505.7I19381082L24071K80022N37336O23763L04520J32203K94566L35276K36392K98202
3526.1I22747433N25117O09040M25339L01659M49062N06997K56240Q0764K36094N85318
3546.4I26723063P40290N19275M06385N54502O42776O22332M95255K32578L934M43220
3566.8I31383610J097917Q92997N36919N06282N49256M80175L73781K70009K06351
3585.2I36297297N33402R20415P01309M56214M69982N18382O19292O37651M06682K12371
3605.6I41772997M19200P59363Q16286P29382N31792N31555Q80539R86040P36534M83334
3626I48647022Q40068J587212J400054J150250J211882J249730J252473J153648R71675
3644.3I59464014R07003J223803J697063J607478J420200J518667J497090J429498
$$ plain form
3660.6 970764816 972063303 972971261 973670781 974551857 975663006 976568878 977319300 978356361 979413331
3679 979413331 980319619 981149435 981649399 981714547 981804848 982424140 983150184 983452678 983460724 983620942 984029412
3701.4 984029412 984308243 984376848 984423697 984353662 984181166 984298229 984557331 984569609 984441340 984386802
3721.8 984386802 984338760 984450698 984819353 985002756 984688699 984177053 984058559 984415710 984775782 984700561
3742.2 984700561 984249651 983999848 984065473 984293342 984426618 984526634 984869003 985312760 985509038 985478342
3762.6 985478342 985521734 985703766 985802412 985794246 985808432 985806227 985802948 985800564 985809147 985850215 985779405 985681534
3787.1 985681534 985713005 985773683 985767961 985660255 985605299 985630155 985520959 985518038 985728085 985909283 985907733
3809.5 985907733 985804617 985707164 985630810 985571086 985345304 985128582 985197604 985236704 985267997 985442936 985599458
$$ packed form
3660.6I70764816J298487R07958O99520Q81076J111149R05872P50422J037061J056970
3679I79413331R06288Q29816M99964O5148R0301O19292P26044L02494Q046J60218M08470
3701.4I84029412K78831O8605M6849p0035j72496J17063K59102J2278j28269n4538
3721.8I84386802m8042J11938L68655J83403l14057n11646j18494L57151L60072p5221
3742.2I84700561m50910k49803O5625K27869J33276J00016L42369M43757J96278l0696
3762.6I85478342M3392J82032R8646q166J4186k205l279k384Q583M1068p0810r7871
3787.1I85681534L1471O0678n722j07706n4956K4856j09196k921K10047J81198j550
3809.5I85907733j03116r7453p6354n9724k25782k16722O9022L9100L1293J74939J56522
$$ plain form
3831.9 985599458 985689938 985726655 985723376 985747933 985776603 985888779 985922992 985688746 985389769 985101104 984917641
3854.4 984917641 985214531 985664785 985859931 985674798 985400021 985307753 985171914 985034764 985068083 985198498
3874.8 985198498 985302508 985165000 984942734 984824002 984704316 984804451 985051095 985125840 985331595 985707045
3895.2 985707045 985617518 984923363 984375358 984484076 984898329 985320747 985729814 985901475 985646427 985266089
3915.6 985266089 985166430 985315740 985356748 985179663 985159278 985313237 985220492 984956503 984943271 985184789
3936 985184789 985315263 985156715 984968126 985037088 985209703 985332966 985501885 985644817 985616922 985525131
3956.3 985525131 985453963 985335529 985235572 985173523 985096753 985000730 984824479 984596908 984470129 984529972 984670818
3978.8 984670818 984793067 984971941 985166132 985201418 985087395 984992623 984971642 984951377 984939218
$$ packed form
3831.9I85599458R0480L6717l279K4557K8670J12176L4213k34246k98977k88665j83463
3854.4I84917641K96890M50254J95146j85133k74777r2268j35839j37150L3319J30415
3874.8I85198498J04010j37508k22266j18732j19686J00135K46644P4745K05755L75450
3895.2I85707045q9527o94155n48005J08718M14253M22418M09067J71661k55048l80338
3915.6I85266089r9659J49310M1008j77085k0385J53959r2745k63989j3232K41518
3936I85184789J30474j58548j88589O8962J72615J23263J68919J42932k7895r1791
3956.3I85525131p1168j18434r9957o2049p6770r6023j76251k27571j26779N9843J40846
3978.8I84670818J22249J78874J94191L5286j14023r4772k0981k0265j2159
$$ plain form
3997.1 984939218
$$ packed form
3997.1I84939218
##END=$$ End of the data block
