##TITLE=Oseias I $$ Begin of the data block
##JCAMP-DX=5.00 $$ ACD/SpecManager v 10.08
##SPECTROMETER/DATA SYSTEM=Alpha
##DATE=02 Apr 2015 08:25:20
##DATA TYPE=INFRARED SPECTRUM
##DATA CLASS=XYDATA
##ORIGIN=
##OWNER=
##NPOINTS=1765
##FIRSTX=399.76428223
##LASTX=3997.64306641
##MAXX=3997.64306641
##MINX=399.76428223
##MAXY=0.86472023
##MINY=0.37024212
##XFACTOR=1.0000000000
##YFACTOR=1.000000000000000e-9
##FIRSTY=0.84533131
##DELTAX=2.03961372
##XUNITS=1/CM
##YUNITS=ARBITRARY UNITS
##XYDATA=(X++(Y..Y))
$$ plain form
399.8 845331311 853888750 855286360 850040078 847350836 850841880 853920758 852029443 851145267 858007908
418.1 858007908 864720225 860929310 853753507 852207303 856337368 857926190 853571236 850326180
434.4 850326180 853419840 857540905 856006801 850796044 849574149 853280485 854203403 849664509 846269011
452.8 846269011 849054635 853216112 850850880 845196843 844281554 847720802 848753095 845237732 842926025
471.2 842926025 845157683 846989810 843990266 839049459 838067710 840533972 839559436 833474159 828111172
489.5 828111172 826549351 823933542 814429164 798219383 775369763 736749530 688164830 657187521
505.8 657187521 640233397 622390926 633937538 694294035 765742779 812567592 835732460
520.1 835732460 845550418 847241044 846815169 849134862 852480888 851990998 848357856 847373903 850518048
$$ packed form
399.8H45331311Q557439J397610n246282k689242L491044L078878j891315q84176O862641
418.1H58007908O712317l790915p175803j546204M130065J588822m354954l245056
434.4H50326180L093660M121065j534104n210757j221895L706336R22918m538894l395498
452.8H46269011K785624M161477k365232n654037r15289L439248J032293l515363k311707
471.2H42926025K231658J832127k999544m940807r81749K466262r74536o085277n362987
489.5H28111172j561821k615809r504378j6209781k2849620l8620233m8584700l0977309
505.8F57187521j6954124j7842471J1546612O0356497P1448744M6824813K3164868
520.1H35732460R817958J690626m25875K319693L346026m89890l633142r83953L144145
$$ plain form
538.5 850518048 852423131 849663973 846407294 847594500 850799501 850027978 845646203 843829751 846724749
556.8 846724749 848947585 846315920 842588902 843400121 847078562 847090423 842810631 840575874 843399465
575.2 843399465 846123338 843801558 839434505 839019716 842081130 842265725 837632835 833364427 833054483
593.5 833054483 832731366 826605856 813580215 794269443 770413518 756228983 767057657 792979956
609.8 792979956 813774526 821513176 814124107 796876967 790544748 807139874 829668462 839319527
626.2 839319527 839549601 841011047 844955027 845865011 841981232 838430822 838729560 838582575 833942831
644.5 833942831 829598546 831774533 838078976 841145635 838475645 834988415 835917473 839125633 838963866
662.9 838963866 835383534 832995296 835418582 837423265 835105360 831255794 830781877 833479941 833947301
$$ packed form
538.5H50518048J905083k759158l256679J187206L205001p71523m381775j816452K894998
556.8H46724749K222836k631665l727018Q11219L678441J1861m279792k234757K823591
575.2H43399465K723873k321780m367053m14789L061414J84595m632890m268408l09944
593.5H33054483l23117o125510j3025641j9310772k3855925j4184535J0828674K5922299
609.8G92979956K0794570P738650p389069j7247140o332219J6595126K2528588R651065
626.2H39319527K30074J461446L943980R09984l883779l550410K98738j46985m639744
644.5H33942831m344285K175987O304443L066659k669990l487230R29058L208160j61767
662.9H38963866l580332k388238K423286K004683k317905l849566m73917K698064M67360
$$ plain form
681.2 833947301 830309391 827126503 827997208 829854250 827854872 822967410 820350826 821235418 820913553
699.6 820913553 815945983 809544742 807589591 809881747 809941113 805518746 801427960 800684869 800043166
717.9 800043166 795661569 789198399 785091996 783502996 780287862 773351729 765645862 760133088
734.3 760133088 754877746 745951474 733240008 720380068 709271431 698156118 685871005 675093174
750.6 675093174 669594765 669921577 673531353 678986132 687859595 701192498 715876281 725656927
766.9 725656927 726617038 726733506 741249442 767279387 787019134 796178758 802238524 808050394
783.2 808050394 811160088 810737729 809803307 810875356 812416792 811524153 808523178 805902719 803548515
801.6 803548515 797977209 786752224 770721614 749725699 717996120 667147040 597001493 526861608
$$ packed form
681.2H33947301l637910l182888Q70705J857042j999378m887462k616584Q84592l21865
699.6H20913553m967570o401241j955151K292156N9366m422367m090786p43091o41703
717.9H00043166m381597o463170m106403j589000l215134o936133p705867n512774
734.3G60133088n255342q926272j2711466j2859940j1108637j1115313j2285113j0777831
750.6F75093174n498409L26812L609776N454779Q873463J3332903J4683783R780646
766.9G25656927R60111J16468J4515936K6029945J9739747R159624O059766N811870
783.2H08050394L109694m22359r34422J072049J541436q92639l000975k620459k354204
801.6H03548515n571306j1224985j6030610k0995915l1729579n0849080p0145547p0139885
$$ plain form
817.9 526861608 487214029 493079007 534642279 590580106 644221187 691136658 731388450 761277318
834.2 761277318 778994143 790023804 800181746 808345675 811693072 811558604 809740663 806411743
850.5 806411743 803893030 806219339 813575804 821727931 826743782 828239441 828794599 830432951 832383037
868.9 832383037 832950592 832447827 832815886 834540427 835869253 835639596 835044265 835652471 836903453
887.2 836903453 837091863 836041391 835388064 836058855 836803615 836264789 835112751 834950686 835770071
905.6 835770071 836023927 835095406 834238768 834528327 835159183 834681034 833247483 832355917 832387626 832058072
926 832058072 830411077 828055859 825262308 819320083 808046758 799481273 804373264 817100704
942.3 817100704 824859440 825395823 822688997 819275260 815352082 810379088 804355204 797521472 792069554
$$ packed form
817.9E26861608l9647579N864978M1563272N5937827N3641081M6915471M0251792K9888868
834.2G61277318J7716825J1029661J0157942Q163929L347397j34468j817941l328920
850.5H06411743k518713K326309P356465Q152127N015851J495659N55158J638352J950086
868.9H32383037N67555n02765L68059J724541J328826k29657n95331O08206J250982
887.2H36903453J88410j050472o53327O70791P44760n38826j152038j62065Q19385
905.6H35770071K53856r28521q56638K89559O30856m78149j433551q91566L1709l29554
926H32058072j646995k355218k793551n942225j1273325q565485M891991J2727440
942.3H17100704P758736N36383k706826l413737l923178m972994o023884o833732n451918
$$ plain form
960.7 792069554 789610565 789131403 793190181 802825391 811807215 815834165 815724134 813817918 811856449
979 811856449 809475422 804861844 796911597 786372483 776660681 773699582 779558778 788731694 795102000
997.4 795102000 797062218 794827104 788922369 780495048 769720256 754898548 737080097 725927055
1013.7 725927055 732693195 752243578 765241802 768717885 776259840 787594199 793461084 792048872
1030 792048872 784128010 769518554 748651743 726006031 713195324 720413208 743608177 768985391
1046.3 768985391 787269533 797542512 803002417 806822002 809967637 811730981 812041759 812151372
1062.6 812151372 813028514 814015210 813910544 812936604 812479019 812953591 813196421 812456965 811563551 811629832
1083 811629832 812296093 812208951 811141610 810316920 810364127 810295105 809018850 806963861 805401683 804333687
$$ packed form
960.7G92069554k458989m79162M058778R635210Q981824M026950j10031j906216j961469
979H11856449k381027m613578p950247j0539114r711802k961099N859196R172916O370306
997.4G95102000J960218k235114n904735q427321j0774792j4821708j7818451j1153042
1013.7G25927055O766140J9550383J2998224L476083P541955J1334359N866885j412212
1030G92048872p920862j4609456k0866811k2645712j2810707P217884K3194969K5377214
1046.3G68985391J8284142J0272979N459905L819585L145635J763344L10778J09613
1062.6H12151372Q77142R86696j04666r73940m57585M74572K42830p39456q93414O6281
1083H11629832O66261q7142j067341q24690M7207o9022j276255k054989j562178j067996
$$ plain form
1103.4 804333687 802145481 797169983 788531899 777465105 770199001 772006929 777914166 780480623
1119.8 780480623 779704034 779560328 783319294 790567458 797510803 801695883 803047299 802526295 801857114
1138.1 801857114 802093446 802505493 801890671 800557971 799925089 800348282 800517082 799475074 798097849
1156.5 798097849 797626913 797675133 796841621 794994175 793518007 793219328 793018758 791363120 787939250
1174.8 787939250 782382965 773762107 766896725 769877911 779702246 787113845 789895177 789719641
1191.1 789719641 787978411 786437809 785828292 784907520 782335758 778397918 773814261 768435121 764063597
1209.5 764063597 763914645 766673267 769079745 770604014 770773888 769074798 766482472 763531327 760012448
1227.9 760012448 757114768 756464422 757374525 757525325 755235493 750751436 746054947 742662013 739896774
$$ packed form
1103.4H04333687k188206m975498q638084j1066794p266104J807928N907237K566457
1119.8G80480623p76589j43706L758966P248164O943345M185080J351416n21004o69181
1138.1H01857114K36332M12047o14822j332700o32882M23193J68800j042008j377225
1156.5G98097849m70936M8220q33512j847446j476168k98679k00570j655638l423870
1174.8G87939250n556285q620858o865382K981186R824335P411599K781332j75536
1191.1G89719641j741230j540602o09517r20772k571762l937840m583657n379140m371524
1209.5G64063597j48952K758622K406478J524269J69874j699090k592326k951145l518879
1227.9G60012448k897680o50346R10103J50800k289832m484057m696489l392934k765239
$$ plain form
1246.2 739896774 736197293 731260717 725631297 718485475 706968248 688138127 661373138 633099854
1262.5 633099854 622429550 647152603 695867956 737900019 759278953 765689075 764328599 759172678
1278.8 759172678 753459752 748634398 743478477 736473322 728188634 720623255 714575708 708496511
1295.2 708496511 700221598 689750433 679735184 674589396 674590230 670496464 654223204 627416253
1311.5 627416253 592770278 551292956 509424031 478219002 467135757 487707168 546534956
1325.8 546534956 625097752 693357766 736903548 758043587 765206933 765815914 762710571 755784810
1342.1 755784810 745800376 734742641 724644125 715042412 703761220 690043211 674504697 655739725
1358.4 655739725 628506303 591739237 566291511 577632785 621540666 668185771 693205178
$$ packed form
1246.2G39896774l699481m936576n629420p145822j1517227j8830121k6764989k8273284
1262.5F33099854j0670304K4723053M8715353M2032063K1378934O410122j360476n155921
1278.8G59172678n712926m825354n155921p005155q284688p565379o047547o079197
1295.2G08496511q274913j0471165j0015249n145788Q34m093766j6273260k6806951
1311.5F27416253l4645975m1477322m1868925l1205029j1083245K0571411N8827788
1325.8E46534956P8562796O8260014M3545782K1140039P163346O08981l105343o925761
1342.1G55784810r984434j1057735j0098516r601713j1281192j3718009j5538514j8764972
1358.4F55739725k7233422l6767066k5447726J1341274M3907881M6645105K5019407
$$ plain form
1372.7 693205178 688373983 663090348 650658071 670414686 700107217 715092242 715812504 707863331
1389 707863331 694211185 674604416 646687925 610140204 563451648 525504172 535006225 601558268
1405.3 601558268 679370761 726732314 744220912 745336235 741603911 736460209 726377130 712672710
1421.6 712672710 698500454 684022188 670394599 656727195 643805921 633639872 621774077
1435.9 621774077 603649080 586773038 577118337 574799299 574945271 569429398 555208564 538460135
1452.2 538460135 529725134 543630600 583390594 619903266 647164464 668568969 679187119
1466.5 679187119 680587769 679242492 675899804 669896007 663112104 656310916 649652600 643347740
1482.8 643347740 637894213 632547081 625067472 614940524 606115818 598909914 588690817 573626518
$$ packed form
1372.7F93205178m831195k5283635j2432277J9756615K9692531J4985025P20262p949173
1389G07863331j3652146j9606769k7916491l6547721m6688556l7947476R502053O6552043
1405.3F01558268P7812493M7361553J7488598J115323l732324n143702j0083079j3704420
1421.6G12672710j4172256j4478266j3627589j3667404j2921274j0166049j1865795
1435.9F21774077j8124997j6876042r654701k319038J45972n515873j4220834j6748429
1452.2E38460135q735001J3905466L9759994L6512672K7261198K1404505J0618150
1466.5F79187119J400650j345277l342688o003797o783903o801188o658316o304860
1482.8F43347740n453527n347132p479609j0126948q824706p205904j0219097j5064299
$$ plain form
1499.1 573626518 557145298 541782856 522757947 491317332 466246903 462195247 478501737
1513.4 478501737 513452709 554523230 583292365 596419334 596431792 588395178 576796055 566661358
1529.7 566661358 560441673 556292713 553805053 554697156 556127429 548931181 531364143 506396294
1546 506396294 479725718 458815128 455415130 474920779 509967864 562055945 614434838 639559150
1562.4 639559150 659305692 681349635 703905821 723456502 734109938 738120854 734521568 723635793
1578.7 723635793 710068762 692868829 671686232 648057640 622972846 596589208 569058537
1593 569058537 540779889 513663888 491041601 475989699 469880521 470609725 473324835 474983215
1609.3 474983215 479253143 493487507 524191916 565680027 593940556 607503176 613133967 614534676
$$ packed form
1499.1E73626518j6481220j5362442j9024909l1440615k5070429m051656J6306490
1513.4D78501737L4950972M1070521K8769135J3126969J2458q036614j1599123j0134697
1529.7E66661358o219685m148960k487660Q92103J430273p196248j7567038k4967849
1546E06396294k6670576k0910590l399998J9505649L5047085N2088081N2378893K5124312
1562.4F39559150J9746542K2043943K2556186J9550681J0653436M010916l599286j0885775
1578.7G23635793j3567031j7199933k1182597k3628592k5084794k6383638k7530671
1593E69058537k8278648k7116001k2622287j5051902o109178P29204K715110J658380
1609.3D74983215M269928J4234364L0704409M1488111K8260529J3562620N630791J400709
$$ plain form
1625.6 614534676 616460085 617533147 615426064 610361695 598800719 581864476 565964878 552152097
1641.9 552152097 542314053 536221445 530017614 522868454 507587731 469490945 430635124 399861485
1658.2 399861485 377069950 370242119 380556732 401885509 437408835 486146986 529378831
1672.5 529378831 567381144 601496220 626463532 647606492 670831323 695188403 710227907
1686.8 710227907 720059276 730041444 740140319 752485216 764907777 774021208 780259490 784125566
1703.1 784125566 787877858 790583372 791841805 794318438 799142718 805376828 809357166 808696568
1719.4 808696568 807830095 808388054 808989108 809729278 811751127 815222621 818528116 818899989 819599867
1737.8 819599867 822663307 825783789 827961624 829984546 832368135 833945334 833229661 831808150
$$ packed form
1625.6F14534676J925409J073062k107083n064369j1560976j6936243j5899598j3812781
1641.9E52152097r838044o092608o203831p149160j5280723l8096786l8855821l0773639
1658.2C99861485k2791535o827831J0314613K1328777L5523326M8738151M3231845
1672.5E29378831L8002313L4115076K4967312K1142960K3224831K4357080J5039504
1686.8G10227907R831369R982168J0098875J2344897J2422561R113431O238282L866076
1703.1G84125566L752292K705514J258433K476633M824280O234110L980338o60598
1719.4H08696568q66473N57959O01054P40170K021849L471494L305495L71873O99878
1737.8H19599867L063440L120482K177835K022922K383589J577199p15673j421511
$$ plain form
1754.1 831808150 831109226 830822349 831262887 831520796 830774724 831093729 833441019 836818993 838392317
1772.4 838392317 836745381 835143268 835402310 835992038 835246980 833545983 832153320 832361996 833525658
1790.8 833525658 833087027 831741154 832431734 834780097 836198807 835658133 835131526 836075068 837595463
1809.2 837595463 837761283 836411238 835448861 835339367 835032463 834494710 834747136 835926235 837575793
1827.5 837575793 838387251 836921453 835337996 835462213 836093724 836273193 836912096 837945402 837847412
1845.9 837847412 836749613 835272610 833926857 833471477 833710492 833578587 832612216 831685722 832003653
1864.2 832003653 833460808 833901048 831938386 830087900 830045760 830514908 830176055 829459310 829406619
1882.6 829406619 829931021 830164313 829289019 826935709 823737741 819004297 811162651 802572906 799239159
$$ packed form
1754.1H31808150o98924k86877M40538K57909p46072L19005K347290L377974J573324
1772.4H38392317j646936j602113K59042N89728p45058j700997j392663K08676J163662
1790.8H33525658m38631j345873O90580K348363J418710n40674n26607R43542J520395
1809.2H37595463J65820j350045r62377j09494l06904n37753K52426J179099J649558
1827.5H37575793Q11458j465798j583457J24217O31511J79469O38903J033306r7990
1845.9H37847412j097799j477003j345753m55380K39015j31905r66371r26494L17931
1864.2H32003653J457155M40240j962662j850486m2140M69148l38853p16745n2691
1882.6H29406619N24402K33292q75294k353310l197968m733444p841646q589745l333747
$$ plain form
1900.9 799239159 804055750 812781036 819632173 823180377 825065553 826762259 828317583 828845024
1917.3 828845024 828198671 827683091 827371538 826477349 825589776 825513124 826175869 826670945 826175094 825196922
1937.7 825196922 825147927 826168358 826613665 825870454 825063050 825057507 825534821 825486600 824606419 823700309
1958.1 823700309 823428929 823308349 822704494 821812451 821257949 821350336 821518004 821033895 820286393 820215523
1978.5 820215523 820816696 821179152 820927799 820811570 821475267 822331071 822115302 820890367 820015669
1996.8 820015669 819915295 819863260 819380879 818925977 819112062 819671631 819777191 819323063 819054008 819250047
2017.2 819250047 819288671 818616569 817398250 816518009 816678822 817143917 816898108 816305399 816253662 816797614
2037.6 816797614 817206502 816997528 816622496 816721022 817010224 816808701 816152573 815731287 815844297 815957665
$$ packed form
1900.9G99239159M816591Q725286O851137L548204J885176J696706J555324N27441
1917.3H28845024o46353n15580l11553q94189q87573p6652O62745M95076m95851r78172
1937.7H25196922m8995J020431M45307p43211q07404n543M77314m8221q80181r06110
1958.1H23700309k71380j20580o03855q92043n54502R2387J67668m84109p47502p0870
1978.5H20215523O01173L62456k51353j16229O63697Q55804k15769j224935q74698
1996.8H20015669j00374n2035m82381m54902J86085N59569J05560m54128k69055J96039
2017.2H19250047L8624o72102j218319q80241J60813M65095k45809n92709n1737N43952
2037.6H16797614M08888k08974l75032R8526K89202k01523o56128m21286J13010J13368
$$ plain form
2058 815957665 815572679 815028727 814902961 815012813 814764738 814044118 813380778 813243628 813324094 813002467
2078.4 813002467 812269032 811691105 811592042 811666727 811536729 811378419 811631262 812215567 812503994 812244534
2098.8 812244534 811909258 811948121 812128425 811904907 811301231 810872912 810857534 810829103 810396969 809864223
2119.2 809864223 809766471 810020924 810060978 809674680 809231937 809078217 809010386 808621585 807987154 807603121
2139.6 807603121 807606041 807567120 807148993 806592464 806352019 806417406 806353629 806001425 805726767 805802286 805921376
2162 805921376 805608988 804890335 804237306 804002881 804048359 804078758 804196298 804615021 805117905 805229783
2182.4 805229783 804865599 804465771 804380357 804450572 804339528 804055035 803918123 804030776 804071009 803793669
2202.8 803793669 803433836 803327918 803370953 803174734 802641630 802107275 801865816 801763892 801483274 801101565
$$ packed form
2058H15957665l84986n43952j25766J09852k48075p20620o63340j37150Q0466l21627
2078.4H13002467p33435n77927r9063P4685j29998j58310K52843N84305K88427k59460
2098.8H12244534l35276L8863J80304k23518o03676m28319j5378k8431m32134n32746
2119.2H09864223r7752K54453M0054l86298m42743j53720o7831l88801o34431l84033
2139.6H07603121K920l8921m18127n56529k40445O5387o3777l52204k74658P5519J19090
2162H05921376l12388p18653o53029k34425M5478L0399J17540M18723N02884J11878
2182.4H05229783l64184l99828q5414P0215j11044k84493j36912J12653M0233k77340
2202.8H03793669l59833j05918M3035j96219n33104n34355k41459j01924k80618l81709
$$ plain form
2223.2 801101565 800979495 801156998 801284492 801086247 800724149 800545692 800510049 800245583 799644828 799073458
2243.6 799073458 798876107 798902273 798779070 798532128 798504770 798717201 798814774 798563480 798161089 797939837
2264 797939837 797844410 797536492 796909690 796254218 795862734 795627534 795299530 794989705 795007527 795341253
2284.4 795341253 795580804 795426250 795024753 794662535 794387698 794018865 793444216 792753458 792121232 791679144
2304.8 791679144 791463971 791496873 791782856 792137921 792192817 791719735 790897071 790145278 789633095 789291561
2325.2 789291561 789117455 789120972 789265394 789370835 789116263 788517416 788077116 788104236 788352907 788533390
2345.6 788533390 788772881 789068580 789033890 788327813 787130594 786000192 785374880 785191059 785073400
2363.9 785073400 785002470 785298824 785988748 786614358 786848426 786899269 787121773 787495613 787696242 787571907
$$ packed form
2223.2H01101565j22070J77503J27494j98245l62098j78457l5643k64466o00755n71370
2243.6G99073458j97351K6166j23203k46942k7358K12431R7573k51294m02391k21252
2264G97939837r5427l07918o26802o55472l91484k35200l28004l09825J7822L33726
2284.4G95341253K39551j54554m01497l62218k74837l68833n74649o90758o32226m42088
2304.8G91679144k15173L2902K85983L55065N4896m73082q22664p51793n12183l41534
2325.2G89291561j74106L517J44422J05441k54572n98847m40300K7120K48671J80483
2345.6G88533390K39491K95699l4690p06077j197219j130402o25312j83821j17659
2363.9G85073400p0930K96354O89924O25610K34068N0843K22504L73840K00629j24335
$$ plain form
2384.3 787571907 787338197 787232637 787153661 786857069 786372900 786029696 786055684 786280334 786371052 786301851
2404.7 786301851 786287785 786351740 786285996 785987496 785690784 785664082 785784125 785706222 785393536 785182476
2425.1 785182476 785243392 785285294 784994602 784508049 784188569 784070671 783832967 783367872 782959163 782806635
2445.5 782806635 782743752 782479882 781994164 781579256 781425118 781331062 781049728 780706942 780634224 780879259
2465.9 780879259 781089127 780972242 780665338 780478597 780439854 780295789 779949129 779632986 779518247 779423833
2486.3 779423833 779069424 778472364 777940750 777606010 777285099 776946604 776862919 777159095 777551174 777660251
2506.7 777660251 777417541 777074337 776846826 776647508 776260853 775659680 775011241 774397731 773713470 772996426
2527.1 772996426 772587538 772735238 773242295 773643911 773705721 773599803 773499906 773236632 772589266 771751881
$$ packed form
2384.3G87571907k33710j05560p8976k96592m84169l43204K5988K24650R0718o9201
2404.7G86301851j4066O3955o5744k98500k96712k6702J20043p7903l12686k11060
2425.1G85182476O0916M1902k90692m86553l19480j17898k37704m65095m08709j52528
2445.5G82806635o2883k63870m85718m14908j54138r4056k81334l42786p2718K45035
2465.9G80879259K09868j16885l06904j86741l8743j44065l46660l16143j14739r4414
2486.3G79423833l54409n97060n31614l34740l20911l38495q3685K96176L92079J09077
2506.7G77660251k42710l43204k27511j99318l86655o01173o48439o13510o84261p17044
2527.1G72996426m08888J47700N07057M01616O1810j05918r9897k63274o47366q37385
$$ plain form
2547.5 771751881 771232784 771298230 771658719 771883965 771937430 772018313 772113681 772017658 771685541 771368802
2567.9 771368802 771349609 771540165 771552205 771171570 770553887 769985259 769648373 769574940 769685566 769931018
2588.3 769931018 770252943 770432949 770297945 769995391 769797146 769675136 769372821 768867016 768410444 768127501
2608.7 768127501 767796040 767145753 766207516 765205204 764297783 763529301 763016701 763026774 763656080 764595330
2629.1 764595330 765408218 765948355 766379118 766835749 767209768 767304242 767125905 766915977 766784728 766537488
2649.5 766537488 765996218 765271664 764584780 763943970 763158917 762170970 761274338 760874152 761028469 761395216
2669.9 761395216 761651278 761759758 761807859 761752069 761475444 761074364 760800660 760717213 760638297 760447621
2690.3 760447621 760260999 760189891 760122657 759840846 759306014 758727133 758277178 757849276 757229924 756395042
$$ packed form
2547.5G71751881n19097O5446L60489K25246N3465Q0883R5368r6023l32117l16739
2567.9G71368802j9193J90556J2040l80635o17683n68628l36886p3433J10626K45452
2588.3G69931018L21925J80006j35004l02554j98245j22010l02315n05805m56572k82943
2608.7G68127501l31461o50287r38237j002312r07421p68482n12600J0073O29306R39250
2629.1G64595330Q12888N40137M30763M56631L74019R4474j78337k09928j31249k47240
2649.5G66537488n41270p24554o86884o40810p85053r87947q96632m00186J54317L66747
2669.9G61395216K56062J08480M8101n5790k76625m01080k73704q3447p8916j90676
2690.3G60447621j86622p1108o7234k81811n34832n78881m49955m27902o19352q34882
$$ plain form
2710.7 756395042 755539715 754838049 754255056 753727317 753366351 753221154 752984405 752151906 750560343
2729 750560343 749067605 749181569 751044095 752977133 753771901 753701687 753366351 752933621 752355397 751707256
2749.4 751707256 751177073 750827551 750472605 749890268 749093056 748244345 747391284 746453106 745457649 744572103
2769.8 744572103 743848264 743129969 742263317 741272926 740250528 739147007 737808466 736153245 734210670
2788.2 734210670 732067108 729813397 727578998 725694358 724647999 724752009 725893974 727627575
2804.5 727627575 729509771 731299520 732845843 733946025 734484673 734560370 734344006 733898759 733171701
2822.8 733171701 732128799 730850279 729443908 727901459 726169229 724309802 722459316 720597267
2839.1 720597267 718571901 716379642 714117706 711855650 709747970 708006620 706634402 705422103
$$ packed form
2710.7G56395042q55327p01666n82993n27739l60966j45197k36749q32499j591563
2729G50560343j492738J13964J862526J933038P94768p0214l35336m32730n78224o48141
2749.4G51707256n30183l49522l54946n82337p97212q48711q53061r38178r95457q85546
2769.8G44572103p23839p18295q66652r90391j022398j103521j338541j655221j942575
2788.2G34210670k143562k253711k234399j884640j046359J04010J141965J733601
2804.5G27627575J882196J789749J546323J100182N38648P5697k16364m45247p27058
2822.8G33171701j042902j278520j406371j542449j732230j859427j850486j862049
2839.1G20597267k025366k192259k261936k262056k107680j741350j372218j212299
$$ plain form
2855.5 705422103 704183877 702678382 700689137 698585212 697589695 699130177 703468919 709055603
2871.8 709055603 713798523 716689289 717825532 717563272 716201007 714142680 711859465 709692240
2888.1 709692240 707845986 706478417 705714285 705505550 705563426 705573499 705371678 704883695 703903735 701981723
2908.5 701981723 698619127 693489015 686783373 680009663 676260412 678148925 684637666 691550076
2924.8 691550076 695810616 697435498 697649837 696851909 694167495 687888324 676617205 662052155
2941.1 662052155 651432335 652642310 664792478 679171264 689135373 693620920 693824410 690760612
2957.4 690760612 684854031 676740885 668567002 663893759 665258288 671866953 680492699 688156068
2973.8 688156068 693512142 696639895 698208928 698857546 699046850 698955536 698477328 697472751 695941150
$$ packed form
2855.5G05422103j238226j505495j989245k103925r95517J540482M338742N586684
2871.8G09055603M742920K890766J136243k62260j362265k058327k283215k167225
2888.1G09692240j846254j367569p64132k08735N7876J0073k01821m87983r79960j922012
2908.5G01981723l362596n130112o705642o773710l749251J888513O488741O912410
2924.8F91550076M260540J624882K14339p97928k684414o279171j1271119j4565050
2941.1F62052155j0619820J209975J2150168J4378786R964109M485547K03490l063798
2957.4F90760612n906581q113146q173883m673243J364529O608665Q625746P663369
2973.8F88156068N356074L127753J569033O48618J89304r1314m78208j004577j531601
$$ plain form
2992.1 695941150 694020748 692074001 690713644 690563917 691819191 693907559 695842564 696943820
3008.4 696943820 697105050 696680307 696172118 695711911 694963694 693567157 691357195 688278854 684347153
3026.8 684347153 679683864 674719691 670501471 668018878 666825473 665401697 663034201 660536706
3043.1 660536706 659051061 658561766 658017755 656633973 654390275 651555121 648362935 645107090 642191708
3061.5 642191708 639954925 638589740 638314188 639400125 641970932 645832062 650464594 655212879
3077.8 655212879 659547448 663235366 666254878 668561757 670059085 670700431 670426190 669055343 666325033
3096.1 666325033 662164032 656941414 651582062 647336543 644597292 642245471 638861597 634007394
3112.4 634007394 628082812 621770203 615921199 611464739 609266937 609967470 613587439 619402885
$$ packed form
2992.1F95941150j920402j946747j360357j49727J255274K088368J935005J101256
3008.4F96943820J61230m24743n08189m60207p48217j396537k209962l078341l931701
3026.8F84347153m663289m964173m218220k482593j193405j423776k367496k497495
3043.1F60536706j485645m89295n44011j383782k243698k835154l192186l255845k915382
3061.5F42191708k236783j365185k75552J085937K570807L861130M632532M748285
3077.8F55212879M334569L687918L019512K306879J497328O41346k74241j370847k730310
3096.1F66325033m161001n222618n359352m245519k739251k351821l383874m854203
3112.4F34007394n924582o312609n849004m456460k197802P00533L619969N815446
$$ plain form
3128.8 619402885 626301289 633169949 639213860 644203186 648156345 651019335 652890801 654009223
3145.1 654009223 654540777 654611528 654238343 653237283 651557326 649468243 647171199 644643068 641821146
3163.4 641821146 638660133 635128677 631189346 626784503 621913552 616753399 611534595 606452405
3179.8 606452405 601805866 597992122 595445037 594603717 595701993 598611355 602924824 608019650
3196.1 608019650 613072276 617338240 620511293 622578561 623599529 623694003 622978628 621636808 619878829
3214.4 619878829 617836416 615574062 613035262 610158205 606975973 603433609 599307060 594445050
3230.7 594445050 588910222 582758784 576043129 568948507 561677337 554442585 547419369 540704966
3247.1 540704966 534533978 529415131 525900602 524276376 524557173 526409507 528924167 530874729
$$ packed form
3128.8F19402885O898404O868660O043911M989326L953159K862990J871466J118422
3145.1F54009223N31554P0751l73185j001060j679957k089083k297044k528131k821922
3163.4F41821146l161013l531456l939331m404843m870951n160153n218804n082190
3179.8F06452405m646539l813744k547085q41320J098276K909362M313469N094826
3196.1F08019650N052626M265964L173053K067268J020968R4474p15375j341820j757979
3214.4F19878829k042413k262354k538800k877057l182232l542364m126549m862010
3230.7E94445050n534828o151438o715655p094622p271170p234752p023216o714403
3247.1E40704966o170988n118847l514529j624226K80797J852334K514660J950562
$$ plain form
3263.4 530874729 531295121 529849112 526818871 522757590 518236339 513619781 508901596 503927410
3279.7 503927410 498646200 493246853 488211304 484169275 481805146 481649190 483866364 488377601
3296 488377601 494895905 502975285 512207985 522157729 532320082 542371213 552173316 561587036
3312.3 561587036 570379555 578253269 585023820 590845585 596238196 601809084 607884049 614283741
3328.6 614283741 620572746 626421034 631655335 636216640 640182495 643683553 646746635 649343431
3345 649343431 651506960 653358996 654938877 656188548 657144666 657884061 658463776 658843994 658984721
3363.3 658984721 659045398 659088075 658899009 658364832 657698691 657157600 656762302 656399786 655994177 655513942
3383.7 655513942 654946446 654470205 654320955 654186428 653629243 652959108 652617633 652420700 651878178 650959492
$$ packed form
3263.4E30874729M20392j446009l030241m061281m521251m616558m718185m974186
3279.7E03927410n281210n399347n035549m042029k364129j55956K217174M511237
3296D88377601O518304Q079380R232700R949744J0162353J0051131R802103R413720
3312.3E61587036Q792519P873714O770551N821765N392611N570888O074965O399692
3328.6F14283741O289005N848288N234301M561305L965855L501058L063082K596796
3345F49343431K163529J852036J579881J249671R56118P39395N79715L80218J40727
3363.3F58984721O0677M2677j89066n34177o66141n41091l95298l62516m05609m80235
3383.7F55513942n67496m76241j49250j34527n57185o70135l41475j96933n42522r18686
$$ plain form
3404.1 650959492 650170267 649693072 649275005 648758173 648105681 647480667 647135913 646842599 646254480 645610571
3424.5 645610571 645274758 645163417 644977748 644764364 644733489 644673288 644385993 644128501 644130647 644389987
3444.9 644389987 644646049 644611835 644515872 644652843 644982517 645452797 646016002 646469116 646837533 647452235
3465.3 647452235 648202479 648605168 648670316 648841918 649287939 649982750 650802016 651314318 651570737 652080297
3485.7 652080297 652672291 653047383 653515100 654254436 654995501 655561626 656277061 657242000 657807827 658014536
3506.1 658014536 658530653 659222364 659856915 660531223 661192954 661893606 662903845 664237201 665350378
3524.4 665350378 665969789 666312873 666560531 667092741 668092549 669000149 669520438 670387626 672043860
3542.8 672043860 673699439 674312234 674400628 675037563 675794780 676193476 676790953 677887917 679272354
$$ packed form
3404.1F50959492p89225m77195m18067n16832o52492o25014l44754k93314n88119o43909
3424.5F45610571l35813j11341j85669k13384l0875o0201k87295k57492K146K59340
3444.9F44389987K56062l4214r5963J36971L29674M70280N63205M53114L68417O14702
3465.3F47452235P50244M02689O5148J71602M46021O94811Q19266N12302K56419N09560
3485.7F52080297N91994L75092M67717P39336P41065N66125P15435R64939N65827K06709
3506.1F58014536N16117O91711O34551O74308O61731P00652J010239J333356J113177
3524.4F65350378O19411L43084K47658N32210R99808R07600N20289Q67188J656234
3542.8F72043860J655579O12795Q8394O36935P57217L98696N97477J096964J384437
$$ plain form
3561.1 679272354 681060612 683391333 684802055 684275866 683666706 684093535 685065329 686111987 687226832
3579.5 687226832 688562930 690575004 693282962 694917560 694758952 695012271 696253002 697406709 698422551
3597.9 698422551 699479401 700176716 701066494 702938259 705081105 706584692 707765579 708694220 709773421
3616.2 709773421 711164236 711369216 710657835 711152315 713825166 716689229 716457069 715248883 714940667
3634.6 714940667 715028703 715404928 716031194 717049956 719376206 723392308 726292431 724521577 721629798
3652.9 721629798 720864594 720739901 720081806 719638348 719589174 720351338 722580254 724922419 725437880
3671.3 725437880 726162672 726755083 724487722 721784651 720296144 720133960 721866906 724973917 726253927
3689.6 726253927 724284053 722200513 721461892 721704721 722628951 723184824 722708285 722838879 724627674
$$ packed form
3561.1F79272354J788258K330721J410722n26189o09160M26829R71794J046658J114845
3579.5F87226832J336098K012074K707958J634598j58608K53319J240731J153707J015842
3597.9F98422551J056850O97315Q89778J871765K142846J503587J180887R28641J079201
3616.2G09773421J390815K04980p11381M94480K672851K864063k32160j208186l08216
3634.6G14940667Q8036L76225O26266J018762K326250M016102K900123j770854k891779
3652.9G21629798p65204j24693o58095m43458m9174P62164K228916K342165N15461
3671.3G25437880P24792N92411k267361k703071j488507j62184J732946L107011J280010
3689.6G26253927j969874k083540p38621K42829R24230N55873m76539J30594J788795
$$ plain form
3708 724627674 726804435 726554275 724247277 722886264 722984433 723664820 724195719 724256158 723641872 723138154
3728.4 723138154 724253714 726941705 728823781 727688015 725294709 724718273 726333499 727368295
3744.7 727368295 726974428 727721512 727934361 725517511 723431766 723082840 722884595 721801877 721199214
3763.1 721199214 721498191 721898258 721863091 720712602 719283164 719083190 720107853 720757365 720166326
3781.4 720166326 719581366 719201028 718590021 718162119 718173385 718888402 720047295 721115530 722433388
3799.8 722433388 722610056 721242905 720300674 718934059 717290998 717207193 718725383 720067859 720883787
3818.1 720883787 721812725 720667839 718534052 717569053 717254400 717548311 718322635 719440877 720786273
3836.5 720786273 720951378 719587266 717857122 716147900 715135574 715894103 718807757 721333265 719198525
$$ packed form
3708G24627674K176761k50160k306998j361013R8169O80387N30899O0439o14286n03718
3728.4G23138154J115560K687991J882076j135766k393306n76436J615226J034796
3744.7G27368295l93867P47084K12849k416850k085745l48926j98245j082718o02663
3763.1G21199214K98977M00067l5167j150489j429438j99974J024663O49512n91039
3781.4G20166326n84960l80338o11007m27902J1266P15017J158893J068235J317858
3799.8G22433388J76668j367151r42231j366615j643061q3805J518190J342476Q15928
3818.1G20883787R28938j144886k133787r64999l14653K93911P74324J118242J345396
3836.5G20786273J65105j364112j730144j709222j012326P58529K913654K525508k134740
$$ plain form
3854.8 719198525 716024518 715020835 715679169 716694593 716641605 716522872 717050970 716602266 715240359
3873.2 715240359 713841438 713396788 714209259 714591324 714551151 714220107 713170469 712942183 712987781 711980522
3893.6 711980522 711556852 712744832 714312971 714925349 714153767 712202787 710380912 709529281 709446490
3912 709446490 709969759 710732579 710860908 710307121 709942162 709778249 709312737 709071219 709362984 709299266
3932.3 709299266 708551645 707848728 707671106 708023012 708333790 708179116 708072424 708070338 707706332 707187712
3952.7 707187712 706881106 706720889 706616759 706573248 706420958 706166685 706049025 706094027 706172407 706182539
3973.1 706182539 706056118 705823004 705612957 705485940 705352247 705131531 704930186 704846323 704796731 704656541
3993.5 704656541 704388380 704105556
$$ packed form
3854.8G19198525l174007j003683O58334J015424n2988j18733N28098m48704j361907
3873.2G15240359j398921m44650Q12471L82065m0173l31044j049638k28286M5598j007259
3893.6G11980522m23670J187980J568139O12378p71582j950980j821875q51631q2791
3912G09446490N23269P62820J28329n53787l64959j63913m65512k41518K91765o3718
3932.3G09299266p47621p02917j77622L51906L10778j54674j06692k086l64006n18620
3952.7G07187712l06606j60217j04130m3511j52290k54273j17660M5002P8380J0132
3973.1G06182539j26421k33114k10047j27017j33693k20716k01345q3863m9592j40190
3993.5G04656541k68161k82824
$$ plain form
3997.6 704105556
$$ packed form
3997.6G04105556
##END=$$ End of the data block
