##TITLE=Oleo poliacrilato de amonio $$ Begin of the data block
##JCAMP-DX=5.00 $$ ACD/SpecManager v 10.08
##SPECTROMETER/DATA SYSTEM=Alpha
##DATE=25 Jun 2015 15:44:28
##DATA TYPE=INFRARED SPECTRUM
##DATA CLASS=XYDATA
##ORIGIN=
##OWNER=
##NPOINTS=1667
##FIRSTX=599.64648438
##LASTX=3997.64306641
##MAXX=3997.64306641
##MINX=599.64648438
##MAXY=1.09778500
##MINY=0.03777637
##XFACTOR=1.0000000000
##YFACTOR=0.000000010000000
##FIRSTY=1.02097774
##DELTAX=2.03961372
##XUNITS=1/CM
##YUNITS=ARBITRARY UNITS
##XYDATA=(X++(Y..Y))
599.6A02097774O3395R3281R4545Q9359P8762P4136P5448O2144Q5115J42396J35839
622.1A03092194O4802K2197M470j3387J669J7845K7824O1631P0536Q988o0439r1302
646.6A03207028p9453j6928L8779O4361P6854O9440M8375K5093q4686k76101j07085
669A02965677K32136J40595k2482p6878p6986p5245o6280n4085o1107p3814r2423j18268
693.5A02620840j39046j67215k01177k43580l13306m07827n30040o82462q60423j092118
713.9I7983646j429844j808035j811355j042229J09458R22620J206410J151866R59509
732.2I6242046P55924O07342N45275N48631N20223M18479L40217L29947L20697K86520
752.6A00915301K37799J77824J25241O5279j2374p7653j13439r6870k7298N5885J26278
$$ y = [102097774, 102161169, 102254450, 102348995, 102438354, 102517116, 102591252, 102666700, 102728844, 102813959, 102956355, 103092194, 103156996, 103179193, 103183663, 103170276, 103171945, 103189790, 103217614, 103279245, 103349781, 103358769, 103298330, 103207028, 103127575, 103110647, 103149426, 103213787, 103290641, 103360081, 103408456, 103433549, 103348863, 103072762, 102965677, 103197813, 103338408, 103315926, 103239048, 103162062, 103086817, 103020537, 102966452, 102905345, 102831531, 102739108, 102620840, 102481794, 102314579, 102113402, 101869822, 101556516, 101148689, 100618649, 99936187, 99075764, 97983646, 96553802, 94745767, 92934412, 91892183, 92001641, 92924261, 94130671, 95282537, 96242046, 96997970, 97605312, 98150587, 98699218, 99219441, 99637920, 99978137, 100308084, 100628781, 100915301, 101153100, 101330924, 101456165, 101521444, 101509070, 101431417, 101317978, 101221108, 101193810, 101249695, 101375973]
775.1A01375973J92285K41720K33937K01356J94550J92129J53816P3254m577m9150
795.4A02805293q3447j10114j19018j36375j73295k04015k40052k61032j80721l2855
815.8A01264369N4968J9669q5628j71160k35308k91752l12901l13973l16555k88790
836.2I9322939k35754k00314j76173j33216p1860o926M5896Q1211J07217R7096L6955
858.7I8867071k9654o7067o5654k2596L0845N3525M6474J8960l8219j06084j49208
881.1I8538393j66971j48415p2253N4431K02614L10689L30091K69425J56694J8347
901.5I9493045j20336k34443k94292k96974k77365k71892k71368k19208j19478p0828
921.9I7316861j28686k39009l38215m42177n75769o62219n78404l39692j19830k0730
$$ y = [101375973, 101568258, 101809978, 102043915, 102245271, 102439821, 102631950, 102785766, 102859020, 102854443, 102805293, 102721846, 102611732, 102492714, 102356339, 102183044, 101979029, 101738977, 101477945, 101297224, 101264369, 101319337, 101339006, 101253378, 101082218, 100846910, 100555158, 100242257, 99928284, 99611729, 99322939, 99087185, 98886871, 98710698, 98577482, 98505622, 98498696, 98544592, 98625803, 98733020, 98830116, 98867071, 98837417, 98770350, 98704696, 98682100, 98712945, 98766470, 98812944, 98831904, 98793685, 98687601, 98538393, 98371422, 98223007, 98150754, 98205185, 98407799, 98718488, 99048579, 99318004, 99474698, 99493045, 99372709, 99138266, 98843974, 98547000, 98269635, 97997743, 97726375, 97507167, 97387689, 97316861, 97188175, 96949166, 96610951, 96168774, 95593005, 94930786, 94352382, 94012690, 93892860, 93872130]
942.3I3872130m923j9676k2596J6153R4038J85782K53916K46524J46979M5538M1330
964.7I4855195J12564J81567J97715J38682L4714l9065m9240k8121j407L3820P8124
987.2I5514548J23507J56331J69342J73551J69874J36709O5559l4654j61934l01171
1007.6I6011662l90630l81470l17574k66605k42347k47431k85309l50923m23091m65101
1028I2641181m64374m28987l74215l15160k64865k37686k31820k46012k87342l44330
1048.4H9446390l95185m47273n25683o21599p15220p93994q33851q27903p96145p57032
1068.8H2732505p26605p35199p92665q88121j020825j161241j271707j359051j438320
1087.1G3338771j495093j502723j433420j277524j057178q12459n96541m51052l72088
$$ y = [93872130, 93867207, 93847531, 93824935, 93841088, 93935126, 94120908, 94374824, 94621348, 94768327, 94813865, 94855195, 94967759, 95149326, 95347041, 95485723, 95520437, 95481372, 95432132, 95404011, 95402604, 95436424, 95514548, 95638055, 95794386, 95963728, 96137279, 96307153, 96443862, 96509421, 96474767, 96312833, 96011662, 95621032, 95239562, 94921988, 94655383, 94413036, 94165605, 93880296, 93529373, 93106282, 92641181, 92176807, 91747820, 91373605, 91058445, 90793580, 90555894, 90324074, 90078062, 89790720, 89446390, 89051205, 88603932, 88078249, 87456650, 86741430, 85947436, 85113585, 84285682, 83489537, 82732505, 82005900, 81270701, 80478036, 79589915, 78569090, 77407849, 76136142, 74777091, 73338771, 71843678, 70340955, 68907535, 67630011, 66572833, 65760374, 65163833, 64712781, 64340693]
1105.5F4340693l20119k75326k43431k16818j66148o5869R5391L10445N28437O71566
1125.9F4658821O89298N82623L91448J85072R775j13684j55049j10942p076J42509
1146.3F6272795L44962N84638Q20577J019866J152598J198543J150792J024831Q78000
1164.6G4447602P76506P69269Q54486R56756J010072J023758J044219J076007J078505
1183H3037180J027131R40984Q49444P67654P16716P02679P05082O85387O14411N08916
1203.4I0555584L93171K75588J73020R7305L2836k6596o4349q5574j25099k02590l03149
1225.8I0720147m15355n30207o25432o87599p09182o80989n96321m59557k85781q6230
1246.2H5643494J22267L13026M69202N80465O26797N98097N22721M19598K91765J70839
$$ y = [64340693, 64020574, 63745248, 63501817, 63284999, 63118851, 63052982, 63148373, 63458818, 63987255, 64658821, 65348119, 65930742, 66322190, 66507262, 66517037, 66403353, 66248304, 66137362, 66130286, 66272795, 66617757, 67202395, 68022972, 69042838, 70195436, 71393979, 72544771, 73569602, 74447602, 75224108, 75993377, 76847863, 77804619, 78814691, 79838449, 80882668, 81958675, 83037180, 84064311, 85005295, 85854739, 86622393, 87339109, 88041788, 88746870, 89432257, 90046668, 90555584, 90948755, 91224343, 91397363, 91494668, 91527504, 91500908, 91436559, 91350985, 91225886, 91023296, 90720147, 90304792, 89774585, 89149153, 88461554, 87752372, 87071383, 86475062, 86015505, 85729724, 85643494, 85765761, 86078787, 86547989, 87128454, 87755251, 88353348, 88876069, 89295667, 89587432, 89758271]
1266.6H9758271Q0585J8448k2662n2666p9257q9019p0787l8921l5620j00404k45851
1289H9122117m55720n99110m97138j60176J93131M10801N33438O30009O93757O68698
1309.4I0539807N43767L69823J61338m2486j01692K8986K42907M03708M05610K67702
1329.8I2819470P5263j53595m34941o91742q41111j035649j390993j546651j185125
1348.2H5614926n41735L022K79266K38055k07025j059985j977563k029747j068020
1366.6G9251194m95750j478594l555632m753774l071207Q33726M312366N492300N123794
1384.9H1658423M704171L830815K290672J124251O46490N02783M45795M20349L11625
1403.3I5935374K91652K96789R3061j77389l78657n69164o43975l02172j1313k66105
$$ y = [89758271, 89838856, 89857304, 89834642, 89781976, 89702719, 89613700, 89542913, 89503992, 89468372, 89367968, 89122117, 88666397, 88067287, 87570149, 87409973, 87603104, 88013905, 88547343, 89177352, 89871109, 90539807, 91083574, 91453397, 91614735, 91572249, 91470557, 91499543, 91742450, 92146158, 92551768, 92819470, 92894733, 92741138, 92306197, 91614455, 90773344, 89737695, 88346702, 86800051, 85614926, 85073191, 85076213, 85355479, 85593534, 85386509, 84326524, 82348961, 80319214, 79251194, 78755444, 77276850, 73721218, 68967444, 65896237, 66729963, 71042329, 76534629, 81658423, 86362594, 90193409, 92484081, 93608332, 94254822, 94757605, 95203400, 95623749, 95935374, 96227026, 96523815, 96616876, 96439487, 96060830, 95491666, 94847691, 94545519, 94534206, 94268101]
1423.7I4268101p37410j350069k096802k615840k968502l519255l598219l157437l314739
1442G0909828l642768l671616l620088l597790l781366l800694l264823j721993l98791
1460.4D3409899r9754M31382K209726M901135P882059J0271919R051287N949360M005110
1478.7H8012123K829498K039540J403630J001596J145691J620102J493156R17613P09617
1497.1A01172566Q30198O89304J23024m93992j37782P98798P44879K87318n8543j13953
1517.5A03841817p5733M7958L47173L93355L74090K50888o8152n3727N6839m00353
1537.9A04714155o41382J66059O84321O02651K88832J9276q8394k62677o26553o67977
1558.3A04188311N70202J002312L92294k6906j72591M2844J58465j45638q6010L19517
$$ y = [94268101, 93530691, 92180622, 90083820, 87467980, 84499478, 80980223, 77382004, 74224567, 70909828, 67267060, 63595444, 59975356, 56377566, 52596200, 48795506, 45530683, 43808690, 43409899, 43310145, 43741527, 45951253, 50852388, 58734447, 69006366, 78057653, 84007013, 88012123, 90841621, 92881161, 94284791, 95286387, 96432078, 98052180, 99545336, 100462949, 101172566, 102002764, 102692068, 102815092, 102321100, 102183318, 102982116, 103726995, 104014313, 103955770, 103841817, 103766084, 103814042, 104161215, 104554570, 104928660, 105179548, 105111396, 105057669, 105114508, 104714155, 104072773, 104238832, 104923153, 105525804, 105814636, 105833912, 105745518, 105482841, 104856288, 104188311, 104758513, 105760825, 106153119, 106126213, 105953622, 105996466, 106154931, 106009293, 105923283, 106242800]
1578.7A06242800K70831P2098p784l8052n9533p0941p9775o3765m0162p5102j25670
1601.1A06024945j14596r7883j16277r7012p4589k25377m15731j70648J02973j31619
1621.5A04684186k35677m3559J6153J0502j86765o29032o32572L3903K48373K8896
1641.9A03294408k99525m97401j70743j44530o23500j16765O65748L12483j81067k93887
1662.3A01945221r0706j70946m16720j68109J37997J41883K75099K08700k48063o35564
1682.7A00978792k71797L19051J13666k31683n62191r75031j030552q16691m62282
1701.1I7061282j75792l54915m73607n46193q98308j413095k005666k560771k539384
1719.4H6093551k199143j967860j576811j234644j080340r68248q42387m69440l20095
$$ y = [106242800, 106513631, 106585729, 106577945, 106539893, 106480360, 106409419, 106329644, 106265879, 106225717, 106150615, 106024945, 105910349, 105812466, 105696189, 105599177, 105524588, 105299211, 104883480, 104712832, 104815805, 104684186, 104448509, 104404950, 104421103, 104431605, 104244840, 103615808, 102983236, 103017139, 103265512, 103294408, 102994883, 102497482, 102326739, 102182209, 101558709, 101441944, 102107692, 102420175, 102239108, 101945221, 101854515, 101683569, 101266849, 101098740, 101236737, 101378620, 101653719, 101862419, 101614356, 100978792, 100706995, 101026046, 101139712, 100908029, 100345838, 99370807, 98340255, 97523564, 97061282, 96885490, 96530575, 96056968, 95510775, 94612467, 93199372, 91193706, 88632935, 86093551, 83894408, 81926548, 80349737, 79115093, 78034753, 77066505, 76224118, 75754678, 75434583]
1737.8G5434583k69705J26851O56325J233118K022118L261584M336828M166472L623676
1756.1I4591850L131127K348107J828075J398361Q21089M08686K18260L40259O06811
1774.5A05692625N11122K31075J26636J59526J78075J61028n567k00868K265K96617
1794.9A07152534J92964M673M2033J99103J91963M9269m5085K0516J27614J01351L5143
1817.3A08072078L0399k5964j33920j08337m8101j192J81198K19226P4470K3114k7787
1839.8A08255184k05350k19798R1707K53070J68204P4279J7488k265n006J657q953
1862.2A08420217r1648k29228j85144J09852K33161J07849Q273n400m113n233j5700
1884.6A08342886o7675r3436J3864P8523K8753K3294L2651R477q428k2042m7719l8398
$$ y = [75434583, 75164878, 75291729, 75948054, 77181172, 79203290, 82464874, 86801702, 90968174, 94591850, 97722977, 100071084, 101899159, 103297520, 104118609, 104527295, 104745555, 105085814, 105692625, 106203747, 106434822, 106561458, 106720984, 106899059, 107060087, 107054520, 106853652, 106855917, 107152534, 107345498, 107350171, 107392204, 107591307, 107783270, 107832539, 107787454, 107807970, 107935584, 108036935, 108072078, 108102477, 108076513, 107942593, 107834256, 107786155, 107784963, 107966161, 108185387, 108259857, 108282971, 108255184, 108049834, 107830036, 107921743, 108174813, 108343017, 108417296, 108434784, 108432519, 108427513, 108429170, 108420217, 108328569, 108099341, 107914197, 108024049, 108257210, 108365059, 108373332, 108367932, 108363819, 108358586, 108342886, 108275211, 108181775, 108195639, 108274162, 108302915, 108326209, 108358860, 108368337, 108359909, 108337867, 108290148, 108251750]
1909.1A08251750J8204K1159p7784j22893j9669K4545J8227O5208N2392l528k4665
1931.5A08202946j8871j2385k8730q5986j07705r18Q8346N7340J3113J323j323l744
1956A08103406l087M065O759j9371l7980J1420O1822M8732K1255M733J407J2755J2219
1982.5A08228135k384j2732k2637k4856K5916P8953N2511R347N161J1087Q392O568
2007A08363461L040q619k7441n0939m1699j442J1599k802j2409n007J2755J4258M351
2033.5A08259106Q988J1635K754O544J8478K0539J5068J3245J7404J5330O044J038
2058A08396173L266N12l945Q249J7667P391N12O56m864p272j823J204P98m7q548j2326
2090.6A08397603j19J0502Q404K015P99j323m817j466P010O091r656j4972j955M136
$$ y = [108251750, 108269954, 108291113, 108213329, 108090436, 108070767, 108095312, 108113539, 108178747, 108231139, 108227611, 108202946, 108184075, 108171690, 108142960, 108056974, 107949269, 107948351, 108036697, 108094037, 108107150, 108108473, 108107150, 108103406, 108100319, 108104384, 108111143, 108091772, 108053792, 108065212, 108127034, 108175766, 108197021, 108201754, 108203161, 108215916, 108228135, 108225751, 108213019, 108190382, 108165526, 108191442, 108270395, 108322906, 108332253, 108337414, 108348501, 108356893, 108363461, 108366501, 108357882, 108330441, 108279502, 108237803, 108236361, 108247960, 108245158, 108232749, 108227742, 108240497, 108254755, 108259106, 108268094, 108279729, 108282483, 108289027, 108307505, 108328044, 108343112, 108356357, 108373761, 108389091, 108395135, 108396173, 108399439, 108399951, 108396006, 108404255, 108421922, 108429313, 108429825, 108430481, 108425617, 108418345, 108416522, 108417726, 108418524, 108418477, 108409929, 108397603, 108397484, 108407986, 108416390, 108418405, 108419204, 108417881, 108413064, 108411598, 108418608, 108424699, 108415043, 108400071, 108398116, 108402252]
2119.2A08402252R90K956J574n222o616o580q786q941o687o652r561j1146j5592j8871
2147.7A08303118j1897m077K062R084J0073M029K718Q166Q690J1385J7261J2386Q071
2174.3A08381069J4436J5187Q822J2517K1422K0969J5699J2136J4055K2256K5570K1565
2198.7A08585703J6678J3399J2028J4782K1076K3198J8907J4019Q500J692J79M816
2223.2A08734977Q929O545K336J991j07m518o903r41R632R143M89l266o116j0788j3638
2253.8A08727765j8799j9694j3113r167j1635j7178j8203j1349m410q190j3626q452
2278.3A08573949m220j1718k4927l5822m2331m2641l8410m2021n7769o8235o7902p1513
2302.7A08066440q7715j07348j12676j03057q8632r0503j23537j52421j40107r9837
$$ y = [108402252, 108403242, 108406198, 108407772, 108402550, 108395934, 108389354, 108380568, 108371627, 108364940, 108358288, 108348727, 108337581, 108321989, 108303118, 108291221, 108287144, 108289206, 108298290, 108308363, 108312392, 108315110, 108323276, 108331966, 108343351, 108360612, 108372998, 108381069, 108395505, 108410692, 108419514, 108432031, 108453453, 108474422, 108490121, 108502257, 108516312, 108538568, 108564138, 108585703, 108602381, 108615780, 108627808, 108642590, 108663666, 108686864, 108705771, 108719790, 108728290, 108729982, 108730161, 108734977, 108743906, 108750451, 108752787, 108754778, 108754671, 108750153, 108743250, 108742309, 108751941, 108761084, 108761573, 108758307, 108752191, 108741403, 108727765, 108708966, 108689272, 108676159, 108666992, 108655357, 108638179, 108619976, 108608627, 108604217, 108596027, 108582401, 108573949, 108569729, 108558011, 108533084, 108497262, 108454931, 108412290, 108373880, 108331859, 108274090, 108205855, 108137953, 108066440, 107978725, 107871377, 107758701, 107655644, 107567012, 107476509, 107352972, 107200551, 107060444, 106960607]
2323.1A06960607p2205q2279r1159m9973j2958k6142l5060k9528k4974K9266J46365
2345.6A06711960J50215k7191k11501k73073k37858j59812m1282M8244Q1944J19495
2366A06161141J71864K16759K39336K28012K12848K14589K16412J95825J49465R2661
2386.4A08098912M5276J4400J550N84r620j9789r977J788K74p04N520R334R620J2839
2414.9A08160007J2994M113O544K1017J7297J061j752P617J4544J1289P498J0002J3387
2441.4A08285618J5020N269r846j0872m351l34M041K992m530p224r954j3232j0884
2467.9A08241713j3339j6976j5080j7619k1148k3126k9373k9159j9932j9133l0374
2490.4A08006454l5787l0577l2080m1544m1151l3379l6120m5514n2202n6267n5682
$$ y = [106960607, 106888402, 106806123, 106714964, 106664991, 106652033, 106625891, 106590831, 106561303, 106536329, 106565595, 106711960, 106862175, 106834984, 106623483, 106350410, 106112552, 105952740, 105911458, 105959702, 106041646, 106161141, 106333005, 106549764, 106789100, 107017112, 107229960, 107444549, 107660961, 107856786, 108006251, 108098912, 108144188, 108158588, 108160138, 108160722, 108151102, 108131313, 108121336, 108123124, 108123398, 108122694, 108128214, 108137548, 108147168, 108160007, 108173001, 108177114, 108183658, 108204675, 108221972, 108223033, 108221281, 108228898, 108243442, 108254731, 108262229, 108272231, 108285618, 108300638, 108305907, 108296061, 108285189, 108280838, 108280504, 108284545, 108287537, 108283007, 108275783, 108265829, 108252597, 108241713, 108228374, 108211398, 108196318, 108178699, 108157551, 108134425, 108105052, 108075893, 108055961, 108036828, 108006454, 107970667, 107940090, 107908010, 107866466, 107825315, 107791936, 107755816, 107710302, 107658100, 107601833, 107546151]
2512.8A07546151n1070n0163n6875n6004m7803n1034n1093l9470l7539l9720l3164
2535.3A07032216k9958l7050m4882m5467m2689l9947l6203l5119m4287n9092o4516
2557.7A06553006o0975o3563p8583r3531r5487q8191q9216j00780j09112j08802j06406
2580.1A05558360j06335r9397r0658q7524q8239r0837q6844q0717p7366p0608n8556
2602.6A04621279n4502o3956o3860n0080m4883m7218m3285l7849l8541m3165m9293
2625A04084647n1487m7326m3893m3344m4608m8697m9627m5669m9186n9271o6161p6497
2649.5A03458881r3793j06991j15502j30677j43576j45793j40619j25575j02091p1752
2669.9A02282512l5083j0407k1267m8053n5373m5049l0422k3485l3187l4357j0526
$$ y = [107546151, 107495081, 107444918, 107388043, 107332039, 107284236, 107233202, 107182109, 107142639, 107105100, 107065380, 107032216, 107002258, 106965208, 106920326, 106874859, 106832170, 106792223, 106756020, 106720901, 106676614, 106617522, 106553006, 106492031, 106428468, 106349885, 106256354, 106160867, 106072676, 105983460, 105882680, 105773568, 105664766, 105558360, 105452025, 105352628, 105261970, 105174446, 105086207, 104995370, 104908526, 104827809, 104750443, 104679835, 104621279, 104566777, 104502821, 104438961, 104388881, 104343998, 104296780, 104253495, 104215646, 104177105, 104133940, 104084647, 104033160, 103985834, 103941941, 103898597, 103853989, 103805292, 103755665, 103709996, 103660810, 103601539, 103535378, 103458881, 103365088, 103258097, 103142595, 103011918, 102868342, 102722549, 102581930, 102456355, 102354264, 102282512, 102247429, 102237022, 102215755, 102167702, 102112329, 102067280, 102036858, 102013373, 101980186, 101945829, 101935303]
2692.3A01935303L088m554j6713l6609n9092q4234j24037j74344k24053k62142k84254
2714.7A00668359k83027k51925k08437j64432j17671o3199J0663J00929J78492K11310
2735.1A00081062K04015J80876J48523J18613R5070O8509N4396N0306K1696k9921p7498
2757.6A00915647j09411j23930j45018j88410k30539k72018l32039l87383m10783m36455
2778I8279661m82577n21696n61124o07318o37364o42568o51479o91998p35306p54446
2798.4I1993785p75683q17508q79454r57853j036912j108372j181346j273704j395756
2816.7H2567197j547986j732832j968319k293753k749211l353226m076946m826247
2833F0018677n518491o138107o615749o738272o344491n582118m702179l741158k602821
$$ y = [101935303, 101938391, 101933837, 101917124, 101880515, 101821423, 101737189, 101613152, 101438808, 101214755, 100952613, 100668359, 100385332, 100133407, 99924970, 99760538, 99642867, 99579668, 99590331, 99691260, 99869752, 100081062, 100285077, 100465953, 100614476, 100733089, 100828159, 100896668, 100951064, 101001370, 101023066, 100993145, 100915647, 100806236, 100682306, 100537288, 100348878, 100118339, 99846321, 99514282, 99126899, 98716116, 98279661, 97797084, 97275388, 96714264, 96106946, 95469582, 94827014, 94175535, 93483537, 92748231, 91993785, 91218102, 90400594, 89521140, 88563287, 87526375, 86418003, 85236657, 83962953, 82567197, 81019211, 79286379, 77318060, 75024307, 72275096, 68921870, 64844924, 60018677, 54500186, 48362079, 41746330, 35008058, 28663567, 23081449, 18379270, 14638112, 12035291]
2851.4A2035291j328606j35477Q13182J425268J627706J438054R69525M55588K62612
2869.7A7563143O13372J276088J785827J839973J379047N89751k37693r19750j378803
2888.1B2510955j597943j625716j549600j445465j347400j249633j158441j090551
2904.4A1446206j041438j002316r67762r49739r44052r08877q01401o08382l54145
2922.8C868094r0457J72323M36706O64785Q89994J152731J385583J498552J424852
2941.1A1403163J079070M71232k12746p05055q25251o28625k15461L59662R97804J691836
2961.5A3415629K536086L587915M744862N772917O494245O795636O648162O197459
2977.8E6192911N593758M912884M243773L634673L081453K572203K093511J665336
$$ y = [12035291, 10706685, 10571208, 11384390, 12809658, 14437364, 15875418, 16844943, 17300531, 17563143, 18176515, 19452603, 21238430, 23078403, 24457450, 25047201, 24809508, 23889758, 22510955, 20913012, 19287296, 17737696, 16292231, 14944831, 13695198, 12536757, 11446206, 10404768, 9402452, 8434690, 7484951, 6540899, 5632022, 4830621, 4222239, 3868094, 3777637, 3949960, 4386666, 5051451, 5941445, 7094176, 8479759, 9978311, 11403163, 12482233, 12953465, 12740719, 12035664, 11210413, 10581788, 10366327, 10725989, 11723793, 13415629, 15951715, 19539630, 24284492, 30057409, 36551654, 43347290, 49995452, 56192911, 61786669, 66699553, 70943326, 74577999, 77659452, 80231655, 82325166, 83990502]
2994.2H3990502J297993R58830O45006M02432K81668L09312M68600P18433J013607
3012.5I0086383J265734J387155J360959J224697J041233Q73387P42316O23805N25158
3030.9I9130827M57883M08816L75015L30305K77329K51841K47526K38538K08950J77956
3051.3A02104986J72519J68872J51730J35362J16098J00338J01602J21856J46604J44374
3071.7A03464341J18208Q7452O8927P7641R2256J04225J13010R0885O1107O3228O4505
3094.1A04405785M3344K1815J5974L6884N0461K7108J5617M3535M0567j3352k4461
3116.5A04663277J6677M8053N1582L3295J3423Q82j394J645k0182n9975o0081k3556
3141A04663646q201j7369l1233n9628q4401n7172p630r525l9041l8874l0720l7479
$$ y = [83990502, 85288495, 86247325, 86892331, 87294763, 87576431, 87885743, 88354343, 89072776, 90086383, 91352117, 92739272, 94100231, 95324928, 96366161, 97239548, 97981864, 98605669, 99130827, 99588710, 99997526, 100372541, 100702846, 100980175, 101232016, 101479542, 101718080, 101927030, 102104986, 102277505, 102446377, 102598107, 102733469, 102849567, 102949905, 103051507, 103173363, 103319967, 103464341, 103582549, 103670001, 103738928, 103816569, 103908825, 104013050, 104126060, 104216945, 104278052, 104341280, 104405785, 104449129, 104470944, 104486918, 104523802, 104574263, 104601371, 104616988, 104660523, 104701090, 104687738, 104663277, 104679954, 104728007, 104779589, 104812884, 104826307, 104827189, 104825795, 104827440, 104807258, 104747283, 104687202, 104663646, 104655445, 104638076, 104606843, 104547215, 104462814, 104405642, 104398012, 104388487, 104349446, 104310572, 104279852, 104242373]
3165.5A04242373m2284m4012m6373m4941m1020l8112l1864k3186k2722k8634k3937
3187.9A03855288n329l93j3042n745J6832J3888j085M542J2767J0002J6963K1327J0848
3214.4A03936863R537J7297K7096K9958R274j5211j9169k3556k8968j990L1232L2294
3238.9A04004657J1301j4126l0172k8622j6081j9074m6635n2809k0111K074r596l2437
3263.4A03748369m6146n9366p6103o0690j4257J1945O699n245k3782m5633m7887n5206
3287.8A03332698q9311r5535n5420k3103k5081m4978q0252j20842j09160m2462L778
3310.3A02650332j1456m7004n0795m6491o3015r3412j14775r3639n6588n4765q4281
3332.7A01934111j22106j35887j02150p1395p5089o8391o4945r6989r5010m1925k3890
$$ y = [104242373, 104200089, 104156077, 104109704, 104064763, 104023743, 103985631, 103953767, 103930581, 103907859, 103879225, 103855288, 103849959, 103849566, 103836524, 103830779, 103847611, 103861499, 103860414, 103864956, 103877723, 103887725, 103904688, 103926015, 103936863, 103946400, 103963697, 103990793, 104020751, 104030025, 104014814, 103995645, 103972089, 103943121, 103941131, 103972363, 104004657, 104015958, 104001832, 103971660, 103943038, 103926957, 103907883, 103861248, 103808439, 103788328, 103790402, 103780806, 103748369, 103702223, 103642857, 103566754, 103506064, 103491807, 103503752, 103510451, 103505206, 103481424, 103435791, 103387904, 103332698, 103243387, 103147852, 103092432, 103069329, 103044248, 102999270, 102919018, 102798176, 102689016, 102646554, 102650332, 102638876, 102591872, 102541077, 102494586, 102431571, 102338159, 102223384, 102129745, 102073157, 102018392, 101934111, 101812005, 101676118, 101573968, 101502573, 101427484, 101359093, 101294148, 101197159, 101102149, 101060224, 101036334]
3355.2A01036334n4204p8440p1323o0737p6127q0943l9244Q452J109l8600n3001m9293
3379.6A00443983m8804n0557n0866o6007j05631j01614l5393j6469q0353j17570n3406
3402.1I9717313J6445m274n1182o2704n5152m0299m3154p4142o5225j3996j1092n5087
3426.5I9257451p8886o4856n7739o5059j9699N8913P8619L9839p999j0621M8631P0525
3451I9249119K2018l225q148l3075j7249R715l9118p2724K2280J42062J37609O3598
3475.5I9472862m333l3837M7266J26100R3287P6848J03599P8774L3164K7346L9911
3497.9A00060987P487k1851P5674J62315J15752R1470J12664J04928J03426J03236
3518.3A00916088O1500K2828O4278J50347K00486K11978J78158J18375J27661J71995
$$ y = [101036334, 100982130, 100903690, 100832367, 100771630, 100695503, 100614560, 100575316, 100583768, 100584877, 100546277, 100493276, 100443983, 100395179, 100344622, 100293756, 100227749, 100122118, 100020504, 99985111, 99968642, 99888289, 99770719, 99717313, 99733758, 99729484, 99678302, 99615598, 99560446, 99520147, 99476993, 99402851, 99337626, 99323630, 99312538, 99257451, 99178565, 99113709, 99055970, 98990911, 98971212, 99030125, 99108744, 99148583, 99140584, 99129963, 99178594, 99249119, 99271137, 99267912, 99259764, 99226689, 99209440, 99219155, 99180037, 99107313, 99129593, 99271655, 99409264, 99472862, 99468529, 99434692, 99481958, 99608058, 99701345, 99778193, 99881792, 99960566, 99993730, 100021076, 100060987, 100068474, 100046623, 100122297, 100284612, 100400364, 100491834, 100604498, 100709426, 100812852, 100916088, 100977588, 101000416, 101064694, 101215041, 101415527, 101627505, 101805663, 101924038, 102051699, 102223694]
3538.7A02223694J23906L1317M6062J88005K59412K01666K05266K38216J71030R4449
3559.1A03783023N8473l9208j36936O2644M23229M50397K56395J41525J23298J19150
3579.5A05241990P0143o8641j74224J3649L04127K56538Q5461P0894J09375J21569
3599.9A06030881J47772Q6236o3991p4017O3061J34600J40559P5746M3714K52175L65353
3622.3A07202089R7084k59757k05779L10659M69375L03554J94931J25873P0668k7764
3642.7A08280933k75850n22328k93732L97611N87702K95639J89841K64811K11513Q8108
3663.1A09224248r0039l18956l41261j17147j10602o3002L41380M54843K74896O2323
3683.5A09316683k09189m01544j57845L36146M35650K27011J3840j12951o0356R1565
$$ y = [102223694, 102347600, 102378917, 102424979, 102612984, 102872396, 103074062, 103279328, 103517544, 103688574, 103783023, 103841496, 103802288, 103665352, 103727996, 104151225, 104601622, 104858017, 104999542, 105122840, 105241990, 105312133, 105243492, 105069268, 105082917, 105387044, 105643582, 105729043, 105799937, 105909312, 106030881, 106178653, 106264889, 106200898, 106126881, 106189942, 106324542, 106465101, 106540847, 106584561, 106836736, 107202089, 107299173, 107039416, 106833637, 107144296, 107613671, 107917225, 108112156, 108238029, 108308697, 108280933, 108005083, 107482755, 107189023, 107586634, 108174336, 108469975, 108659816, 108924627, 109136140, 109224248, 109134209, 108815253, 108473992, 108356845, 108246243, 108183241, 108524621, 108979464, 109254360, 109316683, 109107494, 108705950, 108548105, 108884251, 109319901, 109546912, 109560752, 109447801, 109387445, 109479010]
3703.9A09479010J1718k45833l19147Q201L47317K52831j8418j68634j59430n7721
3724.3A09129894O5207N4324j83523m35042l15857J73712L94988Q9109k90418k36535
3744.7A08445859K7549o5684j1265L60667L58379R5952L7741J53566R2554o7556r0647
3767.1A09337115o664J44530K04992L9089j61564j31000M8972Q1825N8102R1446P1657
3789.6A09778500j6988j46830k38144k35999k20144o0939J36959J12307J69552K15935
3810A09494209j3756k64669k61915j70862j48392J25301L19683J74737K8110q8835
3830.4A09193611j73664k07674k14041o1691J72842K77400K73883J41883j69468n24008
3850.8A08709073m62127K43962N08750K13968o8342j61493o0642m1723j18113J753
$$ y = [109479010, 109490728, 109244895, 108925748, 108933949, 109281266, 109534097, 109515679, 109347045, 109187615, 109129894, 109195101, 109249425, 109065902, 108630860, 108315003, 108488715, 108883703, 108972812, 108682394, 108445859, 108473408, 108407724, 108396459, 108757126, 109115505, 109211457, 109249198, 109402764, 109495318, 109427762, 109337115, 109330451, 109474981, 109679973, 109719062, 109557498, 109426498, 109475470, 109557295, 109615397, 109706843, 109778500, 109761512, 109614682, 109376538, 109140539, 108920395, 108859456, 108996415, 109108722, 109278274, 109494209, 109480453, 109215784, 108953869, 108783007, 108634615, 108759916, 109079599, 109254336, 109282446, 109193611, 109019947, 108812273, 108598232, 108536541, 108709383, 108986783, 109260666, 109402549, 109233081, 108709073, 108246946, 108490908, 108999658, 109213626, 109145284, 108983791, 108923149, 108881426, 108763313, 108765066]
3871.2A08765066J78158K16544P3206j40572j14095j2183K6500J09172L7205j1670
3891.6A09127331J22297N7387k06649l17645j76514J03200L48580L34656J47510P74
3912A09540927j08075j67680p8654M5657L7849l063K8371N508p3779k5451R5916J01006
3936.4A09398532J2374p5722q2540j0944j967j6117M4012P1669K3711k6870m4298l0995
3960.9A09260845K98J4949r477l6383l4511k0838r429N48r906l9208m3154k8670l1638
3987.4A09013426k9850k0277l2640m1389k1839
3997.6A08867431
$$ y = [108765066, 108943224, 109159768, 109232974, 109092402, 108978307, 108966124, 108992624, 109101796, 109139001, 109127331, 109249628, 109307015, 109100366, 108782721, 108606207, 108709407, 109057987, 109392643, 109540153, 109540927, 109432852, 109265172, 109186518, 109232175, 109270024, 109266961, 109295332, 109300840, 109227061, 109201610, 109297526, 109398532, 109410906, 109335184, 109252644, 109241700, 109239733, 109223616, 109267628, 109339297, 109363008, 109336138, 109291840, 109260845, 109261143, 109276092, 109266615, 109230232, 109195721, 109174883, 109165454, 109166002, 109156096, 109116888, 109073734, 109045064, 109013426, 108983576, 108963299, 108930659, 108889270, 108867431]
##END=$$ End of the data block
