##TITLE=Oleo Resina $$ Begin of the data block
##JCAMP-DX=5.00 $$ ACD/SpecManager v 10.08
##SPECTROMETER/DATA SYSTEM=Alpha
##DATE=09 Sep 2014 09:25:40
##DATA TYPE=INFRARED SPECTRUM
##DATA CLASS=XYDATA
##ORIGIN=
##OWNER=
##NPOINTS=1667
##FIRSTX=599.64648438
##LASTX=3997.64306641
##MAXX=3997.64306641
##MINX=599.64648438
##MAXY=1.11795568
##MINY=0.14714140
##XFACTOR=1.0000000000
##YFACTOR=0.000000010000000
##FIRSTY=1.03539121
##DELTAX=2.03961372
##XUNITS=1/CM
##YUNITS=ARBITRARY UNITS
##XYDATA=(X++(Y..Y))
599.6A03539121j0979J2898K8503N4503P6139O8784O1702N3954L8112L0803K0826m983
624.1A03969383k3806k6107l3152p2491j01268o7377m5169q4889j25169j39189j53220
646.6A03097546j66368j67168j54197j38092j51348j82891k09272k44403k76470l97634
667A01009703m88746k95306k72488l87812m48632m59612m69148m79674m72605m56977
687.3I6778703m24171l76236l38537l19230k92963k73228l01701l78167m63617n29975
707.7I3080878n99563o98501q11815r44442j115089j153612p62010P319P23362J097036
728.1H8823563J169449J138031J117492J093680J033401R46296Q70889Q06385P16961
746.5I7716147O12473N30076M40330L17555K19894J84387J67214J44673J45078J70254
$$ y = [103539121, 103528142, 103541040, 103569543, 103624046, 103700185, 103768969, 103830671, 103884625, 103922737, 103953540, 103974366, 103969383, 103945577, 103919470, 103886318, 103813827, 103712559, 103645182, 103600013, 103515124, 103389955, 103250766, 103097546, 102931178, 102764010, 102609813, 102471721, 102320373, 102137482, 101928210, 101683807, 101407337, 101009703, 100520957, 100225651, 99953163, 99565351, 99116719, 98657107, 98187959, 97708285, 97235680, 96778703, 96354532, 95978296, 95639759, 95320529, 95027566, 94754338, 94452637, 94074470, 93610853, 93080878, 92481315, 91782814, 90970999, 90026557, 88911468, 87757856, 86995846, 87003165, 87726527, 88823563, 89993012, 91131043, 92248535, 93342215, 94375616, 95321912, 96192801, 96999186, 97716147, 98328620, 98858696, 99299026, 99616581, 99836475, 100020862, 100188076, 100332749, 100477827, 100648081]
766.9A00648081K11573K59721K74861K44474K06936J84178J69969J58012J40774J26183
787.3A02624762J16050J07694J14286J19412J02997O9415K7156r990m4322o0594l4809
809.7A03132057j2684j4591j7023l6871o5160p0405o6209p7534q8119q3459q4352q9443
834.2A02426207q2946r1135j18590j17123r4867q2075o3121m1068k2972P463M1616
856.6A01761389M7326J2445j8644q380N173N746K3008N6982Q3088R4653J03616R9516
881.1A02265918P1252K4342j0073N829L8982N5659N9998L6645m459l0684m4692n6720
905.6A02411997m5311o092J9694K6250N8507J19508J58870J61219J47771J14847O5219
928A03232479J5557l3844p5590j10007j38258j50323j51670j46950j47080j52040j40357
$$ y = [100648081, 100859654, 101119375, 101394236, 101638710, 101845646, 102029824, 102199793, 102357805, 102498579, 102624762, 102740812, 102848506, 102962792, 103082204, 103185201, 103254616, 103281772, 103271782, 103227460, 103166866, 103132057, 103119373, 103104782, 103087759, 103050888, 102985728, 102915323, 102849114, 102771580, 102683461, 102600002, 102515650, 102426207, 102343261, 102252126, 102133536, 102016413, 101921546, 101839471, 101776350, 101735282, 101712310, 101719773, 101761389, 101808715, 101821160, 101802516, 101794136, 101799309, 101805055, 101828063, 101885045, 101968133, 102062786, 102166402, 102265918, 102337170, 102361512, 102351439, 102357268, 102396250, 102451909, 102511907, 102548552, 102544093, 102513409, 102468717, 102411997, 102366686, 102360594, 102380288, 102406538, 102465045, 102584553, 102743423, 102904642, 103052413, 103167260, 103232479, 103248036, 103214192, 103138602, 103028595, 102890337, 102740014, 102588344, 102441394, 102294314, 102142274, 102001917]
950.5A02001917j33216j59502j90568j99199j90460j57559r2256j1504O5708J29402
970.9A01062763J59907J46389J06824N5706M268j3519Q119K9850L3032J6511n722j1706
995.3A01592422k4271n8282p2682n5122m8685o1727p2920q8394j26290j83642k28250
1017.8A00572157k40934k22003j81395j45489j16611p1305l46P6563J43391K08014
1038.2A00022042K45118K03764Q7715n7555k01726l24976m10050m55606m50629l94470
1058.6I8263627l32820k78479k11173j63311j77681k70820m53478p11727r96697j233989
1079I3433452j350916j329720j242941j192409j198584j178074j022488p08169l03405
1097.3H3906746J10096M78267P44975Q14915O09296J51557m02922q50170j023502q27264
$$ y = [102001917, 101868701, 101709199, 101518631, 101319432, 101128972, 100971413, 100879157, 100867653, 100933361, 101062763, 101222670, 101369059, 101475883, 101531589, 101535857, 101522338, 101530457, 101560307, 101593339, 101609850, 101604128, 101592422, 101568151, 101509869, 101437187, 101382065, 101333380, 101271653, 101198733, 101110339, 100984049, 100800407, 100572157, 100331223, 100109220, 99927825, 99782336, 99665725, 99594420, 99594074, 99670637, 99814028, 100022042, 100267160, 100470924, 100558639, 100501084, 100299358, 99974382, 99564332, 99108726, 98658097, 98263627, 97930807, 97652328, 97441155, 97277844, 97100163, 96829343, 96375865, 95664138, 94667441, 93433452, 92082536, 90752816, 89509875, 88317466, 87118882, 85940808, 84918320, 84210151, 83906746, 84016842, 84495109, 85240084, 86054999, 86664295, 86815852, 86412930, 85562760, 84539258, 83711994]
1117.7H3711994k92880L86656Q73255Q49933K54989p12628j744139k526480k869063
1136.1G7931637k758146k307355j725429j244784j014507j028049j167869j310599
1152.4F5374899j380104j339888j174438q85672m99683p3678L37941P02673J008063
1170.7F2070113J248777J426417J539069J588226J589739J548201J480734J420045
1187.1G3911321J377839J347214J325059J299852J251543J154619R95874Q02452O10179
1205.4H4075952M47255L33184K67386K13254J17427l1042j96523l44479m60690n36042
1225.8H3885682n52529n08315m45241l92478l23028j82747M8393L40789O53839R26948
1246.2H3451313J076358J037342Q30161N72717L88360L06368K80536K60633K45732
$$ y = [83711994, 83419114, 83805770, 84679025, 85528958, 85783947, 85071319, 83327180, 80800700, 77931637, 75173491, 72866136, 71140707, 69895923, 68881416, 67853367, 66685498, 65374899, 63994795, 62654907, 61480469, 60594797, 60095114, 60021436, 60359377, 61062050, 62070113, 63318890, 64745307, 66284376, 67872602, 69462341, 71010542, 72491276, 73911321, 75289160, 76636374, 77961433, 79261285, 80512828, 81667447, 82663321, 83465773, 84075952, 84523207, 84856391, 85123777, 85337031, 85454458, 85423416, 85226893, 84882414, 84421724, 83885682, 83333153, 82824838, 82379597, 81987119, 81664091, 81481344, 81529737, 81870526, 82524365, 83451313, 84527671, 85565013, 86395174, 86967891, 87356251, 87662619, 87943155, 88203788, 88449520]
1264.6H8449520K70516L13222L07101K21848J01966N2112J54567L94726O79147Q60036
1285I1804761Q20344N91571L17150J35696P0399M8601L3427N6851J23506J75691J65326
1307.4I4343323R6261J3751l2437m3529j9914R9236K79396M18640M80633M42160L07721
1329.8I6385241J13159j21689l84718n75262n19592l16864k69431l41326l51733k73442
1350.2I3344343j76418j16259r4259j65707l04967k82138o8409k0826j30814k82943
1370.6I1701603o39862r81486o91753L43042J487738J903778J590717J302600J181388
1389I7197765P65944J76191j43576j42318m3040J14900K49731M51857M69911o0987
1409.4I9036378q03316j285428j360988r68951N1289P75302N73951N1391o17951j227445
$$ y = [88449520, 88720036, 89033258, 89340359, 89562207, 89664173, 89716285, 89870852, 90265578, 90944725, 91804761, 92625105, 93216676, 93533826, 93669522, 93739921, 93788522, 93821949, 93878800, 94002306, 94177997, 94343323, 94439584, 94453335, 94420898, 94377369, 94357455, 94456691, 94736087, 95154727, 95635360, 96077520, 96385241, 96498400, 96376711, 95991993, 95416731, 94897139, 94580275, 94310844, 93969518, 93617785, 93344343, 93167925, 93051666, 92957407, 92791700, 92486733, 92204595, 92136186, 92115360, 91984546, 91701603, 91061741, 90080255, 89388502, 89731544, 91219282, 93123060, 94713777, 96016377, 97197765, 97963709, 98139900, 97996324, 97854006, 97810966, 97925866, 98175597, 98627454, 99097365, 99036378, 98233062, 96947634, 95586646, 94617695, 94668984, 95444286, 96018237, 96069628, 95451677, 94224232]
1429.8I4224232j410239j421595j516277j134896o04409n86605p18546q56644j087803
1448.1H4887218j483517k131665k668548k663511j372313j86301l39853l86823J166255
1466.5G4820942L714013N824852O945544N528569L205634J901054J166511P37547L49737
1484.9A04194403m0853m3404M26173N12838O5160r2471K59686L37577j45829q20565
1505.2A04652715n04732O74843O97947J84834k14469k58852j80065m9043K93851L65257
1525.6A05662286L47281K30431j17039j17457L1459m48608p69878J09387P20870O42669
1546A06291401K98250J6570p7474k71249o80172p60973N87976J052070M10211j5032
1566.4A06851578j71578N9628J83690j56629q6105L93164L42298J05965K4700K980
$$ y = [94224232, 92813993, 91392398, 89876121, 88741225, 88136816, 87550211, 86831665, 85975021, 84887218, 83403701, 81272036, 78603488, 75939977, 74567664, 74381363, 74041510, 73654687, 74820942, 78534955, 84359807, 91305351, 96833920, 100039554, 101940608, 103107119, 103844666, 104194403, 104153550, 104110146, 104536319, 105049157, 105114317, 105021846, 105281532, 105619109, 105473280, 104652715, 104147983, 104822826, 105520773, 105705607, 105491138, 105232286, 105052221, 105003178, 105297029, 105662286, 106009567, 106239998, 106122959, 106005502, 106036961, 105588353, 104818475, 104927862, 105648732, 106291401, 106589651, 106606221, 106528747, 106257498, 105577326, 104816353, 105404329, 106456399, 106866610, 106851578, 106680000, 106739628, 106923318, 106766689, 106680584, 107073748, 107416046, 107522011, 107546711, 107549691]
1586.8A07549691k1970k7108k6298o199L2211J9419k9946l2794l6609o2347k6047J8323
1611.3A07350326j40930l64864j14631J95825m3964j53816N4872J17087J24896q0395
1631.7A06944406n64039n58400K01011L20744j14715o05166q92889m34864j96028o53517
1652.1A03446543l7944R83298O98280K40922J43158L17300J07312l15261j68383J03021
1672.5A05518246J6176P4017M2832l77941p75432l63875L95572K59221p1406l98136
1692.9A04319274q80551r61971p24125l44861L457q9728p4065l5668l37398q25524
1713.3A00048840j278019j444465j117486j252395k122062l139943m190057n447388
1729.6H0057025o751716r299326j0126072q115492p681304o621787m143256j826307
$$ y = [107549691, 107527721, 107500613, 107474315, 107468116, 107500327, 107519746, 107489800, 107457006, 107420397, 107358050, 107332003, 107350326, 107209396, 106844532, 106729901, 106925726, 106881762, 106727946, 106782818, 106899905, 107024801, 106944406, 106380367, 105821967, 106022978, 106343722, 106229007, 105623841, 104730952, 104296088, 104100060, 103446543, 103408599, 104391897, 105090177, 105331099, 105474257, 105791557, 105898869, 105583608, 105415225, 105518246, 105534422, 105608439, 105651271, 105273330, 104497898, 104134023, 104529595, 104788816, 104717410, 104319274, 103438723, 102476752, 101752627, 101407766, 101411223, 101321495, 101247430, 101211762, 100874364, 100048840, 98770821, 97326356, 96208870, 94956475, 92834413, 89694470, 85504413, 80057025, 73305309, 64005983, 53879911, 45764419, 38083115, 31461328, 27318072, 25491765]
1745.9B5491765N71695L563270O511894Q002508R338897J0144884R249806Q254683
1762.2H1129402O393844M251921K980810K119762J808423J711267J273310Q31402O46639
1780.6A03146780N88405N41746M61173K39361l255J93584M97139L82757J67715J78361
1801A06393766L39485L28230J76549N9653J20127K36738K15327J33646J13916N0497
1821.4A08167934o8450m6467j979L6609K58672L29364J55639Q5402M5621j43802j98138
1843.8A08620405J28639L29876K37763J26958O2525M3821L4547M4882L7504n0557k09451
1866.3A09406912j88636J48534L15547J81437N9175L2902K2996J6558O926l6609o8987
1888.7A09896755L2401J04344M7338M5502O4409L5560P534n877l8314l2615M7779P3612
$$ y = [25491765, 26063460, 29626730, 36138624, 44141132, 53480029, 63624913, 72874719, 81129402, 87523246, 91775167, 94755977, 96875739, 98684162, 100395429, 101668739, 102500141, 103146780, 103735185, 104276931, 104738104, 104977465, 104974210, 105167794, 105664933, 106047690, 106215405, 106393766, 106733251, 107061481, 107238030, 107297683, 107417810, 107654548, 107869875, 108003521, 108117437, 108167934, 108099484, 108053017, 108051038, 108087647, 108346319, 108675683, 108831322, 108916724, 108962345, 108818543, 108620405, 108749044, 109078920, 109316683, 109443641, 109506166, 109549987, 109584534, 109629416, 109666920, 109616363, 109406912, 109218276, 109366810, 109682357, 109863794, 109922969, 109955871, 109978867, 109995425, 110002351, 109965742, 109896755, 109929156, 110033500, 110080838, 110126340, 110190749, 110226309, 110233843, 110227966, 110189652, 110157037, 110204816, 110278428]
1913.2A10278428l8720j22129k3294M5228M9734R4521P7188K6369J3042J1813J4115
1935.6A10426295O08p2944j20759m185J17755R5070M0054J2469Q083J6570J3542K992
1960.1A10535550j395k7179m7458J0646O5648M2701R835J061K313N972M77j2839l1638
1986.6A10553694n6851o3801n01P0429N0795Q691m125p284l576q070j9646j7631k1863
2013.1A10480261n0688n0056l970J4151l541q988k718K825N376J395m303n365q285
2039.6A10366094n722J2374K9826L1078J5831K348l45j43N36K158j526P39K2054K7597
2068.2A10502899R346N138J3303J2029M088O891J6117R179n138m244N996P999J0801
2094.7A10594404J7237J1921K110l469j0776r000O771P796m280l493M662O794J252
$$ y = [110278428, 110239708, 110117579, 110094285, 110139513, 110189247, 110283768, 110360956, 110387325, 110400367, 110412180, 110426295, 110426903, 110353959, 110233200, 110229015, 110346770, 110441840, 110481894, 110494363, 110502446, 110519016, 110532558, 110535550, 110534155, 110506976, 110459518, 110470164, 110535812, 110578513, 110588348, 110589409, 110591722, 110597694, 110598171, 110585332, 110553694, 110496843, 110433042, 110432541, 110502970, 110553765, 110562456, 110558331, 110551047, 110547471, 110539401, 110519755, 110502124, 110480261, 110429573, 110379517, 110375547, 110389698, 110386157, 110377169, 110374451, 110377276, 110382652, 110384047, 110379744, 110374379, 110366094, 110360372, 110372746, 110402572, 110433650, 110449481, 110451829, 110451484, 110451341, 110451877, 110454035, 110452509, 110453248, 110475302, 110502899, 110512245, 110517383, 110530686, 110542715, 110546803, 110553694, 110569811, 110578990, 110573852, 110569608, 110575604, 110583603, 110594404, 110611641, 110623562, 110625672, 110622203, 110611427, 110602427, 110609198, 110616994, 110612714, 110609221, 110613883, 110620677, 110621929]
2121.2A10621929q094r799p582j1563j1587r144j0180j0741p212j955m768j7298k7573
2147.7A10484433k4545j5068q082n007n484j0252j2314r155q154r239o187l696q249
2174.3A10359001r966p272m863n007p308j0562j6164j7894j3733r274o509n901j1170
2200.8A10233378j4233j2410j5950j9491j1623o818j8335k4283r227P40j1695k0778
2225.2A10069275j4997j4603k3389k3722j9098k0909j9860j4591j7810k3568j8930
2247.7A09857798j5891j8144k3388l1412k8479k0290k1326k2888j5593q500j3220j7548
2272.2A09621119r834n949r835j3792j8835k1875k6155l2520l1710l0934l9256m3833
2296.6A09336591m0233l8839m3809m3619l0792k3400k7764k7573k1398j9968k2376
$$ y = [110621929, 110613835, 110604036, 110596454, 110584891, 110573304, 110564160, 110553980, 110543239, 110536027, 110534072, 110529304, 110512006, 110484433, 110459888, 110444820, 110436738, 110431731, 110426247, 110415995, 110403681, 110394526, 110386372, 110377133, 110370946, 110367250, 110359001, 110349035, 110341763, 110336900, 110331893, 110324585, 110314023, 110297859, 110279965, 110266232, 110256958, 110250449, 110244548, 110233378, 110219145, 110206735, 110190785, 110171294, 110159671, 110152853, 110134518, 110110235, 110101008, 110101748, 110090053, 110069275, 110054278, 110039675, 110016286, 109992564, 109973466, 109952557, 109932697, 109918106, 109900296, 109876728, 109857798, 109841907, 109823763, 109800375, 109768963, 109740484, 109720194, 109698868, 109675980, 109660387, 109651887, 109638667, 109621119, 109611285, 109605336, 109595501, 109581709, 109562874, 109540999, 109514844, 109482324, 109450614, 109419680, 109380424, 109336591, 109296358, 109257519, 109213710, 109170091, 109139299, 109115899, 109088135, 109060562, 109039164, 109019196, 108996820]
2319.1A08996820j6009J156o0j7416j252K8563K1028P820J7536J5724j5283l9744k6858
2345.6A08972025m411n197p105j931r132j0133M089J2088m375k3460k0910j2564K336
2372.1A08891320K0898L6442N4085O8545P7057P7129N8055L0017Q463j442L70l267
2396.6A09317672j1241j967J0693O556K134P51m077j490Q500J2123R466J4758K1708
2423.1A09385586J1647K86N972J3018J0895J276n031K39P820R250O593L791n25N13
2451.6A09451330Q070J4448J9122J8298Q881L326P737J1337Q320L148N579P844M255
2478.1A09571695L863J847l349k969L505P773M530j991q488j2350m673J740j132L874
2506.7A09563875N162m852o819n400l362N210L445j1241j5760n793R524K0719J7881
$$ y = [108996820, 108980811, 108981967, 108981907, 108964491, 108963239, 108991802, 109012830, 109020650, 109038186, 109053910, 109038627, 108998883, 108972025, 108967614, 108962417, 108955312, 108953381, 108944249, 108934116, 108938205, 108950293, 108945918, 108922458, 108901548, 108888984, 108891320, 108912218, 108948660, 109002745, 109071290, 109148347, 109225476, 109283531, 109313548, 109322011, 109320569, 109320939, 109317672, 109306431, 109304464, 109315157, 109321713, 109323847, 109324598, 109320521, 109319031, 109327531, 109339654, 109349120, 109363878, 109385586, 109397233, 109397519, 109403491, 109416509, 109427404, 109428680, 109423649, 109423888, 109431708, 109440958, 109447551, 109451342, 109450817, 109451330, 109459400, 109473848, 109492970, 109511268, 109520149, 109523475, 109531212, 109542549, 109550869, 109554017, 109559596, 109567440, 109571695, 109575558, 109577405, 109574056, 109571087, 109574592, 109582365, 109586895, 109584904, 109576416, 109564066, 109559393, 109561133, 109560001, 109563875, 109569037, 109564185, 109557366, 109551966, 109548604, 109553814, 109557259, 109546018, 109530258, 109524465, 109533989, 109554708, 109572589]
2533.2A09572589J5891K3460K2936J1361L457N436J0478J8168K4819K2280J3340P319
2557.7A09751534N532J883m959r131p39P784L564l016r608j3041j0229q332m721N090
2586.2A09711611Q989K348j454L123Q547N853l767j0979j0156j1134j8144j2243P87
2612.8A09673381J395k909q893j4222j8084k9206l5989k8813j9646j7059j9371j3316
2637.2A09467268j907k730K074J1218m852k6405l1126l1185l8886n3179n5218m3702
2661.7A09191370m3702n0938m3202l1626k3651j2147o044j872J5688L5274M6813O1083
2686.2A09137046O4731N6469N9307N9640N2560N4598N2190L5858J9335K265k1088l7670
2710.7A09535241m0090k6965n84N030k6869o1548p1693m7016l481K0945K9636L6347
$$ y = [109572589, 109588480, 109611940, 109634876, 109646237, 109649694, 109655130, 109665608, 109683776, 109708595, 109730875, 109744215, 109751534, 109757066, 109758949, 109753990, 109744859, 109744120, 109751904, 109755468, 109752452, 109742844, 109729803, 109719574, 109711242, 109706521, 109711611, 109720600, 109722948, 109721494, 109724617, 109733164, 109739017, 109735250, 109724271, 109714115, 109702981, 109684837, 109672594, 109673381, 109674776, 109671867, 109662974, 109648752, 109630668, 109601462, 109565473, 109536660, 109517014, 109499955, 109480584, 109467268, 109465361, 109462631, 109464705, 109475923, 109471071, 109444666, 109413540, 109382355, 109343469, 109290290, 109235072, 109191370, 109147668, 109096730, 109053528, 109021902, 108998251, 108986104, 108980060, 108978188, 108993876, 109029150, 109075963, 109137046, 109201777, 109258246, 109317553, 109377193, 109429753, 109484351, 109536541, 109572399, 109591734, 109593999, 109572911, 109535241, 109495151, 109468186, 109467602, 109472632, 109445763, 109384215, 109312522, 109265506, 109262025, 109282970, 109312606, 109348953]
2735.1A09348953L4964L5083L5215J7428j0860k0564m220J0169N388r620k4652l1364
2759.6A09385920l4416m8220o5792p8297q6510r1338j03772j18911j27113j37508j58155
2782A08335888j82628k03347k17188k11894k00785k12478k40302k62225k72679k89452
2802.4A06042910l32427l92461m48919m94504n43129o18970p17950q26335r51791j111400
2822.8I9605024j313269j541424j775158k014273k282971k646595l229451m177970
2839.1H0623913n545831p116824q382482q802151q072517o162148l308088o8125K887830
2857.5C6053577N023986O059924N976194M930532L361660K063072J701021K104914
2873.8F7274880K423853K075291J181394J60837p28423j417702j919746k257836k457524
$$ y = [109348953, 109383917, 109419000, 109454215, 109471643, 109460783, 109440219, 109435999, 109446168, 109451556, 109441936, 109417284, 109385920, 109351504, 109303284, 109237492, 109159195, 109072685, 108981347, 108877575, 108758664, 108631551, 108494043, 108335888, 108153260, 107949913, 107732725, 107520831, 107320046, 107107568, 106867266, 106605041, 106332362, 106042910, 105710483, 105318022, 104869103, 104374599, 103831470, 103212500, 102494550, 101668215, 100716424, 99605024, 98291755, 96750331, 94975173, 92960900, 90677929, 88031334, 84801883, 80623913, 75078082, 67961258, 59578776, 50776625, 42704108, 36541960, 33233872, 33165747, 36053577, 41077563, 47137487, 53113681, 58044213, 61405873, 63468945, 65169966, 67274880, 69698733, 71774024, 72955418, 73116255, 72387832, 70970130, 69050384, 66792548, 64335024]
2892.2F4335024k565574k635801k715290k812153k926892l094518l322801l578952
2908.5D0683043l845918m104060m274258m214129l784776k978074j927988q39700J62553
2926.8A4876693J055165J817754K541760L284113L913617M301828M404780M153341
2943.2D0349051L498888K519668J450979O36906L14927N51188J241895K130443L013998
2961.5E5707943L781617M350305M632967M573912M233748L743839L240555K792037
2977.8H7056923K377015J972473J577443J182401P62653K90710k38943q16613j403904
2996.2I2760158j890099k132416k025753j564110q15129J33157J140606K027243K642996
3014.5I0276653K920043K864361K546012K097291J655936J287794R79448P32529N68724
$$ y = [64335024, 61769450, 59133649, 56418359, 53606206, 50679314, 47584796, 44261995, 40683043, 36837125, 32733065, 28458807, 24244678, 20459902, 17481828, 15553840, 14714140, 14876693, 15931858, 17749612, 20291372, 23575485, 27489102, 31790930, 36195710, 40349051, 43847939, 46367607, 47818586, 48455492, 48770419, 49321607, 50563502, 52693945, 55707943, 59489560, 63839865, 68472832, 73046744, 77280492, 81024331, 84264886, 87056923, 89433938, 91406411, 92983854, 94166255, 94928908, 95219618, 94980675, 94164062, 92760158, 90870059, 88737643, 86711890, 85147780, 84332651, 84465808, 85606414, 87633657, 90276653, 93196696, 96061057, 98607069, 100704360, 102360296, 103648090, 104627538, 105360067, 105928791]
3032.9A05928791M73058L98123L06416K24995J86539J75750J64235J30033R1648P0060
3053.3A08149648N0735M1831L6394J6213N317J7166O0427J16253J41215J38199J17147
3075.7A08890545R2149Q7583R0647Q9133R1326Q0299N9128N2226M7385M2725L9530
3098.2A09662676K8777K4724K5666J7524K0825M2034L3259j6677l5179O533M9686O5136
3122.6A09924984O0129M2915K4796L028k909J4401J1360l171J6964L9196K0480q380
3147.1A10143793k3032k7918l469L2866L7431K2543R656K980P284J2815J2004J454
3171.6A10228407j3148j5045n447J6593K8372J2243J1087K5796K7121J6081k098p475
3196.1A10322487J1707K9111K6834K1684J8108J1611J9049K6524Q488n376O354K9254
$$ y = [105928791, 106401849, 106799972, 107106388, 107331383, 107517922, 107693672, 107857907, 107987940, 108079588, 108149648, 108200383, 108242214, 108278608, 108294821, 108300138, 108317304, 108377731, 108493984, 108635199, 108773398, 108890545, 108982694, 109070277, 109160924, 109250057, 109341383, 109421682, 109480810, 109533036, 109580421, 109623146, 109662676, 109691453, 109716177, 109741843, 109759367, 109780192, 109822226, 109855485, 109838808, 109803629, 109810162, 109859848, 109924984, 109985113, 110028028, 110052824, 110055852, 110052943, 110067344, 110078704, 110075533, 110092497, 110131693, 110152173, 110143793, 110120761, 110092843, 110089374, 110122240, 110159671, 110182214, 110191870, 110194850, 110202134, 110214949, 110226953, 110228407, 110215259, 110200214, 110194767, 110211360, 110239732, 110251975, 110263062, 110288858, 110315979, 110332060, 110329962, 110322487, 110334194, 110363305, 110390139, 110411823, 110429931, 110441542, 110460591, 110487115, 110495603, 110490227, 110496581, 110525835]
3220.5A10525835M1031K9338M291k0587k6429o532K4533M6074M4525K1076n722j3256
3245A10664177P880M0805L5334p403j9872Q654K6786J9682J1504O449j6523m5692l0005
3271.5A10701776J4257L3677L2365J7834l791J347K0730N305k6059k5427r680K944
3296A10765278L7134M7302j1265n8579l6645K3043P0524P0786L6180J5307J9944J8990
3320.5A10997999o0j6141J979L5155K4223j5998l2735k9659j0931J1933K3746L7754
3345A11027265K0313l0828l0660J8489L1722M220j6809r370J622k3747m8292k0146
3369.4A10923779L0518N1236L9780J9288R66q595j3495j0824j1313m9102o1238L636
3393.9A10914636L7980r084m4990M054P7378O1298q202k5213l206J5020J7285j9312
$$ y = [110525835, 110566866, 110596204, 110600495, 110579908, 110553479, 110546947, 110571480, 110617554, 110662079, 110683155, 110677433, 110664177, 110672057, 110712862, 110748196, 110740793, 110720921, 110729575, 110756361, 110776043, 110787547, 110793996, 110777473, 110731781, 110701776, 110716033, 110749710, 110782075, 110799909, 110796118, 110797465, 110818195, 110823500, 110797441, 110772014, 110762334, 110765278, 110802412, 110849714, 110838449, 110779870, 110743225, 110766268, 110836792, 110907578, 110943758, 110959065, 110979009, 110997999, 110997939, 110981798, 110983777, 111018932, 111043155, 111027157, 110994422, 110964763, 110953832, 110965765, 110989511, 111027265, 111047578, 111016750, 110986090, 111004579, 111036301, 111040521, 111023712, 111014342, 111015964, 110992217, 110943925, 110923779, 110954297, 111005533, 111045313, 111064601, 111065567, 111056972, 111043477, 111032653, 111021340, 110972238, 110911000, 110914636, 110952616, 110943532, 110898542, 110902596, 110979974, 111041272, 111033070, 111007857, 111004651, 111019671, 111036956, 111017644]
3418.4A11017644l5333Q94R179k5463n2536m0829k7919m0877j3387M0865L2187k3461
3442.9A10840964p5745o5673J9002M8578l564n0319q4173j04380o5005m0853j26683
3465.3A10292149j60528J5700K14803K03813P8463k9707m2462J24907K24650J19889
3485.7A11041677Q3411J37496R2602l791l4440n484m4572j18422K5212J88613Q8084
3508.1A11450386n2881r2340n7399Q953j7548j44684k37382j64306n174P1598Q0347
3530.6A10839570L1757n9366n4729K4104l0208j91855k03336R454J47879O4778L2985
3553A10611033R0969M1091o0093j06192j80161k94148j25075K92874L74448J70696
3573.4A10815442K8824K039l076n3179j88839l24715j37758K52652K34104N924k1720
$$ y = [111017644, 110982311, 110983205, 110992384, 110966921, 110914385, 110873556, 110845637, 110804760, 110791373, 110832238, 110864425, 110840964, 110765219, 110699546, 110718548, 110767126, 110763562, 110713243, 110629070, 110524690, 110459685, 110418832, 110292149, 110131621, 110147321, 110362124, 110565937, 110644400, 110614693, 110572231, 110697138, 110921788, 111041677, 111125088, 111262584, 111355186, 111351395, 111316955, 111311471, 111266899, 111148477, 111173689, 111362302, 111450386, 111397505, 111305165, 111247766, 111256719, 111239171, 111094487, 110857105, 110692799, 110687625, 110759223, 110839570, 110871327, 110811961, 110757232, 110781336, 110751128, 110559273, 110355937, 110365391, 110513270, 110578048, 110611033, 110702002, 110743093, 110683000, 110576808, 110396647, 110102499, 109977424, 110270298, 110644746, 110815442, 110844266, 110846305, 110843229, 110790050, 110601211, 110276496, 110138738, 110391390, 110625494, 110631418, 110609698]
3595.8A10609698L3605L8827O0630m638j79564k22564r7668l4237j7310l9362p7343
3618.3A10070074J34945L25357R7371l42453m35996J50168M45914K67375J24383M2164
3638.7A10879302j4210r1278l39449o62422n09787L04175O35540K87438Q5568J95623
3659A10770500J96588R0611p9763l66438m85599k02346j32322j55389L34382N65493
3679.4A10535717L65424J06061k05815m70829k66695L11684M72701K60556M0436j01638
3699.8A11047602o7187J00601J5450k99800m25255l9947M14407L35836J3865j82963
3720.2A10912609j67394m3463Q8453R6929j70696n04327m24587J21498M47190J97494
3740.6A10553706k73800l44026K2721l9840j03259L40164M50933J47962L5966K00879
$$ y = [110609698, 110643303, 110682130, 110742760, 110738122, 110558558, 110335994, 110238326, 110204089, 110186779, 110147417, 110070074, 110205019, 110530376, 110627747, 110285294, 109849298, 109999466, 110445380, 110712755, 110837138, 110879302, 110865092, 110773814, 110434365, 109771943, 109262156, 109566331, 110201871, 110489309, 110574877, 110770500, 110967088, 111057699, 110977936, 110611498, 110125899, 109923553, 109791231, 109635842, 109970224, 110535717, 110901141, 111007202, 110801387, 110330558, 110063863, 110375547, 110848248, 111108804, 111149240, 111047602, 110980415, 111081016, 111096466, 110796666, 110371411, 110331464, 110745871, 111081707, 111095572, 110912609, 110745215, 110701752, 110790205, 110887134, 110716438, 110212111, 109787524, 109909022, 110356212, 110553706, 110279906, 109935880, 109958601, 109918761, 109815502, 110155666, 110606599, 110754561, 110790527, 110991406]
3761A10991406J67931m3154j04594k8313J63865K58208P1502j66369j52326O8474J08600
3783.5A11335230N3882Q6713P1550l529j29318k43235k23624k41614j51729J44064
3803.9A10698390J62661J84214K92468R5880k55286l49272j94466j59788J15979L85499
3824.3A10976279K16329M0066p6258j80364k19571k61343j31607J81675L32451L24762
3844.6A11202419K02822j01768n17726o25301J14107O00744L47983j8060k09117q5151
3865A10910952Q82j32489l6001J88196K41315J11937j33514j05441K1148J9014J27101
3887.5A11213100O7556l5978J15192P9346k32482l85475k11537J09363L89969M16100
3907.9A11525154K26104M4310r6237j97089j24526M0174N9664P748L7110J9479p6663
$$ y = [110991406, 111159337, 111116183, 111011589, 110983276, 111147141, 111405349, 111476851, 111310482, 111158156, 111226630, 111335230, 111389112, 111475825, 111547375, 111543846, 111414528, 111171293, 110947669, 110706055, 110554326, 110698390, 110861051, 111045265, 111337733, 111433613, 111178327, 110829055, 110634589, 110474801, 110590780, 110976279, 111192608, 111232674, 111156416, 110976052, 110756481, 110495138, 110363531, 110545206, 110877657, 111202419, 111405241, 111303473, 110785747, 110160446, 110274553, 110875297, 111223280, 111205220, 110996103, 110910952, 110911834, 110779345, 110743344, 110931540, 111172855, 111284792, 111151278, 111045837, 111066985, 111085999, 111213100, 111280656, 111244678, 111359870, 111439216, 111206734, 110821259, 110609722, 110719085, 111109054, 111525154, 111751258, 111795568, 111699331, 111502242, 111377716, 111417890, 111477554, 111485302, 111522412, 111541891, 111465228]
3930.3A11465228l5143J05881J10901Q845q3625q4305R322K0278j4353M0412P9250
3952.7A11622691L3319k0707k6392j0574J6892L1137j943k7943k8586l0780l254M7397
3977.2A11601257M7148M410j7059j4662j1730n234j907j3530j7453j2111
3997.6A11559129
$$ y = [111465228, 111430085, 111535966, 111646867, 111655712, 111572087, 111487782, 111497104, 111517382, 111503029, 111543441, 111622691, 111656010, 111635303, 111608911, 111598337, 111615229, 111646366, 111644423, 111616480, 111587894, 111557114, 111553860, 111601257, 111648405, 111652815, 111635756, 111621094, 111609364, 111604130, 111602223, 111588693, 111571240, 111559129]
##END=$$ End of the data block
