##TITLE=Oleo Resina $$ Begin of the data block
##JCAMP-DX=5.00 $$ ACD/SpecManager v 10.08
##SPECTROMETER/DATA SYSTEM=Alpha
##DATE=01 Oct 2014 10:03:18
##DATA TYPE=INFRARED SPECTRUM
##DATA CLASS=XYDATA
##ORIGIN=
##OWNER=
##NPOINTS=1667
##FIRSTX=599.64648438
##LASTX=3997.64306641
##MAXX=3997.64306641
##MINX=599.64648438
##MAXY=1.11468852
##MINY=0.01932950
##XFACTOR=1.0000000000
##YFACTOR=0.000000010000000
##FIRSTY=1.00754893
##DELTAX=2.03961372
##XUNITS=1/CM
##YUNITS=ARBITRARY UNITS
##XYDATA=(X++(Y..Y))
599.6A00754893N5563P6688J20163J52564J60873K04372K43413K03073J59109J42765
$$ 100754893 100810456 100887144 101007307 101159871 101320744 101525116 101768529 101971602 102130711 102273476
620A02273476R4903M0757L1793L3081J3852j8299m6956p4363j06299j37067j61981
$$ 102273476 102368379 102409136 102440929 102474010 102487862 102469563 102422607 102348244 102241945 102104878 101942897
642.5A01942897j94240k32780k33567k22575k56765l12901l41320l77625m46325m92114
$$ 101942897 101748657 101515877 101282310 101059735 100802970 100490069 100148749 99771124 99324799 98832685
662.9I8832685m68171n48667p96514p53725p16036q20137r07224r61852r63515r38362
$$ 98832685 98364514 97815847 97019333 96265608 95549572 94729435 93822211 92860359 91896844 90958482
683.3I0958482r13614q81982q12334p18921o62905o32620n87726n84542o40208p40933
$$ 90958482 90044868 89162886 88350552 87631631 86968726 86336106 85748380 85163838 84523630 83782697
703.7H3782697q86745j044690j184219j321924j499456j737547k025563k085983j398987
$$ 83782697 82895952 81851262 80667043 79345119 77845663 76108116 74082553 71996570 70597583
722G0597583k199J327377K049273K226371K181602K155476K148635K085065J968885
$$ 70597583 70595384 71922761 73972034 76198405 78380007 80535483 82684118 84769183 86738068
740.4H6738068J819378J659727J497305J307952J117796R33241P19107M95886L45845
$$ 86738068 88557446 90217173 91714478 93022430 94140226 95073467 95792574 96288460 96634305
758.7I6634305L15165L45326L67039L90947M39161M91494N10698M75336M01484L25501
$$ 96634305 96949470 97294796 97661835 98052782 98491943 98983437 99494135 99969471 100370955 100696456
779.1A00696456K76626K49505K23732J90770J45710J13880J22238J47187J43159Q2087
$$ 100696456 100973082 101222587 101446319 101637089 101782799 101896679 102018917 102166104 102309263 102391350
799.5A02391350P642l9602q0132j08958j20687j33312j52170j62614j68705j85489
$$ 102391350 102398992 102359390 102279258 102170300 102049613 101916301 101764131 101601517 101432812 101247323
819.9A01247323j96290j99461k11728k24054k18940k08676k25317k64502k99728l28087
$$ 101247323 101051033 100851572 100639844 100415790 100196850 99988174 99762857 99498355 99198627 98870540
840.3I8870540l26425k79790k22040j74671j35255r8800o8272m3404k9957n4783j18267
$$ 98870540 98544115 98264325 98042285 97867614 97732359 97633559 97565287 97521883 97491926 97437143 97318876
862.8I7318876j61338j28359m2528L1400O6155R4819J28788J34546J01995L7182l2074
$$ 97318876 97157538 97029179 96986651 97018051 97084206 97179025 97307813 97442359 97544354 97581536 97549462
885.2I7549462n7643l6884j0574j215j2315m3446q3726j27942j71655j88017j74826
$$ 97549462 97491819 97454935 97444361 97443146 97430831 97387385 97303659 97175717 97004062 96816045 96641219
907.6I6641219j64140j36298n1826P2313J90478K57713K58094K25001J71495Q1420
$$ 96641219 96477079 96340781 96288955 96361268 96551746 96809459 97067553 97292554 97464049 97545469
928I7545469k9689j43880k47317l20971l61670l72314l63410l55225l54523l48377
$$ 97545469 97515780 97371900 97124583 96803612 96441942 96069628 95706218 95350993 94996470 94648093
948.4I4648093l46053l76278m24510m62192m85397m79680m21715k94167j15406O1470
$$ 94648093 94302040 93925762 93501252 93039060 92553663 92073983 91652268 91358101 91242695 91304165
968.8I1304165J97065K65008K53856J68705M6325m1366o5219n2810k9093j9556n4181
$$ 91304165 91501230 91766238 92020094 92188799 92235124 92193758 92128539 92075729 92046636 92027080 91972899
991.3I1972899j24555j87320k15119k15346k03722j97423k04933k21896k53033k99031
$$ 91972899 91848344 91661024 91445905 91230559 91026837 90829414 90624481 90402585 90149552 89850521
1011.6H9850521l65370m50963n10359n13345m75615m06397l19016k35629j50168m7010
$$ 89850521 89485151 89034188 88523829 88010484 87534869 87128472 86809456 86573827 86423659 86376649
1032H6376649P6825K16168L30263L57252K78014R8217j56552m21357o42818p97814
$$ 86376649 86453474 86669642 86999905 87357157 87635171 87733388 87576836 87155479 86512661 85714847
1052.4H5714847q70252q46273p50333o43152n35076m06266l13103l24929m67705p71886
$$ 85714847 84844595 83998322 83247989 82604837 82069761 81663495 81350392 81025463 80557758 79785872
1072.8G9785872j208640j678353k072352k270288k218717k048522j947791j923018
$$ 79785872 78577232 76898879 74826527 72556239 70337522 68289000 66341209 64418191
1089.2F4418191j844186j591045j124334n19746J09821O77776J099933J245939R84383
$$ 64418191 62574005 60982960 59858626 59338880 59448701 60126477 61226410 62472349 63456732
1107.5F3456732L29691n02187j201743j488149j209396m25315N68646J290632J282519
$$ 63456732 63786423 63284236 62082493 60594344 59384948 58959633 59528279 60818911 62101430
1125.9F2101430L99351j068199k560270l581339l923356l643814k959487k168631j549095
$$ 62101430 62500781 61432582 58872312 55290973 51367617 47723803 44764316 42595685 41046590
1144.2D1046590j257772j261359j393929j511789j549515j473653j265609r30542n08380
$$ 41046590 39788818 38527459 37133530 35621741 34072226 32598573 31332964 30402422 29894042
1162.6B9894042o9860L40602P13140J048371J336262J559502J717668J822028J875359
$$ 29894042 29824182 30164784 30877924 31926295 33262557 34822059 36539727 38361755 40237114
1180.9D0237114J878100J849261J813350J788416J782370J798558J816445J786477
$$ 40237114 42115214 43964475 45777825 47566241 49348611 51147169 52963614 54750091
1197.3E4750091J666975J455587J192057R25374O95217N30302M30298L44104K08217
$$ 54750091 56417066 57872653 59064710 59990084 60685301 61215603 61645901 61990005 62198222
1215.6F2198222o879k67839n03773o81156p91615q16715p54779o59508n75959m72343
$$ 62198222 62191343 61923504 61419731 60738575 59946960 59130245 58375466 57715958 57139999 56667656
1236E6667656k79457M7863M88651R63550J374931J613748J571583J260633Q60637N74821
$$ 56667656 56388199 56436062 56924713 57888263 59263194 60876942 62448525 63709158 64569795 65144616
1256.4F5144616M60434M29792M06938M20809N11783O06090N82356M03791J81926J05220
$$ 65144616 65605050 66034842 66441780 66862589 67374372 67980462 68562818 68966609 69148535 69253755
1276.8F9253755K85053O93703J178950J495260J453918J077610N95039K74289J67543
$$ 69253755 69538808 70232511 71411461 72906721 74360639 75438249 76033288 76307577 76475120
1295.2G6475120J33550J02204J40732K63340L64285L55304K56312J40780M5651o461
$$ 76475120 76608670 76710874 76851606 77114946 77479231 77834535 78090847 78231627 78277278 78270817
1315.6G8270817K1845J62429M10854P06798R17131R09799O65188K86400r1546m21691
$$ 78270817 78292662 78455091 78865945 79572743 80489874 81399673 82064861 82351261 82259715 81838024
1336H1838024p00397q57621q14164o98161o35654n66876m33611k72781j57845j32668
$$ 81838024 81137627 80280006 79465842 78767681 78132027 77565151 77131540 76858759 76700914 76568246
1356.4G6568246j82545k28095k52658k74987k73841k78801m20773q84032j550406j367236
$$ 76568246 76385701 76157606 75904948 75629961 75356120 75077319 74656546 73772514 72222108 70854872
1376.7G0854872L63601K481907L394002L148156K726555K144552J329618P10887K57820
$$ 70854872 71218473 73700380 77094382 80242538 82969093 85113645 86443263 87154150 87411970
1395.1H7411970j07205k48098n3972M74017R89503P80571k60204j579726k423829k223057
$$ 87411970 87304765 87056667 87002695 87476712 88466215 89246786 88986582 87406856 84983027 82759970
1415.5H2759970j102042L68393J040077P28953r2572j163638k138406k580196k393019
$$ 82759970 81657928 82026321 83066398 83795351 83702779 82539141 80400735 77820539 75427520
1433.9G5427520k227187k062297j608699j286310j141846j148969j559598k387845
$$ 75427520 73200333 71138036 69529337 68243027 67101181 65952212 64392614 62004769
1450.2F2004769l258872l569257l118581j899433j006633r05842n45406J572102N519074
$$ 62004769 58745897 55176640 52058059 50158626 49151993 48246151 47700745 49272847 54791921
1468.5E4791921R874118J2698722J0080820N516726L208869K141840J515609J091766
$$ 54791921 64666039 77364761 87445581 92962307 96171176 98313016 99828625 100920391
1484.9A00920391Q66604P32303N33557L60846L36528L60143K61676J72902J95837L21221
$$ 100920391 101786995 102519298 103052855 103413701 103750229 104110372 104372048 104544950 104740787 105062008
1505.2A05062008L31688Q9490K2328Q6665J47391J68204J62864J51527R1374M4524
$$ 105062008 105393696 105483186 105505514 105592179 105739570 105907774 106070638 106222165 106313539 106358063
1525.6A06358063L7194M6145R5404J03294P0000J32775K09976P3266o0058m8876P630
$$ 106358063 106395257 106441402 106536806 106640100 106710100 106842875 107052851 107126117 107066059 107017183 107024813
1548.1A07024813N3703O7688R1373J37830J69027p272j12760k7275L8707N5838K1911
$$ 107024813 107078516 107146204 107237577 107375407 107544434 107537162 107424402 107397127 107435834 107491672 107513583
1570.5A07513583N102N3871M7254l3152k8491M899J3388M017p319j0622r930j6022
$$ 107513583 107518685 107572556 107619810 107586658 107558167 107563066 107576454 107580471 107573152 107562530 107552600 107536578
1595A07536578k7990k4772k4843l3712m3297m5455o8021q5234n6935k5415q0848j34647
$$ 107536578 107508588 107483816 107458973 107425261 107381964 107336509 107268488 107183254 107126319 107100904 107020056 106885409
1619.5A06885409r1326p9036j04987j20819j34671j30152j13440k44152m66216n66709
$$ 106885409 106794083 106715047 106610060 106489241 106354570 106224418 106110978 105866826 105400610 104833901
1639.9A04833901o31976o38199o62971o92892n44214l53098k40028l4058K72429N54788
$$ 104833901 104201925 103563726 102900755 102207863 101663649 101310551 101070523 101036465 101308894 101863682
1660.3A01863682O73652N17321K77817J55639K9707j16610j60098k24900k73717k56753
$$ 101863682 102537334 103054655 103332472 103488111 103517818 103401208 103241110 103016210 102742493 102485740
1680.7A02485740k43294l78776n32090n55063o27958o57493p83557r44418j007974
$$ 102485740 102242446 101863670 101331580 100776517 100148559 99491066 98707509 97763091 96755117
1699I6755117j116407r75555p46488o75101o82181p92795j045418j466906k307576
$$ 96755117 95638710 94663155 93916667 93241566 92559385 91766590 90721172 89254266 86946690
1717.4H6946690l042698l441673m334474n619425o867951q117604r055686j0840434
$$ 86946690 83903992 80462319 76127845 70508420 63640469 55522865 46467179 35626745
1733.7C5626745j0525617p214843n423757l874798k056138p43161M29705K024739M001646
$$ 35626745 25101128 17886285 12462528 8587730 6531592 5788431 6218136 8242875 12244521
1752A2244521N799639Q241187J0539770J1275831J1454511R609902P091069N641127
$$ 12244521 18044160 26285347 36825117 48100948 59555459 69165361 76256430 81897557
1768.4H1897557M397511L531033K655357J813024J462979J312548J097536R33718P95186
$$ 81897557 86295068 89826101 92481458 94294482 95757461 97070009 98167545 99101263 99896449
1786.7I9896449O88690O69050O62041N06711M01008M16291M08959L58081L03018L00300
$$ 99896449 100585139 101254189 101916230 102422941 102823949 103240240 103649199 104007280 104310298 104610598
1807.1A04610598K90060K71666K32887K20871K19369K07866K01380K01988J99258J73068
$$ 104610598 104900658 105172324 105405211 105626082 105845451 106053317 106254697 106456685 106655943 106829011
1827.5A06829011J70470J33908J09148J17719J22380J11151J24240J38306Q4710M2510
$$ 106829011 106999481 107133389 107242537 107360256 107482636 107593787 107718027 107856333 107941043 107983553
1847.9A07983553M5669N4813M8006M8983M3332M5479M7981M7875N1593L6002m435k3639
$$ 107983553 108029222 108084035 108132041 108181024 108224356 108269835 108317816 108365691 108417284 108453286 108448851 108425212
1872.4A08425212k885P916J8525K4616K5726K0408K2936K7526J2147K611O354Q976
$$ 108425212 108422327 108430243 108448768 108473384 108499110 108519518 108542454 108569980 108582127 108584738 108591092 108600068
1896.9A08600068K098N37o712l46J5557J2028o568l648K3902K2971q452k1636j3292
$$ 108600068 108602166 108602703 108595991 108595645 108611202 108623230 108616662 108613014 108636916 108659887 108651435 108629799 108616507
1923.4A08616507j6069j5617j5378j2886r06Q666J0979J7500L2032K4056O187n60J1361
$$ 108616507 108600438 108584821 108569443 108556557 108555651 108564317 108575296 108592796 108624828 108648884 108655071 108654511 108665872
1949.9A08665872K8801L0005J8930J7631K6703K5475K2817J9836Q392k3N185O485J991
$$ 108665872 108694673 108724678 108743608 108761239 108787942 108813417 108836234 108856070 108864462 108864439 108869624 108876109 108878100
1976.4A08878100r5m507k455L588j216m029M887O68r143p523j1396j6797r894o223
$$ 108878100 108878005 108873498 108871043 108874631 108873415 108869386 108874273 108874941 108865798 108858275 108846879 108830082 108820188 108813965
2005A08813965j7702k6644k2554k3591l5239n0080o0069n1141l3128j8597n650l6n233
$$ 108813965 108796263 108769619 108747065 108723474 108688235 108638155 108578086 108526945 108493817 108475220 108469570 108469534 108464301
2031.5A08464301r239l111Q392J9479K4640K2352J8358J5080J1325P010R048J4245
$$ 108464301 108455062 108451951 108460343 108479822 108504462 108526814 108545172 108560252 108571577 108578587 108587635 108601880
2056A08601880J4007J7119K3591K4092J9288J9277K3734K4009J6844O795N686J4711
$$ 108601880 108615887 108633006 108656597 108680689 108699977 108719254 108742988 108766997 108783841 108790636 108796322 108811033
2080.4A08811033K3627K0742J2196J3601K1291K0886J9419K1648K3914K7048J9491
$$ 108811033 108834660 108855402 108867598 108881199 108902490 108923376 108942795 108964443 108988357 109015405 109034896
2102.9A09034896P057O616J5211K2674K2173J1539R811J7166J6034J3554J2648R346
$$ 109034896 109041953 109048569 109063780 109086454 109108627 109120166 109129977 109147143 109163177 109176731 109189379 109198725
2127.3A09198725N865N806M864L886N996K122p749r250p022j0705q988j466O544J1540
$$ 109198725 109204590 109210396 109215260 109219146 109225142 109227264 109219515 109210265 109203243 109192538 109183550 109182084 109188628 109200168
2155.9A09200168J1432Q583R274J6237K2864K0313J3387J8263K8551K6894J7631J1432
$$ 109200168 109211600 109220183 109229457 109245694 109268558 109288871 109302258 109320521 109349072 109375966 109393597 109405029
2180.4A09405029R453J9789K8705J7155P534J7500L0076K5654J1229P892J4901J5045
$$ 109405029 109414482 109434271 109462976 109480131 109487665 109505165 109535241 109560895 109572124 109580016 109594917 109609962
2204.8A09609962J6593K1518J4889K193k813J371R954J5926R716M768Q893J0038M410
$$ 109609962 109626555 109648073 109662962 109665155 109662342 109663713 109673667 109689593 109699309 109704077 109712970 109723008 109727418
2231.4A09727418n388j0586p152n233q059j0037r978q786j0240j0753r906j1766j6224
$$ 109727418 109722030 109711444 109704292 109699059 109691000 109680963 109670985 109662199 109651959 109641206 109631300 109619534 109603310
2257.9A09603310k0624k0909j7321r727k516Q4k86j216k396q321j9646k5344k1970
$$ 109603310 109582686 109561777 109544456 109534729 109532213 109532297 109532011 109530795 109528399 109520078 109500432 109475088 109453118
2284.4A09453118j8859j9109j7786j5760j6498j2231k241K443K540M494K455j07O318
$$ 109453118 109434259 109415150 109397364 109381604 109365106 109352875 109350634 109353077 109355617 109360111 109362566 109362459 109368777
2310.9A09368777J8418L3522M2009M0364M2904N1212N4038N5051N2654L5239J9979
$$ 109368777 109387195 109420717 109462726 109503090 109545994 109597206 109651244 109706295 109758949 109794188 109814167
2333.3A09814167L6240N8448M7326J6689k0778p9441r8550k0278J06013J92452J83868
$$ 109814167 109850407 109908855 109956181 109972870 109952092 109872651 109774101 109753823 109859836 110052288 110236156
2355.8A10236156J26386M9305j6225l7861n9187r1505j01519r0480q4352p1454m2427
$$ 110236156 110362542 110411847 110395622 110357761 110298574 110207069 110105550 110015070 109930718 109859264 109816837
2378.2A09816837k6631j7643j645N031P426J2303R215P939J4710J3888M125L481J7547
$$ 109816837 109790206 109772563 109770918 109775949 109783375 109795678 109804893 109812832 109827542 109841430 109845555 109849036 109866583
2404.7A09866583K5773J2780K873J7583L4130L0243J5449M697O032J6809J9157J3351
$$ 109866583 109892356 109905136 109908009 109925592 109959722 109989965 110005414 110010111 110016143 110032952 110052109 110065460
2429.2A10065460J4603J9837J7285P606K658L183K420M113O663K706j776L052Q750
$$ 110065460 110080063 110099900 110117185 110124791 110127449 110130632 110133052 110137165 110143828 110146534 110144758 110147810 110156560
2455.7A10156560K038k324J824l386j0717r799j2791j7571j7393j9574j8919j3172
$$ 110156560 110158598 110156274 110158098 110154712 110143995 110134196 110121405 110103834 110086441 110066867 110047948 110034776
2480.2A10034776j5962k9016l5644k9337k7180l2150l6288l9613l7420k8765k1994
$$ 110034776 110018814 109989798 109954154 109924817 109897637 109865487 109829199 109789586 109752166 109723401 109701407
2502.6A09701407k2686k8562m1139n2977m8435m1186m9103o3932o3347m4263k9766
$$ 109701407 109678721 109650159 109609020 109556043 109507608 109466422 109417319 109353387 109290040 109245777 109216011
2525.1A09216011k5106k1458k0408k3222k0397q666k289q106j3972j2147p677p105
$$ 109216011 109190905 109169447 109149039 109125817 109105420 109096754 109094465 109086359 109072387 109060240 109052563 109045458
2549.5A09045458j3030j5878r585j0347k8944m2117l6406l5859m5669n1748n4241n2940
$$ 109045458 109032428 109016550 109006965 108996618 108967674 108925557 108889151 108853292 108807623 108755875 108701634 108648694
2574A08648694m4811l4344l7682m7195l3570j9693l0899m1700m0495m0269m2415m0233
$$ 108648694 108603883 108569539 108531857 108484662 108451092 108431399 108400500 108358800 108318305 108278036 108235621 108195388
2598.5A08195388l8969m0889m3786m6634m6945m6563m8947n4312n5480n5802o5565
$$ 108195388 108156419 108115530 108071744 108025110 107978165 107931602 107882655 107828343 107772863 107717061 107651496
2620.9A07651496q1861r3448r6715r1147p9668o9904n9640m8566l9292l5429m0531
$$ 107651496 107569635 107476187 107379472 107288325 107208657 107138753 107079113 107030547 106991255 106955826 106915295
2643.4A06915295m5502n0271o5171q4532r7835j11091j29950j46067j50049j37257
$$ 106915295 106869793 106819522 106754351 106669819 106571984 106460893 106330943 106184876 106034827 105897570
2663.7A05897570j17505j04570r0885o5768m2308m0125m6313k0528L9434Q2529R6965
$$ 105897570 105780065 105675495 105584610 105518842 105476534 105436409 105390096 105369568 105409002 105491531 105588496
2686.2A05588496J06549J09589J08290J08695J05548R1767O4969L6156J2040j5664
$$ 105588496 105695045 105804634 105912924 106021619 106127167 106218934 106283903 106320059 106332099 106316435
2706.6A06316435n1069q2755r5153q6999o6197n8055q4912j20056j33956j11699n1200
$$ 106316435 106265366 106182611 106087458 106000459 105934262 105876207 105791295 105671239 105537283 105425584 105374384
2729A05374384J2946N3406O7746O9797P2468O0117K8002r608l3915k3317j359o938
$$ 105374384 105387330 105440736 105508482 105578279 105650747 105710864 105738866 105729258 105695343 105672026 105670667 105663729
2753.5A05663729l4178n7673p2718q4686r3698j07408j33896j62935j92440k28452
$$ 105663729 105629551 105571878 105499160 105414474 105320776 105213368 105079472 104916537 104724097 104495645
2773.9A04495645k46489k54584k93112l49366l89493m15683m29082m17709m12381m48978
$$ 104495645 104249156 103994572 103701460 103352094 102962601 102546918 102117836 101700127 101287746 100838768
2794.3A00838768n13327n53035n56505n93180o83277p83676q89230r93949j102275
$$ 100838768 100325441 99772406 99215901 98622721 97939444 97155768 96266538 95272589 94170314
2812.6I4170314j250398j425976j610392j831710k113384k450437k824485l199315
$$ 94170314 92919916 91493940 89883548 88051838 85938454 83488017 80663532 77464217
2828.9G7464217l538984l866381m299932n021501o143612p539919q720305r018424
$$ 77464217 73925233 70058852 65758920 60737419 54593807 47053888 38333583 29315159
2845.3B9315159q111137o278252m064457j870134J18151J878303L367454M412690M785058
$$ 29315159 21204022 14925770 10861313 8991179 9109330 10987633 14355087 18767777 23552835
2863.6B3552835M303294L139225K054927J850295K416587K842855K477974J423836
$$ 23552835 27856129 30995354 33050281 34900576 37317163 40160018 42637992 44061828
2879.9D4061828J64067r31280j746846k300292k622098k739975k715700k644751k589568
$$ 44061828 44225895 43294615 41547769 39247477 36625379 33885404 31169704 28524953 25935385
2898.3B5935385k543240k495031k463732k443748k410431k346330k239875k075202
$$ 25935385 23392145 20897114 18433382 15989634 13579203 11232873 8992998 6917796
2914.6F917796j808122j422964r85952n64012k03796R6194L59149N90702Q72834J255596
$$ 6917796 5109674 3686710 2700758 2136746 1932950 2029144 2388293 2978995 3851829 5107425
2935E107425J677016K070435K389899K513504K282700J683139R41088L93510K12576
$$ 5107425 6784441 8854876 11244775 13758279 16040979 17724118 18665206 19058716 19271292
2953.4A9271292M35036J028124J840077K740893L667471M546928N229563N562874N553136
$$ 19271292 19706328 20734452 22574529 25315422 28982893 33529821 38759384 44322258 49875394
2971.7D9875394N286261M856640M377258L876662L327406K738052K101183J387227
$$ 49875394 55161655 60018295 64395553 68272215 71599621 74337673 76438856 77826083
2988G7826083N74320l74198j441228k486754l297716l664923l448903k679652j484436
$$ 77826083 78400403 78026205 76584977 74098223 70800507 67135584 63686681 61007029 59522593
3006.4E9522593L1555J693690L231531M407412N089658N225235M867930M200273L437913
$$ 59522593 59554148 61247838 64479369 68886781 73976439 79201674 84069604 88269877 91707790
3024.7I1707790K730453K126312J636070J267582J013005Q29578O68084N45097M67693
$$ 91707790 94438243 96564555 98200625 99468207 100481212 101310790 101978874 102523971 102991664
3043.1A02991664M07648L55661K93220K30610J92904J52433J02568O3872M3178N7208
$$ 102991664 103399312 103754973 104048193 104278803 104471707 104624140 104726708 104790580 104833758 104890966
3063.5A04890966R6643J58775K51973L30448L48485L06725K55966K44785K43437K23458
$$ 104890966 104987609 105146384 105398357 105728805 106077290 106384015 106639981 106884766 107128203 107351661
3083.9A07351661J98185J67132J43182J35946J27494J08159Q8239R4509J10888R3484
$$ 107351661 107549846 107716978 107860160 107996106 108123600 108231759 108319998 108414507 108525395 108618879
3104.3A08618879O0761N9438Q2529O9475J8859Q857M9913R0861J08898R1565M8816
$$ 108618879 108679640 108739078 108821607 108891082 108909941 108918798 108968711 109059572 109168470 109260035 109308851
3126.7A09308851K5046M3165O1477M0078M124j621L3260N8531M2367J8955k27j4496
$$ 109308851 109333897 109377062 109438539 109478617 109482741 109481120 109514380 109572911 109615278 109634233 109634006 109619510
3151.2A09619510J1134N1737M4680K0039J7202J1194O222J9086K3257O640j859J1563
$$ 109619510 109630644 109682381 109727061 109747100 109764302 109775496 109781718 109800804 109824061 109830701 109828842 109840405
3175.7A09840405J9586J3447J8465K8766K3055J2946K1636L3081L3140L8922M1735
$$ 109840405 109859991 109873438 109891903 109920669 109943724 109956670 109978306 110011387 110044527 110083449 110125184
3198.1A10125184L7658L5847K9444K5976L2449L5572K9385K8050L3867L9554N2762
$$ 110125184 110162842 110198689 110228133 110254109 110286558 110322130 110351515 110379565 110413432 110452986 110505748
3220.5A10505748N2845K7252J0752J1862q95j2850K8443P1573N4944K2745P99j8335
$$ 110505748 110558593 110585845 110596597 110608459 110607564 110594714 110623157 110694730 110749674 110772419 110773218 110754883
3245A10754883r477L1901M6634J0789j2064J0311K9826K3890J1456q202m4965p2396
$$ 110754883 110745406 110777307 110823941 110834730 110822666 110832977 110862803 110886693 110898149 110889947 110844982 110772586
3269.5A10772586l5942K9588M8089L2055R406j1730j4281o295j7357n2750o4194k4032
$$ 110772586 110736644 110766232 110814321 110846376 110855782 110844052 110829771 110823476 110806119 110753369 110689175 110665143
3294A10665143K4294N4503M8792k0575r4188o6900M1223J16312J09220N2082O676r203
$$ 110665143 110689437 110743940 110792732 110772157 110677969 110611069 110652292 110768604 110877824 110929906 110936582 110927379
3318.4A10927379j5378j7893k2781j1635J0765O199j0574l1436n8305l9566Q011K0635
$$ 110927379 110912001 110894108 110871327 110859692 110870457 110876656 110866082 110834646 110776341 110736775 110744786 110765421
3342.9A10765421J9360J991m6683l5524L8230M5193j0574l3033j5998j6010n8090q7440
$$ 110765421 110784781 110786772 110740089 110704565 110742795 110787988 110777414 110744381 110728383 110712373 110654283 110566843
3367.4A10566843m3524M6599P8023K4306j9943q774J7917J2302j7893n6028r1255n2953
$$ 110566843 110523319 110569918 110647941 110672247 110652304 110643530 110661447 110673749 110655856 110599828 110508573 110455620
3391.9A10455620M0651M8673n6243j07443K920J09363O1702k3007l5012j0180K4640
$$ 110455620 110496271 110544944 110488701 110381258 110384178 110493541 110555243 110532236 110497224 110487044 110511684
3414.3A10511684L5322p450k8325n626j2303n3501q1384o1476n4693r4963o5135L4070
$$ 110511684 110547006 110539556 110511231 110505605 110493302 110439801 110358417 110296941 110242248 110147285 110082150 110116220
3438.8A10116220N8996R740m2010r3031j14369r8634r7954j26302j76239k05219j48916
$$ 110116220 110175216 110184956 110142946 110049915 109935546 109836912 109738958 109612656 109436417 109231198 109082282
3461.2A09082282j20640k35653k87116p1978K07889K53594J26397Q822M3595K52413
$$ 109082282 108961642 108725989 108438873 108366895 108574784 108828378 108954775 108963597 109007192 109259605
3481.6A09259605L06368J63806J53100K20990J66107O0057J6105N5755P0429J2636
$$ 109259605 109565973 109729779 109882879 110103869 110269976 110330033 110346138 110401893 110472322 110484958
3502A10484958R7775K28882J51491k5999j63722j42158p247L1507n2667j41835r2793
$$ 110484958 110582733 110811615 110963106 110937107 110773385 110631227 110623980 110655487 110602820 110460985 110368192
3524.4A10368192L6109L6776n2142r2435r2960o0224j2017k5403n7614k2578M7004
$$ 110368192 110404301 110441077 110388935 110296500 110203540 110143316 110131299 110105896 110048282 110025704 110072708
3546.9A10072708O9070M5025K7764K0480K2686K6059K9826O7115J10674Q1503j4436
$$ 110072708 110141778 110186803 110214567 110235047 110257733 110283792 110313618 110380733 110491407 110572910 110558474
3569.3A10558474l4833K6345O0261M6026K2185Q905K3592P8559J00779J7512l1841
$$ 110558474 110523641 110549986 110610247 110656273 110678458 110687363 110710955 110789514 110890293 110907805 110875964
3591.7A10875964J0038J6617l2413m3428j6260L946L2950N8662L6133m959k7764q154
$$ 110875964 110886002 110902619 110870206 110826778 110810518 110814464 110847414 110906076 110942209 110937250 110909486 110901332
3616.2A10901332J6928k7800o3145j3292Q1646J21201M41q8621n9628l3832k3150m172
$$ 110901332 110918260 110890460 110827315 110814023 110895669 111016870 111017311 110928690 110869062 110835230 110812080 110807908
3640.7A10807908J0609M8065J07670P6509n4372q0406k7776l8517p2348k2554L6383
$$ 110807908 110818517 110866582 110974252 111050761 110996389 110915983 110888207 110849690 110777342 110754788 110791171
3663.1A10791171M9829Q2719J11604O2657L5941M4584k7132q5127p4327l2103K9135
$$ 110791171 110841000 110923719 111035323 111097980 111133921 111178505 111151373 111066246 110991919 110959816 110988951
3685.6A10988951P3707O4432L863l1722j0633K8276N4062L8170J777J9490O5077Q2946
$$ 110988951 111062658 111127090 111130953 111099231 111088598 111116874 111170936 111209106 111210883 111230373 111295450 111378396
3710A11378396K8896o2633n5837L349J7238J2517R90l6967k5535N0533R1410L6490
$$ 111378396 111407292 111344659 111288822 111292171 111309409 111321926 111322916 111285949 111260414 111310947 111402357 111438847
3734.5A11438847o9917q9728J4233J03903N4669k4795K3329J8311j12093j23608l2198
$$ 111438847 111368930 111279202 111293435 111397338 111452007 111427212 111450541 111468852 111356759 111233151 111200953
3756.9A11200953O294j5986k0373J907K2090J9169k7800p0429n2881K313K4604k551
$$ 111200953 111207247 111191261 111170888 111172795 111194885 111214054 111186254 111115825 111062944 111065257 111089861 111087310
3781.4A11087310r024q094j9241o890L016K337K5630N4586N8245J0181m7589l6156
$$ 111087310 111078286 111070192 111050951 111044061 111047077 111049414 111075044 111129630 111187875 111198056 111150467 111114311
3805.9A11114311k9349m3011p236N4813O0129J6093M590l6705p2217l6585j943J4007
$$ 111114311 111084962 111041951 111034715 111089528 111149657 111165750 111170340 111133635 111061418 111024833 111022890 111036897
3830.4A11036897J3399p75J1110K8062L660l4773o9356o4636L231R9313J32310k8598
$$ 111036897 111050296 111049521 111060631 111088693 111092353 111057580 110988224 110923588 110926819 111026132 111158442 111129844
3854.8A11129844j33383n8854J8132L5095P820m208J7214N341k1720l0577k8992O044
$$ 111129844 110996461 110937607 110955739 110990834 110998654 110994446 111011660 111017001 110995281 110964704 110935712 110941756
3879.3A10941756J1384j9824j4270p200R06J0550k1434k8705L7551Q6498M0746l6729
$$ 110941756 110953140 110933316 110919046 110911846 110912752 110923302 110901868 110873163 110910714 110997212 111037958 111001229
3903.8A11001229q6367p9822l3021M88K7669M1461P701k4307j5533m554j4472k2959
$$ 111001229 110914862 110835040 110802019 110802507 110830176 110871637 110879338 110855031 110839498 110834944 110820472 110797513
3928.3A10797513j7429k2721l3081j8143J335J907o986j4543r930n305j1623l600J0669
$$ 110797513 110780084 110757363 110724282 110706139 110707474 110709381 110702395 110687852 110677922 110672617 110660994 110657394 110668063
3954.8A10668063j621k8026l7992l2687j8275J323J156r811m29J3984J3434J1635k801
$$ 110668063 110666442 110638416 110600424 110567737 110549462 110550785 110551941 110542130 110541701 110555685 110569119 110580754 110577953
3981.3A10577953k8634j2517J5664n96k6202k9528k4033k2161
$$ 110577953 110549319 110536802 110552466 110551870 110525668 110496140 110472107 110449946
3997.6A10449946
$$ 110449946
##END=$$ End of the data block
