##TITLE=Oleo Canola $$ Begin of the data block
##JCAMP-DX=5.00 $$ ACD/SpecManager v 10.08
##SPECTROMETER/DATA SYSTEM=Alpha
##DATE=09 Sep 2014 09:25:40
##DATA TYPE=INFRARED SPECTRUM
##DATA CLASS=XYDATA
##ORIGIN=
##OWNER=
##NPOINTS=1667
##FIRSTX=599.64648438
##LASTX=3997.64306641
##MAXX=3997.64306641
##MINX=599.64648438
##MAXY=1.10613203
##MINY=0.09513430
##XFACTOR=1.0000000000
##YFACTOR=0.000000010000000
##FIRSTY=1.01298785
##DELTAX=2.03961372
##XUNITS=1/CM
##YUNITS=ARBITRARY UNITS
##XYDATA=(X++(Y..Y))
599.6 101298785 101366758 101454580 101562822 101690269 101861644 102071869 102269459 102426255 102571452 102724707
620 102724707 102839410 102864885 102838004 102817976 102813089 102796125 102746677 102667844 102556205 102403414 102226138
642.5 102226138 102042806 101835263 101594341 101344121 101091826 100812030 100480473 100096333 99671894 99221331
662.9 99221331 98765248 98153913 97355068 96756846 96163672 95402163 94574565 93724406 92849451 91993910
683.3 91993910 91192210 90438563 89735007 89090675 88516968 88000351 87503374 86989743 86428386 85765350
703.7 85765350 84973353 84071130 83072209 81966603 80713409 79243499 77508247 75732172 74562716
722 74562716 74573523 75704145 77450830 79346794 81206173 83042878 84887844 86702645 88417596
740.4 88417596 90007526 91466916 92779237 93930149 94922513 95746911 96375883 96820921 97154093
758.7 97154093 97457075 97766131 98089182 98444957 98849130 99291372 99749488 100179327 100545943 100864446
779.1 100864446 101154613 101419330 101643503 101815653 101953065 102082574 102225626 102375412 102498376 102574229
799.5 102574229 102603281 102580059 102495599 102367222 102241635 102134728 102024209 101909769 101785004 101631594
819.9 101631594 101460910 101283729 101089549 100880146 100666165 100440788 100205624 99969584 99715048 99426478
840.3 99426478 99118888 98837060 98628581 98473948 98327899 98214304 98164648 98154944 98138058 98066562 97937673
862.8 97937673 97800231 97694862 97635263 97618598 97645730 97717273 97812372 97909701 97989446 98017079 97975188
885.2 97975188 97897094 97828299 97778809 97748911 97732973 97686410 97574461 97424948 97266805 97092444 96912926
907.6 96912926 96757776 96638781 96578526 96618688 96766514 96979934 97201633 97390991 97522467 97567964
928 97567964 97509134 97347206 97101080 96795088 96454257 96114218 95792645 95477402 95153987 94822085
948.4 94822085 94489241 94142747 93755883 93329763 92889178 92462122 92089051 91825014 91720927 91784412
968.8 91784412 91966993 92199516 92414725 92553371 92587805 92546248 92488068 92444193 92410082 92374271 92309266
991.3 92309266 92194217 92046946 91883093 91701972 91512257 91322285 91128856 90929395 90718973 90476555
1011.6 90476555 90169322 89776593 89316970 88842851 88414752 88065380 87790006 87584215 87452507 87412721
1032 87412721 87487739 87680209 87976480 88316417 88586986 88682038 88542700 88168228 87597418 86889833
1052.4 86889833 86125541 85383970 84715241 84141952 83678520 83329684 83059424 82781440 82377583 81708217
1072.8 81708217 80659264 79198581 77398664 75448394 73562670 71828187 70191067 68585157
1089.2 68585157 67043680 65712631 64773571 64340365 64424837 64977127 65886647 66922820 67744213
1107.5 67744213 68019778 67593873 66579205 65327418 64312017 63951862 64414734 65465748 66495484
1125.9 66495484 66793150 65889639 63753670 60768664 57513565 54509509 52078563 50301397 49039358
1144.2 49039358 48022583 47002351 45860091 44600728 43299958 42066729 41011846 40230674 39795318
1162.6 39795318 39733034 40030551 40652096 41550684 42679179 43994212 45440379 46957916 48508331
1180.9 48508331 50061911 51588774 53081572 54559648 56040716 57531106 59019995 60477924
1197.3 60477924 61849314 63057947 64050323 64816982 65386379 65818191 66175318 66463691 66631597
1215.6 66631597 66616315 66385901 65960574 65388423 64728785 64050609 63419294 62867951 62394720 62009525
1236 62009525 61787671 61841410 62251091 63048518 64193708 65544337 66870290 67951149 68698227 69191277
1256.4 69191277 69577354 69939882 70294207 70666617 71108311 71621323 72116888 72466302 72631472 72733176
1276.8 72733176 72980815 73566729 74569678 75854665 77108932 78042936 78567308 78812659 78956234
1295.2 78956234 79067147 79153395 79274440 79500288 79807645 80101109 80305278 80406666 80429035 80411857
1315.6 80411857 80425251 80584300 80976754 81613272 82412851 83192194 83755618 83994091 83890855 83469367
1336 83469367 82800728 82047141 81381357 80807662 80257380 79752874 79368442 79130632 78991091 78867936
1356.4 78867936 78682655 78436911 78208071 78022987 77825719 77588695 77216238 76441622 75127733 74000484
1376.7 74000484 74336338 76467115 79371095 82040662 84367120 86261106 87435323 87988573 88128573
1395.1 88128573 88005382 87817806 87821162 88245881 89128631 89883983 89714700 88346153 86203325 84167022
1415.5 84167022 83060145 83340806 84314781 85007876 84974182 83984137 82134563 79913765 77821898
1433.9 77821898 75873482 74168807 72882277 71820319 70835322 69828898 68517667 66543740 63781863
1452.2 63781863 60675287 58001310 56544483 55812067 55061936 54632801 55970532 60455275 68528563
1470.6 68528563 79262614 88111013 93154186 96183425 98218936 99655199 100631392 101302481 101887703
1488.9 101887703 102489662 102972746 103265381 103525114 103856337 104152656 104275858 104222822 104280686 104613006
1509.3 104613006 104916906 105076766 105125916 105164504 105218327 105298507 105471063 105654669 105831456 105972195
1529.7 105972195 106005967 106023717 106079638 106007493 105842316 105914342 106154740 106373787 106493127 106530547 106541157
1552.2 106541157 106500840 106345046 106144869 106295359 106603205 106744599 106761956 106728423 106752670 106819510
1572.6 106819510 106783056 106743932 106845713 106950450 106985617 106991351 106985950 106974173 106957972 106932104 106904566
1595 106904566 106880414 106856239 106822360 106780934 106724226 106654787 106589317 106540978 106454575 106281972 106152570
1617.4 106152570 106133819 106062353 105938542 105874693 105828428 105778432 105665898 105373788 104960179 104674816
1637.8 104674816 104379046 103876352 103187215 102349341 101640880 101163912 100667286 100461388 100802505 101278138
1658.2 101278138 101792312 102357137 102869058 103122962 103111720 103052521 103004551 102882421 102721250 102529919
1678.6 102529919 102206445 101731181 101278436 101000988 100678670 100176883 99525338 98597193 97520798
1697 97520798 96512514 95556331 94826108 94254404 93743354 93232810 92543072 91509181 90033823 87935883
1717.4 87935883 85419697 82575649 78877467 74052030 68191171 61283553 53618222 44495270
1733.7 44495270 35417718 28754869 23326777 19148023 16705608 15729660 16214930 18602572 22925934
1752 22925934 28502935 35856923 44926941 54423320 64137214 72384441 78493458 83373034 87188637
1770.4 87188637 90349996 92860621 94596785 95932639 97104883 98104620 98970222 99700952 100262451
1788.8 100262451 100721538 101246750 101774049 102189243 102538764 102886498 103254414 103579891 103853250 104083121
1809.2 104083121 104322255 104568243 104790270 104988074 105178046 105340695 105459964 105584705 105703700 105838561
1829.6 105838561 106034601 106232882 106371117 106494868 106602442 106640267 106661057 106773591 106934536 107058632
1850 107058632 107150638 107221019 107285476 107342792 107400823 107445359 107452512 107416475 107388341 107452202 107562804 107646430
1874.4 107646430 107693887 107727230 107753289 107783747 107813430 107823873 107824302 107857585 107913661 107947898 107976198 108002329
1898.9 108002329 108013356 108015084 108025360 108030295 108027601 108041406 108069801 108074713 108046150 108037901 108049536 108058405 108067977
1925.4 108067977 108077621 108088779 108099425 108102417 108103263 108103228 108082497 108054733 108068836 108114898 108145666 108168721 108196378
1951.9 108196378 108221805 108239484 108245051 108243704 108246017 108250976 108254278 108267415 108282530 108288360 108291352 108289373 108282256
1978.5 108282256 108281934 108283234 108271134 108247268 108221328 108200502 108192682 108201039 108207595 108201444 108185625 108163297 108144295
2005 108144295 108128810 108104908 108073306 108038104 107989299 107930183 107882428 107848930 107819569 107797670 107787085 107783747
2029.4 107783747 107781494 107779169 107784605 107796371 107807672 107824814 107849491 107876861 107907093 107935953 107956851 107966864
2053.9 107966864 107971585 107984197 108007908 108033049 108060205 108092713 108121049 108141506 108161104 108184898 108212566 108236909
2078.4 108236909 108256149 108277380 108297205 108311260 108326828 108350849 108379352 108407950 108428860 108439279 108454275
2100.8 108454275 108473337 108482850 108490157 108508420 108530021 108548212 108564079 108575904 108585238 108595872 108607244 108618188
2125.3 108618188 108627200 108628595 108625782 108622861 108618462 108613443 108610773 108606958 108594310 108574140 108552027 108535874 108535695
2151.8 108535695 108547556 108552718 108552384 108555853 108562052 108573627 108588195 108602273 108619463 108634341 108639717 108644140 108650720
2178.3 108650720 108657229 108666992 108681059 108692324 108698428 108704710 108711123 108719790 108733201 108749795 108760512 108764827 108774793
2204.8 108774793 108787394 108794165 108802021 108812261 108814085 108812785 108820605 108830416 108835208 108842683 108849418 108844125 108831131
2231.4 108831131 108824539 108826852 108829403 108826661 108818567 108810353 108806181 108805859 108801711 108792078 108780348 108763731 108749878 108745766
2259.9 108745766 108737600 108720219 108711088 108713222 108712912 108710873 108715129 108723927 108730400 108729398 108725655 108719206 108694303 108655405
2288.5 108655405 108624232 108597338 108562410 108527625 108497775 108463621 108422983 108386385 108361864 108338201 108303773
2310.9 108303773 108269203 108245981 108222389 108190918 108165216 108147669 108133483 108128715 108137453 108151209 108160377 108175373
2335.4 108175373 108206153 108230889 108229220 108231652 108278453 108345735 108375955 108354330 108313787 108284092 108269572 108276355
2359.9 108276355 108303821 108341300 108373845 108401418 108442962 108515036 108604205 108685064 108768344 108873546 108988428
2382.3 108988428 109089136 109156466 109191751 109211385 109219110 109219086 109220707 109224856 109233665 109245420 109254777 109268165 109283400
2408.8 109283400 109291303 109295356 109301138 109313059 109331369 109348798 109363055 109374928 109384227 109395039 109407520 109416962
2433.3 109416962 109416950 109410250 109409070 109415126 109423339 109431696 109433222 109422648 109410489 109409928 109420240 109428585 109432721 109435797
2461.8 109435797 109432757 109429002 109431100 109428763 109416509 109404361 109393370 109376669 109353888 109330833 109310138 109286869
2486.3 109286869 109261644 109239292 109219110 109194720 109170294 109154975 109139502 109112549 109081364 109055996 109028959
2508.7 109028959 108991051 108950424 108912134 108873379 108837938 108805990 108774292 108741653 108707142 108677125 108658552
2531.2 108658552 108647633 108642244 108645546 108648360 108639133 108623767 108612859 108605194 108599043 108595943 108590603 108577883 108561504
2557.7 108561504 108540106 108507800 108460855 108402181 108356416 108328271 108293211 108245623 108193910 108144104 108096004
2580.1 108096004 108047986 108005202 107969689 107933974 107893395 107852066 107812059 107769859 107728648 107686794 107633317
2602.6 107633317 107578158 107530379 107480407 107428432 107376981 107322729 107268393 107213032 107147539 107062840 106958973
2625 106958973 106853366 106758785 106675136 106602871 106537449 106479132 106436265 106401360 106364036 106326818 106281245 106217849
2649.5 106217849 106133759 106027091 105908465 105784059 105651379 105515540 105388737 105274606 105168211 105073822
2669.9 105073822 105002904 104953384 104907942 104873073 104878056 104925632 104993856 105072689 105169499 105285645 105406094
2692.3 105406094 105513012 105602121 105682003 105748260 105783892 105786264 105761969 105716753 105657315 105584717 105507946
2714.7 105507946 105449009 105394459 105307984 105190074 105064976 104968941 104928505 104933000 104975212 105048132 105119205
2737.2 105119205 105174518 105217421 105235362 105215418 105176210 105157089 105157149 105142474 105101037 105045617 104983974 104906368
2761.6 104906368 104804349 104681396 104540014 104378009 104188263 103964353 103725529 103479564 103199184 102872276
2782 102872276 102507567 102108562 101688445 101283944 100896275 100476980 100002182 99496150 98981845 98431015
2802.4 98431015 97795600 97066623 96252638 95353335 94352347 93218285 91936380 90494162 88858533
2820.8 88858533 86986160 84833568 82367700 79589689 76537627 73226225 69564342 65324408
2837.1 65324408 60194892 53914601 46573532 38806415 31538412 25585511 21488449 19505894
2853.4 19505894 19611087 21554296 24913374 29125601 33524978 37379533 40150672 41936582 43493310
2871.8 43493310 45504460 47893298 50003582 51242381 51423347 50678176 49237674 47314262 45110360
2890.1 45110360 42797139 40473202 38179895 35912380 33652121 31386462 29087752 26733446
2906.5 26733446 24315691 21827982 19289562 16763119 14381397 12345285 10818382 9876061 9513430
2924.8 9513430 9680825 10304999 11302561 12680374 14484827 16675779 19152829 21799314 24414219
2943.2 24414219 26692784 28350034 29293758 29707909 29927346 30328605 31250936 32882777 35288382
2961.5 35288382 38458535 42320040 46712142 51370811 56020868 60449499 64534879 68249369
2977.8 68249369 71573317 74454987 76845706 78691864 79919332 80431747 80118984 78891438 76764226
2996.2 76764226 73942769 70809007 67853767 65543580 64239186 64216727 65611345 68332583 72092736
3014.5 72092736 76499647 81099069 85446024 89232707 92350876 94845796 96805650 98326528
3030.9 98326528 99520749 100490499 101289248 101918340 102405751 102824020 103214860 103569078 103858101 104079604
3051.3 104079604 104253852 104386425 104485726 104551888 104590881 104636490 104708743 104845417 105079126 105375910
3071.7 105375910 105686653 105971932 106213653 106435263 106645632 106836283 107019091 107183647 107318187 107441926
3092.1 107441926 107560718 107667112 107752419 107826424 107909095 107981277 108024621 108075523 108163202 108238840 108255911
3114.5 108255911 108255720 108291328 108369303 108473086 108573341 108641505 108672905 108689213 108717668 108751464 108754146 108748126
3139 108748126 108794463 108868241 108907115 108907807 108882689 108848655 108852780 108909810 108977211 109017026 109026301 109026361 109040701
3165.5 109040701 109065425 109080732 109087813 109099269 109109867 109111977 109125125 109150255 109166420 109189951 109225333 109250009
3189.9 109250009 109265840 109284449 109308314 109336305 109367275 109405720 109451401 109487832 109514880 109554017 109597862
3212.4 109597862 109626949 109649515 109672308 109702826 109747672 109790659 109813452 109807813 109781229 109766400 109799528 109865057
3236.9 109865057 109921801 109957504 109966505 109945619 109930158 109962392 110012364 110028899 110025537 110036480 110057867 110073400
3261.3 110073400 110081875 110076749 110036898 109971845 109949422 109988487 110030723 110053408 110067463 110072577 110070515 110066211
3285.8 110066211 110049808 110010731 109972489 109951794 109955966 110016418 110091865 110080540 109991407 109944415 110003662 110123563
3310.3 110123563 110230577 110283935 110300243 110311723 110316014 110293710 110260677 110270870 110321784 110350680 110340953 110306692
3334.8 110306692 110246062 110206378 110223627 110258687 110297716 110320580 110284674 110245514 110272932 110320377 110325241 110304093
3359.2 110304093 110298741 110296035 110242939 110153818 110123479 110190690 110273468 110302854 110302138 110303307 110311973 110322869 110325849
3385.7 110325849 110299599 110228586 110172391 110195839 110237098 110200298 110119486 110125005 110239589 110326266 110313785
3408.2 110313785 110270238 110255778 110287070 110335255 110338044 110304248 110278881 110248327 110186708 110106754 110047674 109996033
3432.7 109996033 109915566 109871984 109914136 109962046 109941792 109851980 109742296 109672821 109619987 109531939 109412718
3455.1 109412718 109246397 109031832 108867002 108742142 108503342 108202732 108121717 108330595 108568084 108664787
3475.5 108664787 108651423 108653128 108847785 109136736 109314036 109463584 109657431 109798765 109854460 109872222
3495.9 109872222 109911776 109945953 109938967 110039616 110251820 110368204 110330939 110196936 110094857 110110712 110128987
3518.3 110128987 110022199 109820569 109688783 109712493 109763861 109745014 109675324 109575498 109510338 109510398 109468508
3540.8 109468508 109343612 109258175 109302282 109387243 109412563 109442067 109514463 109547114 109516513 109481287 109462118
3563.2 109462118 109428203 109421921 109517205 109656012 109750760 109793758 109827292 109850705 109826052 109755802 109682858
3585.6 109682858 109691978 109803522 109898806 109929442 109928739 109910822 109892178 109888697 109876704 109839499 109799790 109772420
3610.1 109772420 109744418 109721565 109702086 109665751 109673071 109758937 109821677 109769607 109657180 109671021 109780741
3632.5 109780741 109862781 109910667 109932101 109925759 109896266 109817398 109652400 109492314 109553421 109745920 109828162
3655 109828162 109810531 109843040 109936154 110024738 110060620 110015309 109920335 109877729 109854603 109808302 109880841 110035610
3679.4 110035610 110147333 110192680 110145581 109998286 109909654 110032105 110204554 110298204 110350037 110379362 110393643
3701.9 110393643 110428667 110447180 110396016 110306716 110302567 110419106 110515416 110517049 110459113 110403681 110387444 110418820
3726.4 110418820 110467160 110443509 110313404 110182822 110178661 110286820 110391474 110380185 110284317 110265732 110243094
3748.8 110243094 110182166 110254002 110388923 110438216 110437155 110486734 110541987 110532463 110497677 110478151 110512626 110586941
3773.3 110586941 110613203 110559773 110498118 110509980 110543406 110557735 110576642 110580623 110577297 110574400 110536468 110481262
3797.7 110481262 110406590 110326183 110337090 110379934 110428882 110516572 110553277 110479760 110364842 110302687 110251045
3820.2 110251045 110266745 110386097 110464704 110473752 110436487 110356712 110265970 110179663 110137892 110180676 110265207
3842.6 110265207 110351968 110419941 110429883 110331881 110138738 110076666 110202706 110325825 110361826 110317445 110289490
3865 110289490 110290325 110224605 110168195 110202742 110258651 110283232 110242367 110202920 110200429 110187876 110219085 110250950
3889.5 110250950 110227013 110230577 110241246 110176337 110079801 110033512 110046113 110112095 110206437 110273528 110289252 110265481
3914 110265481 110206699 110144031 110129786 110145736 110152006 110150170 110133958 110090077 110047221 110043013 110060084 110063529 110036659
3940.5 110036659 109984052 109951258 109951341 109951234 109946322 109947348 109947872 109933257 109908545 109892702 109892488 109892690 109878099 109851968
3969.1 109851968 109815598 109784186 109794652 109841585 109877658 109875143 109840536 109809458 109801292 109794664 109775865 109753060
3993.5 109753060 109734142 109712613
3997.6 109712613
##END=$$ End of the data block
