##TITLE=Oleo Canola $$ Begin of the data block
##JCAMP-DX=5.00 $$ ACD/SpecManager v 10.08
##SPECTROMETER/DATA SYSTEM=Alpha
##DATE=01 Oct 2014 10:03:18
##DATA TYPE=INFRARED SPECTRUM
##DATA CLASS=XYDATA
##ORIGIN=
##OWNER=
##NPOINTS=1667
##FIRSTX=599.64648438
##LASTX=3997.64306641
##MAXX=3997.64306641
##MINX=599.64648438
##MAXY=1.12447441
##MINY=0.15736899
##XFACTOR=1.0000000000
##YFACTOR=0.000000010000000
##FIRSTY=1.05511034
##DELTAX=2.03961372
##XUNITS=1/CM
##YUNITS=ARBITRARY UNITS
##XYDATA=(X++(Y..Y))
599.6 105511034 105546451 105606508 105713081 105821061 105919564 106061959 106231141 106370711 106477869 106563270
620 106563270 106638181 106707215 106752014 106763148 106754458 106757939 106770647 106745231 106680179 106600463 106504011 106369281
644.5 106369281 106224322 106117046 106019115 105899191 105749297 105568600 105363107 105128801 104863334 104590344
664.9 104590344 104252815 103797042 103408182 103031933 102581966 102089345 101561272 101013601 100477409 99953246
685.3 99953246 99441987 98975813 98569864 98195308 97830921 97496897 97173387 96801364 96351629 95834160
705.7 95834160 95237434 94522816 93693113 92760515 91702259 90474343 89185631 88298428 88280439 89099723
726.1 89099723 90367937 91732216 93054193 94355834 95651454 96885628 98017067 99054319 100007248
744.5 100007248 100860751 101588070 102192855 102697325 103096569 103373003 103557765 103725243 103911042 104106331
764.9 104106331 104315329 104547501 104800236 105069673 105329525 105542386 105709302 105860186 106006908 106142747
785.3 106142747 106249380 106303525 106330752 106379676 106457007 106541276 106593454 106592679 106554413 106491876 106419063 106349242
809.7 106349242 106274688 106186676 106091130 105992508 105888569 105776560 105657244 105535626 105419266 105302799
830.1 105302799 105174136 105035067 104875159 104683888 104482603 104303193 104150665 104013741 103898191 103810585
850.5 103810585 103753078 103720605 103694022 103657055 103597915 103516126 103429174 103353381 103302217 103287113 103299487 103332770
875 103332770 103387785 103449941 103492749 103497159 103465855 103416002 103377235 103358316 103338015 103305280 103258407 103194499
899.5 103194499 103109527 102999628 102879798 102768636 102663815 102574265 102531493 102555430 102640736 102764118 102888012
921.9 102888012 102983510 103050303 103085196 103063250 102967620 102810216 102615571 102405024 102198386 102005172 101813865
944.3 101813865 101618099 101427937 101234758 101017463 100778055 100526452 100267839 100020385 99807477 99650198
964.7 99650198 99572849 99595439 99710953 99868113 100005281 100083101 100092721 100070262 100052619 100037301 100021589
987.2 100021589 100006104 99975067 99910867 99813771 99705851 99599361 99495876 99395281 99285978 99164373
1007.6 99164373 99031943 98877317 98684376 98444021 98171788 97903758 97656113 97437471 97268981 97148198
1028 97148198 97071695 97058779 97114623 97239614 97430593 97646374 97819269 97890896 97824442 97606593 97257793
1050.4 97257793 96820420 96339506 95865756 95436120 95059806 94751978 94520062 94332892 94147247 93891025
1070.8 93891025 93450665 92737991 91728109 90459400 89053458 87665218 86360967 85099328 83833069
1089.2 83833069 82602930 81540477 80789483 80431587 80487114 80934972 81680471 82526153 83194095 83423966
1109.6 83423966 83100361 82303035 81295007 80455357 80146313 80530983 81416607 82294333 82574809 81857890
1129.9 81857890 80097157 77572644 74725622 71998870 69715691 67992496 66727960 65685064
1146.3 65685064 64634615 63453543 62135786 60755056 59421223 58258045 57379901 56874722 56787837
1164.6 56787837 57105941 57777095 58748567 59963405 61349607 62842953 64398146 65970236 67513549
1183 67513549 68999559 70425469 71806854 73159009 74494433 75814039 77094334 78280824 79307210
1201.3 79307210 80138385 80774450 81249058 81615537 81909531 82138121 82274210 82267910 82088554 81747568
1221.7 81747568 81284100 80746543 80191898 79673845 79213649 78805894 78468281 78268850 78298527 78633106
1242.1 78633106 79293662 80232924 81333250 82397741 83244932 83822495 84206778 84514010 84796548
1260.5 84796548 85053521 85319626 85652620 86046857 86420387 86676949 86793095 86858386 87028146 87448341
1280.9 87448341 88177681 89111990 90018207 90681660 91039222 91195488 91287339 91360676 91413695 91490382
1301.3 91490382 91642970 91854173 92056501 92199898 92279869 92310005 92308146 92312992 92390352 92614561 93021399
1323.7 93021399 93551666 94070923 94445503 94600713 94539911 94299591 93904680 93394220 92878956 92433345
1344.1 92433345 92038929 91691643 91421217 91243768 91136897 91049379 90947199 90839231 90703410 90513188
1364.5 90513188 90324295 90150827 89901555 89388996 88445342 87563086 87740958 89227986 91263294
1382.9 91263294 93150800 94767106 95980591 96716088 97147954 97323084 97249013 97062284 96973199 97218019
1403.3 97218019 97772264 98190778 98033571 97147614 95786852 94572484 94028914 94254303 94789362
1421.6 94789362 95169312 95100176 94440722 93223888 91716194 90333450 89052820 87757921 86678070
1440 86678070 85840565 85134828 84443367 83458477 81873703 79684776 77293622 75196278 73791599
1458.3 73791599 72912586 72176480 71740854 72754574 76486385 83068293 91146392 97157544 100203156
1476.7 100203156 101894081 103032589 103863215 104509342 105089080 105571711 105827582 105969071 106192446
1495.1 106192446 106449139 106561673 106619489 106819165 107239056 107543015 107423162 107284331 107313716 107472360
1515.4 107472360 107653868 107820415 107942367 107931900 107874358 107825124 107820976 107926369 108023298 108079159 108302522
1537.9 108302522 108612800 108596051 108372355 108193314 108135414 108173048 108244634 108380246 108654416 108950591
1558.3 108950591 108765149 108422577 108311963 108351612 108438528 108439541 108413649 108498073 108526802 108400118 108316445
1580.7 108316445 108306062 108313215 108318806 108322287 108332121 108351374 108362246 108354020 108345497 108340561 108334732 108331394 108335423
1607.2 108335423 108313513 108274209 108306658 108410847 108395398 108273578 108247602 108247125 108182096 108098352 108011365
1629.7 108011365 107984400 108075619 108059251 107728338 107328033 106999075 106780791 106581604 106246197 105992293
1650.1 105992293 105957103 105772758 105507958 105548692 105874634 106284440 106552398 106728590 106917119 106985021
1670.5 106985021 106908441 106819987 106659007 106489146 106444180 106487274 106310368 105865741 105471694 105114579
1690.9 105114579 104822028 104544580 104174924 103709364 103054118 102410543 101962507 101563478 101159298 100759077
1711.3 100759077 100286901 99625927 98416233 96606928 94505805 91890162 88425988 83999097 78432399
1729.6 78432399 71688521 62579513 52401161 44140533 36782432 30682138 26901388 25317907
1745.9 25317907 26001567 29443032 35504535 42965516 51950401 61995268 71415544 79928213
1762.2 79928213 86495239 91053700 94560575 97235715 99278516 100684369 101612127 102398992 103108752
1780.6 103108752 103676617 104161000 104575241 104969573 105399072 105769169 105966914 106130791 106355596 106566846
1801 106566846 106713915 106830633 106979895 107145321 107288122 107377803 107467341 107577395 107684660 107804906
1821.4 107804906 107954383 108099270 108216798 108325958 108357775 108357131 108405709 108482647 108562684 108692312 108840227
1843.8 108840227 108871055 108828735 108809817 108825171 108857775 108902586 108944702 108981729 109016526 109069812 109165800
1866.3 109165800 109249902 109234726 109172845 109159434 109175456 109192407 109214151 109249389 109286118 109327841 109374166
1888.7 109374166 109390604 109391570 109403944 109414506 109416902 109424269 109432733 109452665 109488273 109511900 109504008 109497571 109533250
1915.2 109533250 109582078 109593809 109583759 109571493 109544444 109529042 109532809 109537196 109541178 109548557 109560168 109590721
1939.7 109590721 109638119 109653175 109639645 109630239 109631622 109650302 109672976 109678054 109683132 109707332 109730041 109745049 109762096
1966.2 109762096 109771347 109771037 109778225 109785759 109783983 109782708 109787118 109793425 109796286 109798968 109813702 109841502 109852660 109836829
1994.8 109836829 109823871 109824884 109825087 109818292 109813571 109812999 109807694 109799874 109799564 109805453 109799695 109772038 109743965 109733522
2023.3 109733522 109734499 109741020 109749269 109751391 109747219 109751177 109772432 109799528 109818959 109833062 109852517 109874487 109889448
2049.8 109889448 109903729 109927070 109949744 109961641 109974802 109997022 110021389 110045564 110070395 110093331 110111892
2072.3 110111892 110124147 110135257 110151148 110167611 110183871 110200882 110215354 110232413 110257900 110279810 110293293
2094.7 110293293 110309029 110331500 110353613 110365772 110369003 110371125 110380948 110399961 110420454 110429740 110430706 110437298 110448408
2121.2 110448408 110458338 110464692 110469007 110476816 110487974 110494101 110492623 110488045 110484576 110480118 110477030 110476959 110467410 110457635
2149.8 110457635 110460246 110462785 110460162 110463214 110473943 110481155 110480618 110481024 110484087 110484123 110488355 110502768 110515797 110522079
2178.3 110522079 110529292 110536575 110545254 110555696 110557532 110553098 110555613 110569859 110583138 110584486 110583246 110586429 110589528
2204.8 110589528 110595489 110607970 110616124 110610497 110598445 110592079 110595429 110602176 110607255 110618424 110634160 110638523 110630333
2231.4 110630333 110622072 110618591 110619998 110623455 110619676 110606110 110592711 110585785 110581541 110579216 110582626 110588562 110586655 110576248
2259.9 110576248 110564756 110553527 110544157 110543442 110552275 110561204 110565710 110571659 110579395 110579491 110575151 110572708 110564947 110555100
2288.5 110555100 110550928 110543931 110530365 110522342 110521865 110523093 110526180 110526180 110521090 110517204 110519373 110533154 110549438 110555446
2317 110555446 110564470 110588443 110617161 110644948 110683656 110725272 110742342 110742879 110761428 110798562 110818267 110815835 110805643
2343.5 110805643 110759044 110693657 110675657 110724854 110809243 110885298 110946941 110982811 110994399 110987866 110945523 110897732
2368 110897732 110857666 110812438 110775328 110746884 110728228 110727489 110738349 110751021 110763073 110771656 110770750 110764623 110760581
2394.5 110760581 110762620 110768890 110767984 110764349 110770214 110778904 110776603 110768783 110774028 110792851 110811317 110821557 110819864 110811996
2423.1 110811996 110812771 110820448 110827684 110839415 110854435 110862374 110860765 110857344 110854375 110848534 110844803 110849547 110861373 110876858
2451.6 110876858 110884488 110876036 110862827 110862768 110875666 110883331 110879159 110868955 110858333 110854948 110856581 110850525 110840952 110836172
2480.2 110836172 110827708 110814691 110809040 110808551 110796511 110775328 110755610 110736465 110720336 110708690 110698843 110692477 110686564
2506.7 110686564 110665262 110630167 110603869 110587466 110566938 110535038 110498536 110475624 110471463 110470915 110463297 110454094
2531.2 110454094 110445821 110439360 110437953 110434961 110427082 110418522 110410225 110408056 110414219 110414302 110402536 110392725 110387182 110370922
2559.7 110370922 110345232 110323524 110306036 110283864 110251546 110216284 110183930 110151649 110123730 110100937 110076010
2582.2 110076010 110055530 110044742 110030663 110007155 109981132 109956455 109932697 109906220 109875381 109849954 109830439
2604.6 109830439 109804177 109774923 109752190 109727228 109689510 109646988 109610069 109573770 109530425 109480691 109427083
2627 109427083 109376764 109331894 109287179 109248006 109222531 109208071 109192455 109167194 109139764 109115624 109081125 109031582
2651.5 109031582 108977222 108914149 108839142 108762491 108690000 108620596 108557308 108504045 108459580 108422959 108392477
2673.9 108392477 108366680 108344769 108336437 108358574 108402920 108454144 108511686 108571124 108628881 108686709 108739233 108781981
2698.4 108781981 108816969 108841836 108851898 108847237 108828664 108790171 108735430 108687758 108659923 108631313 108579886 108514786
2722.9 108514786 108448410 108399773 108394063 108416891 108439040 108458972 108488154 108526087 108559203 108574831 108565104 108542883
2747.4 108542883 108536875 108549821 108558667 108547390 108517241 108475995 108429849 108375859 108309174 108233213 108146596 108039069
2771.8 108039069 107905507 107772088 107656944 107527494 107359242 107160592 106939352 106710160 106497312 106295645
2792.2 106295645 106068444 105794227 105499423 105217063 104923296 104576516 104167211 103695369 103171802 102595842
2812.6 102595842 101934075 101173556 100312006 99323106 98169321 96809053 95205957 93345231 91238284
2831 91238284 88881576 86174124 82874924 78634560 73068738 65980709 57694191 49113920 41401616
2849.3 41401616 35644275 32638383 32647085 35359120 40039971 45713988 51359266 56063396 59294915
2867.7 59294915 61279005 62920505 64986336 67400467 69494539 70709515 70903033 70204848 68817806
2886.1 68817806 66930306 64702392 62277263 59762424 57201630 54589230 51901299 49103948
2902.4 49103948 46149126 43000782 39636880 36030281 32182837 28192168 24293149 20829181
2918.7 20829181 18137194 16431031 15736899 15960857 16985509 18691088 21045546 24055248 27614722
2937 27614722 31520817 35527089 39325732 42550662 44873554 46188784 46734136 46990475 47497323
2955.4 47497323 48666185 50659269 53482556 57075495 61284530 65833050 70377797 74647856
2971.7 74647856 78491229 81861836 84788805 87294674 89390373 91094124 92387503 93231446 93585849
2990.1 93585849 93382668 92552346 91084570 89092046 86818051 84606516 82830763 81806284 81767362
3008.4 81767362 82817918 84863931 87635684 90772808 93901795 96735287 99125910 101042306
3024.7 101042306 102533507 103673661 104538858 105203581 105734348 106168246 106507123 106775367 107009804
3043.1 107009804 107228684 107433105 107589841 107697260 107793605 107873213 107926929 107968497 107997787 108023369 108060801
3065.5 108060801 108129108 108255124 108430719 108609009 108745623 108844519 108953404 109082031 109196448 109288454
3085.9 109288454 109367573 109445679 109539044 109634137 109703290 109741414 109773898 109823167 109867477 109884012 109895575
3108.4 109895575 109936893 109978223 109971035 109950340 109968507 110027897 110111523 110187960 110222983 110228133 110250902 110290468
3132.8 110290468 110304987 110288012 110274112 110304058 110363913 110399830 110400963 110386860 110368645 110367489 110397625 110429525
3157.3 110429525 110447133 110467374 110483825 110486305 110491586 110509634 110525191 110531890 110540211 110548747 110555196 110573614 110602236
3183.8 110602236 110614145 110606301 110612631 110639572 110665810 110691607 110709131 110714209 110722816 110735893 110758352 110791183
3208.3 110791183 110816538 110830796 110847783 110871768 110896003 110923731 110947454 110952497 110952771 110964656 110966766 110947037
3232.8 110947037 110956323 111008811 111056471 111076021 111061966 111030555 111026299 111069393 111115289 111116529 111101925 111114776
3257.3 111114776 111143422 111166143 111180866 111177182 111135507 111068404 111043549 111086524 111140537 111170506 111175644 111168122
3281.7 111168122 111163223 111158729 111148572 111114860 111067104 111044979 111058843 111102283 111141837 111120903 111043489 110993445
3306.2 110993445 111028266 111111891 111183751 111224902 111250937 111264825 111255777 111228871 111198175 111188924 111207294 111228096
3330.7 111228096 111240256 111225307 111172652 111139297 111155200 111179864 111200500 111205459 111168063 111142302 111184156 111237347
3355.2 111237347 111242914 111217320 111193025 111171269 111125207 111064410 111046517 111097991 111165023 111188614 111189187 111200714
3379.6 111200714 111216831 111223364 111215603 111177337 111103404 111058617 111091018 111137283 111104119 111018538 111007786 111078107
3404.1 111078107 111119950 111113989 111106205 111110544 111133325 111164582 111177170 111178482 111177039 111161280 111122441 111066902
3428.6 111066902 111036921 111012828 110938990 110882318 110919082 110999084 111047101 111040986 110994112 110942006 110901761 110859787
3453.1 110859787 110804594 110721469 110618746 110556567 110511386 110367191 110174060 110155153 110363984 110590041
3473.4 110590041 110682261 110665917 110684097 110873210 111088181 111176133 111256385 111380458 111455739 111465383 111449337
3495.9 111449337 111458457 111485028 111473286 111526453 111679888 111767066 111705101 111532795 111394048 111382985 111411142
3518.3 111411142 111378813 111280382 111208868 111231780 111263156 111226082 111151564 111074114 111021841 111006927 110989726
3540.8 110989726 110961711 110964644 111006367 111046648 111058259 111050117 111045134 111062717 111090660 111120296 111197758 111334801
3565.2 111334801 111412263 111335123 111237514 111235499 111277521 111302447 111307192 111299396 111321986 111427474 111535132 111515236
3589.7 111515236 111460590 111473751 111485219 111448324 111420727 111421931 111446881 111522436 111614013 111653197 111652935 111637366
3614.2 111637366 111645997 111680698 111635494 111534011 111526811 111674440 111842728 111796522 111647975 111560881 111512744
3636.6 111512744 111484444 111481833 111516988 111650634 111901855 112074268 111962843 111784768 111717713 111652267 111538315
3659 111538315 111488736 111523926 111607480 111762130 111945915 112035930 112099302 112158513 112048399 111852121 111718929
3681.5 111718929 111686075 111763215 111910892 111999500 111935651 111811745 111735809 111742687 111814129 111870182 111869812 111905694
3706 111905694 112038743 112194848 112203026 112049878 111934793 111935067 111987936 112033713 112045825 112007546 111990845 112101948
3730.4 112101948 112296569 112390280 112276280 112117267 112128448 112308240 112447441 112432063 112437963 112437046 112270367
3752.9 112270367 112084341 112014210 111990547 111936867 111907268 111935270 111976802 111982441 111912143 111820376 111788607
3775.3 111788607 111819601 111847615 111820638 111797047 111794865 111775732 111755383 111747599 111778009 111864400 111967373 112075412
3799.8 112075412 112106204 112010622 111939347 111883545 111789989 111766219 111865675 111990345 112064791 112115705 112040198
3822.2 112040198 111878300 111801589 111805439 111846721 111890018 111923492 111987805 112043369 112012386 111903918 111757529
3844.6 111757529 111672950 111748111 111993480 112244594 112148237 111874509 111751926 111779177 111849749 111874962 111882865
3867.1 111882865 111909878 111871099 111773324 111689997 111652327 111694622 111748755 111751866 111725211 111681032 111670256 111665845
3891.6 111665845 111602902 111565447 111647105 111797857 111877441 111813939 111645854 111485958 111408794 111404049 111455369
3914 111455369 111526084 111541009 111507249 111497223 111505818 111477530 111431599 111414790 111389160 111331689 111305737 111321712
3938.5 111321712 111340022 111348784 111338210 111326993 111331475 111323905 111307156 111296570 111277723 111251080 111231911 111213470
3962.9 111213470 111192787 111184740 111187625 111198580 111218882 111233878 111236918 111234653 111219490 111195624 111197162 111222732
3987.4 111222732 111234331 111219180 111198008 111187553 111173046
3997.6 111173046
##END=$$ End of the data block
