##TITLE=Oleo $$ Begin of the data block
##JCAMP-DX=5.00 $$ ACD/SpecManager v 10.08
##SPECTROMETER/DATA SYSTEM=Alpha
##DATE=29 Jul 2016 08:08:58
##DATA TYPE=INFRARED SPECTRUM
##DATA CLASS=XYDATA
##ORIGIN=
##OWNER=
##NPOINTS=1667
##FIRSTX=599.65820312
##LASTX=3997.72216797
##MAXX=3997.72216797
##MINX=599.65820312
##MAXY=1.10935307
##MINY=0.21656126
##XFACTOR=1.0000000000
##YFACTOR=0.000000010000000
##FIRSTY=0.95210755
##DELTAX=2.03965425
##XUNITS=1/CM
##YUNITS=ARBITRARY UNITS
##XYDATA=(X++(Y..Y))
$$ plain form
599.7 95210755 96576607 98718113 100948763 102665234 103781557 104498935 104976094 105293858 105518782
618 105518782 105675983 105771208 105806553 105781019 105722582 105658424 105568981 105474699 105381715 105224764 104987729
640.5 104987729 104709196 104404569 104032528 103506267 102739918 101729226 100507581 99202782 98050964
658.8 98050964 97213554 96721941 96540523 96820539 97856927 99100709 100358570 101680398 102820313
677.2 102820313 103702867 104362643 104825091 105130458 105331326 105477238 105598855 105704355 105800664 105878651
697.6 105878651 105919456 105908442 105859590 105773282 105564880 104999578 103616893 101538539 100397944 101035202
718 101035202 101706028 101281357 101038134 101987493 103467333 104533792 105052054 105286336 105422342 105535316
738.4 105535316 105625975 105665398 105651522 105583870 105469978 105324244 105142891 104882288 104454648 103710902
$$ packed form
599.7I5210755J365852K141506K230650J716471J116323P17378M77159L17764K24924
618A05518782J57201R5225L5345k5534n8437o4158q9443r4282r2984j56951k37035
640.5A04987729k78533l04627l72041n26261p66349j010692j221645j304799j151818
658.8I8050964q37410m91613j81418K80016J036388J243782J257861J321828J139915
677.2A02820313Q82554O59776M62448L05367K00868J45912J21617J05500R6309P7987
697.6A05878651M0805j1014m8852q6308k08402n65302j382685k078354j140595O37258
718A01035202O70826m24671k43223R49359J479840J066459N18262K34282J36006J12974
738.4A05535316R0659L9423j3876o7652j13892j45734j81353k60603m27640p43746
$$ plain form
758.8 103710902 102336752 100018322 97303784 95345867 93531030 89510709 83233792 79041833
775.1 79041833 80939037 87130570 92914200 96233076 97622281 97911865 97478586 96387833 94551599
793.4 94551599 91766691 87783617 82507068 76258779 69973367 65116173 63161004 64513505 67699414
811.8 67699414 70757586 73513252 77203912 82279289 87776208 92504233 95979953 98317748 99805093
830.1 99805093 100685155 101139343 101292002 101192129 100823843 100149560 99123847 97628462 95537513 92912179
850.5 92912179 90083033 87591720 86029720 85776949 86802500 88736808 91104198 93482512 95570433
868.9 95570433 97210866 98388034 99183589 99671525 99865651 99753296 99329466 98607785 97598839
887.3 97598839 96247005 94382089 91806662 88572264 85158300 82114208 79505473 76869130 73692173
$$ packed form
758.8A03710902j374150k318430k714538j957917j814837m020321o276917m191959
775.1G9041833J897204O191533N783630L318876J389205K89584m33279j090753j836234
793.4I4551599k784908l983074n276549o248289o285412m857194j955169J352501L185909
811.8F7699414L058172K755666L690660N075377N496919M728025L475720K337795J487345
830.1I9805093Q80062M54188J52659r9873l68286o74283j025713j495385k090949k625334
850.5I2912179k829146k491313j562000k52771J025551J934308K367390K378314K087921
868.9I5570433J640433J177168P95555M87936J94126j12355m23830p21681j008946
887.3I7598839j351834j864916k575427l234398l413964l044092k608735k636343l176957
$$ plain form
905.6 73692173 69985080 66315728 63315547 61388457 60661173 60911524 61546105 61753237 60941702
924 60941702 59345114 57970226 57344246 56903809 56485647 57311606 60419333 65062016 69654435
942.3 69654435 73684758 77707136 81993806 86175543 89791310 92639595 94822186 96562463 97973478
960.7 97973478 99048173 99791920 100277078 100580454 100732982 100731146 100560427 100197482 99580556 98578840
981.1 98578840 96984982 94536728 91017699 86555362 81995821 78761798 77979398 79704332 83058441
999.4 83058441 86916441 90401727 93062031 94816649 95765215 96043676 95759368 94975263 93760365
1017.8 93760365 92252201 90526885 88349366 85236317 80702329 74345988 66004300 56145602
1034.1 56145602 46172953 38078132 33562461 33497864 37902966 45883250 55681556 65357584 73656642
$$ packed form
905.6G3692173l707093l669352l000181j927090p27284K50351O34581K07132q11535
924F0941702j596588j374888o25980m40437m18162Q25959L107727M642683M592419
942.3F9654435M030323M022378M286670M181737L615767K848285K182591J740277J411015
960.7I7973478J074695P43747M85158L03376J52528j836j70719l62945o16926j001716
981.1I8578840j593858k448254l519029m462337m559541l234023p82400J724934L354109
999.4H3058441L858000L485286K660304J754618R48566K78461k84308p84105j214898
1017.8I3760365j508164j725316k177519l113049m533988o356341q341688r858698
1034.1E6145602r972649q094821m515671o4597M405102P980284R798306R676028Q299058
$$ plain form
1052.5 73656642 80211347 85171419 88871020 91645992 93728411 95277715 96441585 97329283 97982395
1070.8 97982395 98393416 98546803 98435789 98032147 97260618 96034259 94328827 92232126 89991432
1089.2 89991432 88034362 86759615 86203122 86076111 86210328 86762458 87893361 89459407 91081113
1107.5 91081113 92336243 92867339 92438030 91057074 89144349 87469113 86825830 87530881 89177704
1125.9 89177704 91190052 93353570 95601726 97742653 99551737 100934362 101928461 102619386 103084099
1144.3 103084099 103380620 103568900 103689539 103722143 103638935 103489006 103346145 103178036 102856028 102268505
1164.6 102268505 101331007 99926764 97887903 95031780 91219032 86355555 80535334 74469990
1181 74469990 69570982 67166036 67601776 70187092 73720002 76973498 79085684 79825658 79563123
$$ packed form
1052.5G3656642O554705M960072L699601K774972K082419J549304J163870Q87698O53112
1070.8I7982395M11021J53387j11014m03642p71529j226359j705432k096701k240694
1089.2H9991432j957070j274747n56493j27011J34217N52130J130903J566046J621706
1107.5I1081113J255130N31096m29309j380956j912725j675236o43283P05051J646823
1125.9H9177704K012348K163518K248156K140927J809084J382625R94099O90925M64713
1144.3A03084099K96521J88280J20639L2604q3208j49929j42861j68109l22008n87523
1164.6A02268505r37498j404243k038861k856123l812748m863477n820221o065344
1181G4469990m899008k404946M35740K585316L532910L253496K112186P39974k62535
$$ plain form
1199.3 79563123 79009348 78866380 79484087 80732417 82189322 83455801 84328538 84761256 84754431 84299862
1219.7 84299862 83364725 81886119 79765052 76846957 72925264 67826438 61533016 54216820 46188247
1238.1 46188247 37920564 30255580 24441385 21656126 22603573 27631822 36565566 48031393
1254.4 48031393 59658766 69448608 76678973 81580150 84692502 86573988 87799948 88910735
1270.7 88910735 90214831 91687644 92987013 93620068 93308473 92338192 91578299 91875744 93258053
1289.1 93258053 94976640 96305871 97074014 97574985 98178208 99020058 99971920 100842810 101538408
1307.4 101538408 102047074 102387607 102608931 102763426 102875614 102954626 102994931 102990830 102945983 102874780 102784503
1329.9 102784503 102642155 102389038 102008069 101520407 100947285 100277948 99443734 98343360 96802104
$$ packed form
1199.3G9563123n53775j42968O17707J248330J456905J266479Q72737M32718o825m54569
1219.7H4299862r35137j478606k121067k918095l921693n098826o293422p316196q028573
1238.1D6188247q267683p664984n814195k785259R47447N028249Q933744J1465827
1254.4D8031393J1627373R789842P230365M901177L112352J881486J225960J110787
1270.7H8910735J304096J472813J299369O33055l11595r70281p59893K97445J382309
1289.1I3258053J718587J329231P68143N00971O03223Q41850R51862Q70890O95598
1307.4A01538408N08666L40533K21324J54495J12188P9012M0305m101m4847p1203r0277
1329.9A02784503j42348k53117l80969m87662n73122o69337q34214j100374j541256
$$ plain form
1348.2 96802104 94574773 91504508 87828887 84569877 83255589 84787607 88673007 93098617
1364.5 93098617 96507895 98632252 99635202 99807560 99697036 99840868 100301027 100815535 101194334
1382.9 101194334 101440692 101669383 101903152 101952612 101613069 100880373 100058949 99539632 99319816 98972923
1403.3 98972923 98335338 97661716 96949476 96090633 95443642 95313358 95446247 95353013 94653237 93063933
1423.7 93063933 90326184 86274117 80965376 75298983 69874656 63194418 54084253 44548205
1440 44548205 37853482 38442883 48077208 62456697 74555522 81678265 85371143 87519085 89041591
1458.4 89041591 89951879 90440303 90767753 91000074 90996242 90529269 89267302 86833274 82689339 76013386
1478.8 76013386 66087908 53343552 39697579 27837321 22212875 26301613 36666664 46934864
$$ packed form
1348.2I6802104k227331l070265l675621l259010j314288J532018L885400M425610
1364.5I3098617L409278K124357J002950J72358j10524J43832M60159N14508L78799
1382.9A01194334K46358K28691K33769M9460l39543p32696q21424n19317k19816l46893
1403.3I8972923o37585o73622p12240q58843o46991j30284J32889r3234o99776j589304
1423.7I3063933k737749m052067n308741n666393n424327o680238r110165r536048
1440D4548205o694723N89401R634325J4379489J2098825P122743L692878K147942J522506
1458.4H9041591R10288M88424L27450K32321l832m66973j261967k434028m143935o675953
1478.8G6013386r925478j2744356j3645973j1860258n624446M088738J0365051J0268200
$$ plain form
1495.1 46934864 50702482 45044062 37120694 35423928 44346431 62053394 75773847 82990676
1511.4 82990676 87457216 90515757 92857939 94730240 96401662 97840416 98921376 99817282 100510991
1529.7 100510991 101028407 101528263 101944184 102168274 102413654 102875316 103399384 103893387 104311025 104668534
1550.1 104668534 104981589 105217671 105308914 105342031 105617845 105933475 106054151 106020510 105893242 105772030
1570.5 105772030 105665076 105459321 105231035 105126417 105059254 104976523 104911113 104857171 104794037 104716694 104614854
1593 104614854 104453278 104152131 103548217 102392745 100536489 98307180 96686918 96687859 98205698 100080705
1613.4 100080705 101593590 102681863 103226185 103235459 102785826 101915526 100669932 99284565 97925770
1631.7 97925770 95750183 91336811 86680359 85825109 89409339 94906503 99675953 102616298 103919578
$$ packed form
1495.1D6934864L767618n658420p923368j696766Q922503J7706963J3720453P216829
1511.4H2990676M466540L058541K342182J872301J671422J438754J080960Q95906O93709
1529.7A00510991N17416M99856M15921K24090K45380M61662N24068M94003M17638L57509
1550.1A04668534L13055K36082R1243L3117K75814L15630J20676l3641j27268j21212
1570.5A05772030j06954k05755k28286j04618o7163q2731o5410n3942o3134p7343j01840
1593A04614854j61576l01147o03914j155472j856256k229309j620262R41J517839J875007
1613.4A00080705J512885J088273N44322R274m49633q70300j245594j385367j358795
1631.7I7925770k175587m413372m656452q55250L584230N497164M769450K940345J303280
$$ plain form
1650.1 103919578 104549623 105182040 105722523 106028676 106181765 106285524 106402409 106446660 106401372 106412983
1670.5 106412983 106485927 106532264 106597984 106651258 106601429 106478727 106490278 106691086 106853354 106919885 106875515
1692.9 106875515 106709373 106519639 106356812 106278181 106282079 106231821 106172478 106141484 106069410 105938399 105792308
1715.4 105792308 105774045 105959857 106177914 106338561 106477475 106589115 106644475 106635785 106655908 106821656
1735.8 106821656 106967068 107011843 107027841 106998897 106877780 106674814 106460714 106337595 106299305 106303966 106381893
1758.2 106381893 106518090 106705403 106915104 107058585 107140899 107210040 107326555 107509243 107657397 107727313
1778.6 107727313 107768178 107819247 107873452 107915270 107904148 107832265 107804334 107852602 107873058 107831061 107778966
1801 107778966 107748985 107701170 107599103 107450938 107291973 107140851 106973898 106780350 106566870 106314445
$$ packed form
1650.1A03919578O30045O32417N40483L06153J53089J03759J16885M4251m5288J1611
1670.5A06412983P2944M6337O5720N3274m9829j22702J1551K00808J62268O6531m4370
1692.9A06875515j66142j89734j62827p8631L898n0258n9343l0994p2074j31011j46091
1715.4A05792308j8263J85812K18057J60647J38914J11640N5360q690K0123J65748
1735.8A06821656J45412M4775J5998k8944j21117k02966k14100j23119l8290M661P7927
1758.2A06381893J36197J87313K09701J43481Q2314O9141J16515J82688J48154O9916
1778.6A07727313M0865N1069N4205M1818j1122p1883k7931M8268K0456m1997n2095
1801A07778966k9981m7815j02067j48165j58965j51122j66953j93548k13480k52425
$$ plain form
1821.4 106314445 106017733 105724895 105460179 105206227 104993927 104812980 104621112 104446328 104309225 104182410
1841.8 104182410 104105353 104163456 104308975 104478109 104654717 104817057 104949200 105044663 105111277 105165088
1862.2 105165088 105214584 105278587 105437112 105740464 106109667 106471539 106801784 107090306 107351005 107596898
1882.6 107596898 107822895 108011079 108161879 108304179 108429849 108520055 108597744 108665395 108705676 108728254
1903 108728254 108745027 108754194 108765996 108795059 108830523 108846748 108851469 108880413 108921778 108958471 109001935 109041512
1927.5 109041512 109064376 109075475 109085345 109097731 109106171 109093201 109059989 109039903 109030008 109005749 108970463 108924687
1952 108924687 108870196 108818603 108776081 108745694 108728611 108721149 108721244 108739245 108774161 108804846 108820951 108830702 108841348
1978.5 108841348 108844304 108837891 108832729 108827376 108810282 108781064 108763754 108768511 108778811 108792138 108816206 108853889
$$ packed form
1821.4A06314445k96712k92838k64716k53952k12300j80947j91868j74784j37103j26815
1841.8A04182410p7057N8103J45519J69134J76608J62340J32143R5463O6614N3811
1862.2A05165088M9496O4003J58525L03352L69203L61872L30245K88522K60699K45893
1882.6A07596898K25997J88184J50800J42300J25670R0206P7689O7651M0281K2578
1903A08728254J6773R167J1802K9063L5464J6225M721K8944M1365L6693M3464L9577
1927.5A09041512K2864J1099R870J2386Q440j2970l3212k0086r895k4259l5286m5776
1952A08924687n4491n1593m2522l0387j7083p462R5J8001L4916L0685J6105R751J0646
1978.5A08841348K956o413n162n353j7094k9218j7310M757J0300J3327K4068L7683
$$ plain form
2003 108853889 108902693 108951712 108984721 108996534 108994269 108980548 108958709 108933091 108905602 108876920 108837032 108777583
2027.4 108777583 108708072 108645368 108600163 108567417 108531535 108486295 108428288 108356869 108291566 108252144 108243823 108262563
2051.9 108262563 108296704 108344400 108412886 108496475 108587050 108685207 108786881 108880651 108956397 109018326 109081423
2074.3 109081423 109151816 109227264 109302878 109375203 109439886 109485912 109512544 109537745 109566045 109580553 109580076 109575284
2098.8 109575284 109569955 109569156 109577775 109594989 109608877 109608984 109598553 109583247 109565318 109547639 109532881 109517038 109498262
2125.3 109498262 109475696 109451079 109434772 109432447 109441161 109455061 109476423 109502423 109520078 109528232 109534645 109538484
2149.8 109538484 109530985 109513724 109490466 109465957 109448195 109429204 109405267 109391582 109390616 109388351 109385240 109389639 109399343
2176.3 109399343 109413314 109424019 109417593 109399533 109379756 109355628 109325218 109294248 109271932 109256899 109241855 109228349
$$ packed form
2003A08853889M8804M9019L3009J1813k265j3721k1839k5618k7489k8682l9888n9449
2027.4A08777583o9511o2704m5205l2746l5882m5240n8007p1419o5303l9422q321J8740
2051.9A08262563L4141M7696O8486Q3589R0575R8157J01674R3770P5746O1929O3097
2074.3A09081423P0393P5448P5614P2325O4683M6026K6632K5201K8300J4508m77m792
2098.8A09575284n329p99Q619J7214J3888J07j0431j5306j7929j7679j4758j5843j8776
2125.3A09498262k2566k4617j6307k325Q714J3900K1362K6000J7655Q154O413L839
2149.8A09538484p499j7261k3258k4509j7762j8991k3937j3685r66k265l111M399R704
2176.3A09399343J3971J0705o426j8060j9777k4128l0410l0970k2316j5033j5044j3506
$$ plain form
2200.8 109228349 109222615 109226334 109234691 109241748 109238613 109215164 109179842 109162354 109185302 109243965 109315169 109373128
2225.3 109373128 109408462 109434867 109462154 109482217 109484529 109471703 109454012 109432578 109410751 109393692 109375024 109354711
2249.7 109354711 109346592 109356475 109374917 109390807 109400678 109417033 109446692 109470236 109473228 109457433 109427810 109397876
2274.2 109397876 109373736 109341192 109302592 109270072 109228444 109165061 109086716 108995008 108887863 108776832 108679020
2296.7 108679020 108602858 108557642 108547461 108551741 108555567 108573115 108621490 108705127 108805251 108886921 108925736 108926654
2321.1 108926654 108927870 108955491 109001040 109047198 109075260 109091640 109127295 109174848 109204578 109230340 109269488 109286749
2345.6 109286749 109272873 109266293 109297919 109387875 109491241 109526920 109518242 109526956 109547448 109564996 109565330 109527111
2370.1 109527111 109464824 109403765 109347594 109294724 109266150 109275246 109304845 109344602 109392357 109435916 109471953 109517610
$$ packed form
2200.8A09228349n734L719Q357P057l135k3449l5322j7488K2948N8663P1204N7959
2225.3A09373128L5334K6405K7287K0063K312j2826j7691k1434k1827j7059j8668k0313
2249.7A09354711q119R883J8442J5890R871J6355K9659K3544K992j5795k9623k9934
2274.2A09397876k4140l2544l8600l2520m1628o3383p8345r1708j07145j11031r7812
2296.7A08679020p6162m5216j0181M280L826J7548M8375Q3637J00124Q1670L8815R18
2321.1A08926654J216K7621M5549M6158K8062J6380L5655M7553K9730K5762L9148J7261
2345.6A09286749j3876o580L1626Q9956J03366L5679q678Q714K0492J7548L34l8219
2370.1A09527111o2287o1059n6171n2870k8574R096K9599L9757M7755M3559L6037M5657
$$ plain form
2394.5 109517610 109577334 109630764 109666872 109695923 109723997 109748900 109770143 109782171 109782708 109773481 109759045 109749961
2419 109749961 109745395 109732711 109719872 109728670 109745944 109750915 109753668 109767675 109789169 109806323 109812641 109806037 109796166
2445.5 109796166 109800828 109817290 109837461 109863448 109885836 109908593 109945345 109981215 110010731 110042024 110069323 110094821
2470 110094821 110125601 110156274 110170758 110162461 110147309 110132790 110121679 110116732 110111463 110117269 110143960 110169518 110171878
2496.5 110171878 110167003 110173166 110170710 110141349 110099483 110063601 110027313 109978044 109918833 109861767 109804463 109738469
2521 109738469 109669888 109601700 109526134 109438050 109352493 109287596 109240127 109201956 109171796 109158027 109159684 109163642
2545.5 109163642 109176648 109203160 109225893 109244037 109268868 109295702 109322476 109356081 109395051 109431267 109457219
2567.9 109457219 109467757 109466112 109460068 109450150 109434104 109410858 109390700 109386265 109383988 109362411 109314859 109249067
$$ packed form
2394.5A09517610N9724N3430L6108K9051K8074K4903K1243J2028N37r227j4436r084
2419A09749961m566j2684j2839Q798J7274M971K753J4007K1494J7154O318o604r871
2445.5A09796166M662J6462K0171K5987K2388K2757L6752L5870K9516L1293K7299K5498
2470A10094821L0780L0673J4484q297j5152j4519j1111m947n269N806K6691K5558K360
2496.5A10171878m875O163k456k9361m1866l5882l6288m9269n9211n7066n7304o5994
2521A09738469o8581o8188p5566q8084q5557o4897m7469l8171l0160j3769J657L958
2545.5A09163642J3006K6512K2733J8144K4831K6834K6774L3605L8970L6216K5952
2567.9A09457219J0538j645o044r918j6046k3246k0158m435k277k1577m7552o5792
$$ plain form
2592.4 109249067 109172177 109081507 108976686 108854043 108725905 108641911 108647108 108746064 108909070 109097004 109276295
2614.8 109276295 109422040 109534633 109626961 109697318 109742320 109769428 109790432 109811068 109827352 109836364 109845150
2637.3 109845150 109851134 109846509 109840226 109836352 109829497 109826005 109823990 109814346 109800220 109775090 109738433 109698820 109647846
2663.8 109647846 109583890 109513927 109437311 109350801 109257066 109161270 109063435 108964801 108884680 108850598 108875442
2686.2 108875442 108952379 109051371 109144115 109220469 109270084 109291220 109300625 109306085 109296358 109267020 109234560 109206188
2710.7 109206188 109171379 109130645 109076607 108987677 108868742 108742642 108619797 108525848 108489192 108496809 108534026
2733.1 108534026 108592701 108652902 108700502 108721638 108708119 108668077 108609855 108531141 108420038 108252513 108016920
2755.6 108016920 107725167 107362604 106872368 106201077 105320024 104232955 103019202 101860535 101010656
$$ packed form
2592.4A09249067p6890r0670j04821j22643j28138q3994N197R8956J63006J87934J79291
2614.8A09276295J45745J12593R2328P0357M5002K7108K1004K0636J6284R012Q786
2637.3A09845150N984m625o283l874o855l492k015r644j4126k5130l6657l9613n0974
2663.8A09647846o3956o9963p6616q6510r3735r5796r7835r8634q0121l4082K4844
2686.2A08875442P6937R8992R2744P6354M9615K1136R405N460r727k9338l2460k8372
2710.7A09206188l4809m0734n4038q8930j18935j26100j22845r3949l6656P617L7217
2733.1A08534026N8675O0201M7600K1136j3519m0042n8222p8714j11103j67525k35593
2755.6A08016920k91753l62563m90236o71291q81053j087069j213753j158667q49879
$$ plain form
2773.9 101010656 100694430 100962830 101674676 102624154 103621244 104511952 105215991 105734062 106091213 106297982
2794.3 106297982 106364286 106318510 106204200 106042767 105838406 105604005 105352807 105102372 104851687 104561985
2814.7 104561985 104200017 103744078 103155708 102395117 101435566 100282705 99015069 97781664 96728510
2833.1 96728510 95908874 95282632 94805133 94435847 94059873 93528467 92779207 91866297 90922147 90099120
2853.4 90099120 89483666 89035952 88637751 88155776 87479055 86554945 85384214 84014839 82559025
2871.8 82559025 81174850 79942292 78822637 77795124 76890606 76108378 75403136 74731028 74085867
2890.2 74085867 73508614 73069936 72841662 72858137 73098725 73532784 74129379 74832159 75582534 76328331
2910.6 76328331 77026135 77671599 78282231 78856832 79400486 79961443 80620909 81432253 82380766 83431655
$$ packed form
2773.9A01010656l16226K68400P11846R49478R97090Q90708P04039N18071L57151K06769
2794.3A06297982O6304m5776j14310j61433k04361k34401k51198k50435k50685k89702
2814.7A04561985l61968m55939n88370p60591r59551j152861j267636j233405j053154
2833.1I6728510q19636o26242m77499l69286l75974n31406p49260r12910r44150q23027
2853.4I0099120o15454m47714l98201m81975o76721r24110j170731j369375j455814
2871.8H2559025j384175j232558j119655j027513r04518p82228p05242o72108o45161
2890.2G4085867n77253m38678k28274J6475K40588M34059N96595P02780P50375P45797
2910.6G6328331O97804O45464O10632N74601N43654N60957O59466Q11344R48513J050889
$$ plain form
2931 83431655 84533334 85613692 86632299 87559354 88350064 88987356 89489889 89870119 90097964 90143257
2951.3 90143257 90055150 89900428 89711744 89528519 89380407 89276105 89190328 89022601 88604498 87777191
2971.7 87777191 86632133 85689384 85577089 86550540 88337457 90303558 91875482 92865157 93391228
2990.1 93391228 93732071 94117928 94469404 94596142 94455230 94110370 93764549 93647188 93819296 94255531
3010.5 94255531 94953114 95886225 96930152 97899675 98682255 99257582 99657857 99938816 100104988 100159609
3030.9 100159609 100184631 100309134 100609684 101036465 101513886 102007473 102461708 102785337 102891159 102757251
3051.3 102757251 102417850 101921916 101364994 100876760 100526738 100265527 99954957 99451792 98674965 97648758
3071.7 97648758 96545053 95662683 95320338 95718205 96828890 98418385 100194108 101907730 103400540
$$ packed form
2931H3431655J101679J080358J018607R27055P90710O37292N02533L80230K27845M5293
2951.3I0143257q8107j54722j88684j83225j48112j04302q5777j67727m18103q27307
2971.7H7777191j145058r42749j12295R73451J786917J966101J571924R89675N26071
2990.1I3391228L40843L85857L51476J26738j40912l44860l45821j17361J72108M36235
3010.5I4255531O97583R33111J043927R69523P82580N75327M00275K80959J66172N4621
3030.9A00159609K5022J24503L00550M26781M77421M93587M54235L23629J05822j33908
3051.3A02757251l39401m95934n56922m88234l50022k61211l10570n03165p76827j026207
3071.7I7648758j103705q82370l42345L97867J110685J589495J775723J713622J492810
$$ plain form
3090 103400540 104619098 105560577 106250548 106748629 107125139 107426822 107661533 107828689 107953727 108066750
3110.4 108066750 108156145 108205485 108254564 108344615 108474231 108628297 108771598 108873487 108950901 109030962 109116220
3132.9 109116220 109188926 109225750 109247518 109303951 109386647 109454310 109503496 109532344 109535110 109555531 109615433 109671974
3157.3 109671974 109707272 109739459 109775853 109806561 109828651 109849381 109872162 109900439 109926176 109944749 109964621
3179.8 109964621 109973752 109966469 109965682 109982038 110013843 110051572 110076463 110083437 110089278 110115790 110155463 110184979 110199714
3206.3 110199714 110209727 110222340 110241759 110273552 110307240 110321116 110316944 110307503 110295928 110287607 110278523 110248613
3230.8 110248613 110210538 110213029 110251880 110283232 110292351 110272098 110222089 110183477 110195935 110228539 110238922 110235655
3255.2 110235655 110250115 110292757 110337162 110369825 110394490 110387480 110345507 110348332 110449553 110591340 110693729
$$ packed form
3090A03400540J218558R41479O89971M98081L76510L01683K34711J67156J25038J13023
3110.4A08066750Q9395M9340M9079R0051J29616J54066J43301J01889P7414Q0061Q5258
3132.9A09116220P2706L6824K1768N6433Q2696O7663M9186K8848K766K0421N9902N6541
3157.3A09671974L5298L2187L6394L0708K2090K0730K2781K8277K5737J8573J9872
3179.8A09964621R131p283p87J6356L1805L7729K4891O974N841K6512L9673K9516J4735
3206.3A10199714J0013J2613J9419L1793L3688J3876m172r441j1575q321r084k9910
3230.8A10248613l8075K491L8851L1352R119k0253n0009l8612J2458L2604J0383l267
3255.2A10235655J4460M2642M4405L2663K4665p010m1973K825J01221J41787J02389
$$ plain form
3277.7 110693729 110728931 110722196 110693383 110640872 110572374 110496020 110433137 110409451 110419476 110448122 110478699 110466278
3302.1 110466278 110397387 110337603 110346711 110413575 110483587 110521901 110533977 110527718 110512233 110498571 110490966 110506654
3326.6 110506654 110543048 110565114 110561943 110535586 110491753 110467303 110472167 110481906 110499048 110514021 110500717 110493100
3351.1 110493100 110524487 110560274 110572684 110562181 110545552 110535669 110504925 110455406 110445726 110496187 110552204 110576236
3375.6 110576236 110591316 110609341 110617936 110621023 110627615 110610628 110549045 110498667 110511863 110543025 110525846 110483730
3400 110483730 110501266 110581052 110628986 110617685 110599709 110600162 110618579 110643637 110650063 110641873 110642219 110636497 110603297
3426.6 110603297 110563624 110547280 110539925 110518467 110514677 110554314 110597146 110605061 110584986 110567415 110576296 110592389
3451 110592389 110587490 110568094 110546696 110524333 110505748 110483670 110439491 110391569 110389841 110435092 110478938 110507274
$$ packed form
3277.7A10693729L5202o735k8813n2511o8498p6354o2883k3686J0025K8646L0577j2421
3302.1A10466278o8891n9784R108O6864P0012L8314J2076o259j5485j3662p605J5688
3326.6A10506654L6394K2066l171k6357m3833k4450M864R739J7142J4973j3304p617
3351.1A10493100L1387L5787J2410j0503j6629r883l0744m9519r680N0461N6017K4032
3375.6A10576236J5080J8025Q595L087O592j6987o1583n0378J3196L1162j7179m2116
3400A10483730J7536P9786M7934j1301j7976M53J8417K5058O426q190L46n722l3200
3426.6A10603297l9673j6344p355k1458l790L9637M2832P915k0075j7571Q881J6093
3451A10592389m899j9396k1398k2363j8585k2078m4179m7922j728M5251M3846K8336
$$ plain form
3475.5 110507274 110508299 110478199 110471296 110490263 110490739 110483074 110483789 110484183 110479867 110471761 110469246 110462868 110440195 110447776
3504.1 110447776 110496283 110528338 110529208 110518813 110522342 110540736 110535836 110492325 110433269 110397923 110396969 110397458 110386026
3530.6 110386026 110362053 110312307 110266685 110253370 110220170 110122788 110011554 109974229 109991539 109979665 109947526
3553 109947526 109926867 109904611 109868753 109814215 109748209 109682930 109653246 109696281 109771502 109824920 109851861 109870791
3577.5 109870791 109884429 109879661 109852374 109830809 109878516 109985220 110075307 110151577 110221922 110256815 110288930
3599.9 110288930 110361552 110422969 110421324 110405922 110428250 110452545 110468495 110495579 110528624 110586691 110654831 110661983
3624.4 110661983 110578346 110507834 110583067 110698628 110754204 110784304 110802341 110784364 110733962 110641432 110487461
3646.8 110487461 110367179 110432708 110578740 110630000 110613465 110618150 110650563 110692763 110687578 110595334 110491407
$$ packed form
3475.5A10507274J025l0100o903J8967M76p665P15L94m316q106k515o378k2673P581
3504.1A10447776M8507L2055Q70j0395L529J8394m900m3511n9056l5346r54M89j1432
3530.6A10386026k3973m9746m5622j3315l3200r7382j11234l7325J7310j1874l2139
3553A09947526k0659k2256l5858n4538o6006o5279k9684M3035P5221N3418K6941J8930
3577.5A09870791J3638m768k7287k1565M7707J06704R0087P6270P0345L4893L2115
3599.9A10288930P2622O1417j645j5402K2328K4295J5950K7084L3045N8067O8140P152
3624.4A10661983q3637p0512P5233J15561N5576L0100J8037j7977n0402r2530j53971
3646.8A10487461j20282O5529J46032N1260j6535M685L2413M2200n185r2244j03927
$$ plain form
3669.3 110491407 110460031 110447705 110454857 110554981 110679948 110762835 110785508 110714030 110574794 110539246 110677731
3691.7 110677731 110821962 110886872 110905886 110901201 110897744 110923827 110935307 110878384 110795593 110792375 110867476 110922909
3716.2 110922909 110922527 110889435 110856032 110844374 110858679 110875022 110841858 110724592 110604405 110622621 110721028
3738.6 110721028 110737360 110658622 110593820 110592151 110592973 110612285 110694730 110771441 110781777 110770786 110808420 110860193
3763.1 110860193 110854363 110798264 110771084 110822415 110888386 110888815 110829055 110788071 110812056 110834444 110821378 110818374
3787.6 110818374 110827446 110811889 110759056 110681605 110611808 110554862 110506856 110493660 110511005 110563481 110623956 110620463
3812 110620463 110546970 110477078 110438454 110401809 110419655 110483003 110528672 110553241 110547769 110510695 110435557 110332811
3836.5 110332811 110293281 110350537 110425639 110489857 110533857 110509229 110403562 110313988 110372150 110484684 110532653
$$ packed form
3669.3A10491407l1376j2326P152J00124J24967Q2887K2673p1478j39236l5548J38485
3691.7A10677731J44231O4910J9014m685l457K6083J1480n6923q2791l218P5101N5433
3716.2A10922909l82l3092l3403j1658J4305J6343l3164j17266j20187J8216R8407
3738.6A10721028J6332p8738o4802j669Q22J9312Q2445P6711J0336j0991L7634N1773
3763.1A10860193n830n6099k7180N1331O5971M29n9760m0984K3985K2388j3066l004
3787.6A10818374R072j5557n2833p7451o9797n6946m8006j3196J7345N2476O0475l493
3812A10620463p3493o9892l8624l6645J7846O3348M5669K4569n472l7074p5138j02746
3836.5A10332811l9530N7256P5102O4218M4000k4628j05667q9574N8162J12534M7969
$$ plain form
3858.9 110532653 110511780 110474229 110477304 110494816 110482979 110467768 110475636 110502112 110504305 110453463 110429835 110448015
3883.4 110448015 110455513 110478401 110493779 110495591 110520470 110507119 110419405 110332108 110299373 110305870 110350180 110401487
3907.9 110401487 110411513 110395467 110375917 110348773 110333002 110340464 110348535 110337210 110317945 110305440 110290551 110293019
3932.4 110293019 110333574 110379755 110405529 110408354 110403907 110414255 110423636 110417056 110416389 110429657 110443819 110462809 110488212
3958.9 110488212 110501742 110495305 110480762 110470426 110466373 110466433 110464585 110463357 110465002 110456276 110443628 110443938 110462892 110489845
3987.4 110489845 110502875 110503280 110495806 110485268 110487318
3997.6 110487318
$$ packed form
3858.9A10532653k0873l7551L075J7512j1837j5211P868K6476K193n0842k3628J8180
3883.4A10448015P498K2888J5378J812K4879j3351q7714q7297l2735O497M4310N1307
3907.9A10401487J0026j6046j9550k7144j5771P462Q071j1325j9265j2505j4889K468
3932.4A10293019M0555M6181K5774K825m447J0348R381o580o67J3268J4162J8990K5403
3958.9A10488212J3530o437j4543j0336m053O0j848j228J645q726j2648L10J8954K6953
3987.4A10489845J3030M05p474j0538K050
3997.6A10487318
##END=$$ End of the data block
