##TITLE=Old Pine Plank $$ Begin of the data block
##JCAMP-DX=5.00 $$ ACD/SpecManager v 10.08
##SPECTROMETER/DATA SYSTEM=Alpha
##DATE=20 Feb 2015 13:16:36
##DATA TYPE=INFRARED SPECTRUM
##DATA CLASS=XYDATA
##ORIGIN=
##OWNER=
##NPOINTS=1667
##FIRSTX=599.57470703
##LASTX=3997.16503906
##MAXX=3997.16503906
##MINX=599.57470703
##MAXY=0.02938630
##MINY=0.02165762
##XFACTOR=1.0000000000
##YFACTOR=1.000000000000000e-10
##FIRSTY=0.02716897
##DELTAX=2.03937006
##XUNITS=1/CM
##YUNITS=ABSORBANCE
##XYDATA=(X++(Y..Y))
599.6B71689743n82803r47733j106150q68552j755263k990254j458879K42796l72026
617.9B61850879l08752P27791P57892M35933o3814j673047j337379M39249m39249j830142
638.3B58559361j861229j285039O035N62574k8833p37440r61013m66574j71252K26963
658.7B53843553M31985q75723j844223q65869j17924j511574j201388M71417P89724
677.1B49119978j20066m38597o92885j301617j179054j08462J149159J483001P10990
695.4B48622447m66238j017824m31016j14795n85746l82960j75294j112762j175721
713.8B43160091J48658N08986k67494m57205o5155N5022p1190J57151R00235Q01832
734.2B44870931j93082k70828L00128J95559j59406n02783n67623n2024M4089o1337
$$ plain form
599.6 271689743 271106940 270159207 269053057 268184505 266429242 263438988 261980109 262222905 261850879
617.9 261850879 261542127 262269918 263027810 263463743 263399929 261726882 260389503 260828752 260389503 258559361
638.3 258559361 256698132 255413093 255419128 255981702 255952869 255215429 254254416 253787842 253616590 253843553
658.7 253843553 254275538 253399815 251555592 250689723 250571799 249060225 247858837 248330254 249119978
677.1 249119978 248999912 248561315 247868430 246566813 245387759 245279297 246428456 247911457 248622447
695.4 248622447 248156209 247138385 246707369 246592574 246006828 245623868 245448574 244335812 243160091
713.8 243160091 243308749 243817735 243550241 243093036 243027881 243082903 243011713 243168864 244069099 244870931
734.2 244870931 244677849 244407021 244707149 244902708 244743302 244240519 243672896 243620872 243664961 243603624
754.6B43603624p5847l04710q3223J42623l03332j07567J349505K164095J075473J15372
775B47576013J046974J858045J292080N92283O08825J485217K459493K521891J344215
793.3B60785036L48016J543034L684070M149471L282949J510847j746025m618372o175228
811.7B62763798p948614r571761j0225717r248536n993825k752058m47072J405328
828B17981543J846888K330150L557149L645216K431646J483466J952332K871342L019366
846.3B41119098K873875K427548J581107J448430K264902K153292O79307J19954J040436
864.7B55707949J955312J525302J25300q6837P03503P39060O80648J065433O03888
883B63019558l34680m90565l89069k27932M73466O34659Q8271K05710J58958m93098
$$ plain form
754.6 243603624 243527777 243223067 243139844 243282467 242979135 242871568 244221073 246385168 247460641 247576013
775 247576013 248622987 250481032 251773112 252365395 252974220 254459437 256918930 259440821 260785036
793.3 260785036 261133052 262676086 266360156 270509627 273792576 275303423 273557398 268939026 262763798
811.7 262763798 254815184 245243423 235017706 225769170 219775345 217023287 216576215 217981543
828 217981543 219828431 222158581 225715730 229360946 231792592 233276058 235228390 238099732 241119098
846.3 241119098 243992973 246420521 248001628 249450058 251714960 253868252 254547559 254667513 255707949
864.7 255707949 257663261 259188563 259313863 259227026 259930529 260669589 261350237 262415670 263019558
883 263019558 262684878 262194313 261805244 261577312 262050778 262685437 262773708 262979418 263138376 262645278
903.4B62645278o49225k07312P63032J575444J301933N30016M22467Q34856J137089
921.8B68353578J185033J035202J082030J485292J577623R13981Q09897J190547N45308
940.1B78178491l0902K59430L30656j63689l57125J56202P28145O60326K25306L15308
960.5B80302148N30184Q7525k12900K16775K86661j58530l43528m37107l33264l07281
980.9B79630683m90844k2352M86412M5001o19199j020935j203082j067854r27225o36708
1001.3B74173897l16259m35598p83410q99564n18598l61782p36937j099817j016948
1019.7B68004984m16842n90775j827702k398155j592264m37088j8962j77845l92218
1038B60153133o23278l72622M22075L93261n43576o41048L79737R46988O9253j002234
$$ plain form
903.4 262645278 261996053 261788741 262551773 264127217 265429150 265959166 266381633 267216489 268353578
921.8 268353578 269538611 270573813 271655843 273141135 274718758 275632739 276442636 277633183 278178491
940.1 278178491 278147589 278407019 278737675 278573986 278216861 278373063 279101208 279761534 279986840 280302148
960.5 280302148 280832332 280919857 280706957 280923732 281210393 281051863 280708335 280271228 279937964 279630683
980.9 279630683 279139839 279117487 279603899 279648900 279029701 278008766 276805684 275737830 274810605 274173897
1001.3 274173897 273857638 273422040 272638630 271739066 271220468 270858686 270121749 269021932 268004984
1019.7 268004984 267588142 266997367 265169665 262771510 261179246 260742158 260723196 260545351 260153133
1038 260153133 259529855 259157233 259579308 259972569 259428993 258787945 259167682 260114670 260183923 259181689
1058.4B59181689q62441m68102n19976k89474p9926l51797o41719o19125j73784L37958
1078.8B55513303K98712j19712J23549Q27630N54211n7127J87866L60645Q9538L89255
1099.2B58167870J035519R42052L06740J55848L90596J96286l48296l49358J18185
1117.6B60615442J8962j85259r611q5198j14347p9144k34992J73413R21637J158285
1138B62179188R31956N26440M66797P45021O75228L42894Q6408k20984m64507k84500
1158.4B64983941k7511l16967p49360r00236j247320j594350j499001j011211l70536
1176.7B57267449l70499q45510q90102o18734l63123j16638j93492m06709k65352L856
1197.1B53201146J30608j75889p25724o37546J37705L14657k18097j89282K25491N27297
$$ plain form
1058.4 259181689 258319248 257851146 257331170 257041696 256961770 256609973 255968254 255349129 255175345 255513303
1078.8 255513303 255812015 255692303 255815852 256643482 257197693 257140566 257328432 257689077 257778615 258167870
1099.2 258167870 259203389 260145441 260452181 260608029 260998625 261194911 260846615 260497257 260615442
1117.6 260615442 260634404 260449145 260439534 260354336 260239989 260160845 259925853 260099266 261020903 262179188
1138 262179188 263111144 263637584 264104381 264849402 265524630 265867524 265953932 265732948 265268441 264983941
1158.4 264983941 264956430 264639463 263890103 262989867 261742547 260148197 258649196 257637985 257267449
1176.7 257267449 256896950 256051440 255161338 254542604 254179481 254062843 253869351 253462642 253197290 253201146
1197.1 253201146 253331754 253155865 252430141 251792595 251930300 252244957 252026860 251837578 252063069 252590366
1217.5B52590366Q32770P93133L41981K45404O98399J221895J651626J828130J922138
1235.9B62125842J791753J176950Q48379R05804Q00807Q19974R25325P76499O12140
1254.2B70783473O07278Q87644R63918L40734l4179M64823J054480J042318O17672
1272.6B76728161K83345K25976L81079M39044K1532k63825N0776L91882N53950O60010
1293B79471930N64866M31854N71069P36881N89471L60794O32424R03085M98872J21631
1313.4B84882877K88300M67468J78591l8985l6769k08169l11826m57465p32690n80028
1333.8B83451304J71047O35888m02667k088379k198349j259260p93133o76550n38510
1352.1B76301391n07291p54893n95376N66151O80127j271368k041123j272597n62053
$$ plain form
1217.5 252590366 253423136 254216269 254558250 254803654 255502053 256723948 258375574 260203704 262125842
1235.9 262125842 263917595 265094545 265942924 266848728 267649535 268469509 269394834 270171333 270783473
1254.2 270783473 271390751 272278395 273242313 273583047 273548868 274013691 275068171 276110489 276728161
1272.6 276728161 277011506 277237482 277618561 278057605 278079137 277815312 277866088 278257970 278811920 279471930
1293 279471930 280036796 280468650 281039719 281776600 282366071 282726865 283359289 284262374 284761246 284882877
1313.4 284882877 285171177 285638645 285817236 285778251 285741482 285533313 285221487 284764022 284031332 283451304
1333.8 283451304 283622351 284258239 283855572 281767193 279568844 278309584 277516451 276839901 276301391
1352.1 276301391 275794100 275039207 274443831 275009982 275690109 274418741 272377618 271105021 270542968
1370.5B70542968K50973K80756p94548j250506q56965l21046O01895J484212M72702
1388.8B70410441p04918M77657J705531R56934l1163o70310j59014Q18298L21976J21277
1409.2B73246709R67998J572781K022571K880879K366361J53612j60244Q8141L33227
1427.6B83472035J289770J192018R95156K051312P45971j511462q89525k57473j28038
1445.9B86959764K12378m2300j02334R42852L577713K314952l437642l345609m01810
1464.3B86677964J02595q50801N70696K704021J068133j752600k317074j581815q05892
1482.6B83815227j80434J252778K396572L3751k587605j091640J167115J19954j673363
1501B83252355j307540K307333O110948k8778m514326l006924m25446L44757K6803
$$ plain form
1370.5 270542968 270793941 271074697 270280149 269029643 268172678 267851632 268453527 269937739 270410441
1388.8 270410441 269705523 270183180 271888711 272845645 272814482 272144172 271985158 272803456 273125432 273246709
1409.2 273246709 274214707 275787488 277810059 280690938 283057299 283210911 283050667 283138808 283472035
1427.6 283472035 284761805 285953823 286948979 289000291 289746262 288234800 287345275 287087802 286959764
1445.9 286959764 287172142 287129842 287027508 287970360 291548073 293863025 290425383 287079774 286677964
1464.3 286677964 286780559 285929758 286500454 289204475 290272608 288520008 286202934 284621119 283815227
1482.6 283815227 283634793 284887571 287284143 287317894 284730289 283638649 284805764 284925718 283252355
1501 283252355 281944815 284252148 290363096 290334318 285819992 282813068 282387622 282732379 282759182
1519.3B82759182N54808j02520o79642o91712j269579l13670R53526m84102l35239
1537.7B80391052L898126L461278j499969k670419j279748K26534j55530n93085L03853
1556.1B82082092K876241N18858m691258l451872j413078o25290m70765j249592q28114
1574.4B72747222K10330j589954k663750j374483m26415m61322o12363p92220p20825
1592.8B64316220p90861j452304j574159q89078n24576o25607p95014j120009j329463
1611.1B55215149j144893l13148K62372p52769p98162j70637q27890j055077o62748
1629.5B49752197r23890j01440J817234L06331j806934j619309n55441J368299P82051
1647.8B49019098j674109M40404J773778l490429l806781j271199r6578p31890p58282
$$ plain form
1519.3 282759182 283313990 283211470 282531828 281840116 280570537 280256867 281210393 280726291 280391052
1537.7 280391052 284289178 287750456 286250487 283580068 282300320 282526854 282371324 281778239 282082092
1556.1 282082092 284958333 285477191 280785933 277334061 275920983 275295693 274824928 273575336 272747222
1574.4 272747222 272957552 271367598 268703848 267329365 266902950 266441628 265829265 265037045 264316220
1592.8 264316220 263525359 262073055 260498896 259609818 259085242 258459635 257664621 256544612 255215149
1611.1 255215149 254070256 253757108 254019480 253266711 252468549 252297912 251470022 250414945 249752197
1629.5 249752197 248828307 248726867 250544101 250850432 249043498 247424189 246868748 248237047 249019098
1647.8 249019098 247344989 247785393 249559171 246068742 242261961 240990762 240894184 240162294 239404012
1666.2B39404012N76898Q14758n95078o63921l97712m87920R8180R11914O08135j158751
1686.6B39110515j530853j460872j079496O97672J730602J332797M99432j361669j290980
1704.9B36647148r52818j300145n98579N87646J648608J439806j401529k305116j036301
1723.3B32728720m62346J52104J128818J210273J331418J87774r46448o277O61370
1741.6B35985406K97371K31806R07872R46634q97143j758486q34838p44537o41141
1760B33492944L07318r8627j94758N62742O24024M68064m60148j151245k64961O23352
1780.4B33908705J86600m45843n26364J10082J418106J521614r0190n94444L06088
1798.7B35794354N83548p28927j355056m89298M12799M53275k12845l49171q2776k76733
$$ plain form
1666.2 239404012 239980910 240795668 240200590 239536669 239138957 238651037 238749217 239661131 240269266 239110515
1686.6 239110515 237579662 236118790 235039294 235736966 237467568 238800365 239299797 237938128 236647148
1704.9 236647148 235694330 234394185 233795606 234383252 236031860 237471666 236070137 233765021 232728720
1723.3 232728720 232266374 232418478 233547296 234757569 236088987 236276761 235330313 235324036 235985406
1741.6 235985406 236282777 236514583 237422455 238369089 237471946 235713460 234878622 234134085 233492944
1760 233492944 233800262 233701635 233506877 234069619 234693643 235161707 234701559 233550314 233285353 233908705
1780.4 233908705 234095305 233649462 233123098 233233180 234651286 236172900 236082710 235488266 235794354
1798.7 235794354 236377902 235648975 234293919 233804621 234217420 234670695 234457850 234108679 234025903 233749170
1819.1B33749170p2941J053475J381710M41707O3405n57862j235232o59023J2853K48067
1839.5B34425329Q41859J518839O51199p41147q58269n03119l66718k42907k2687P8417
1859.9B34780796J97012M64283J164600J691580J79931j410339j005921k27411o9141
1878.3B35765390o277K77124K66228K50917O26855L50214j49272p1097k51234l11099
1898.7B36747749Q0913K08859K70381M82034L90746p2196l66401k8443M74137K79210
1919.1B38466989J58884K13869l45949l11211J92802k5443k70438L0343K91522N44489
1939.5B38945857P24569K2445p11717n60098k66898m5132M14308O80443L01711j57281
1959.9B39348207j24723L04710O74594K42666l69605r7938L31570L95346J74027k42144
$$ plain form
1819.1 233749170 233676229 234729704 236111414 236553121 236616526 236058664 234823432 234164409 234177262 234425329
1839.5 234425329 235267188 236786027 237437226 236696079 235837810 235334691 234967973 234725066 234702379 234780796
1859.9 234780796 234977808 235442091 236606691 238298271 238478202 237067863 236061942 235834531 235765390
1878.3 235765390 235759113 236036237 236302465 236553382 237180237 237530451 237381179 237310082 237058848 236747749
1898.7 236747749 236828662 237037521 237307902 237789936 238180682 238108486 237742085 237713642 238187779 238466989
1919.1 238466989 238625873 238839742 238493793 238182582 238375384 238349941 238079503 238109846 238401368 238945857
1939.5 238945857 239670426 239692871 238981154 238421056 238154158 238109026 238523334 239203777 239505488 239348207
1959.9 239348207 239223484 239528194 240202788 240445454 240075849 239977911 240309481 240704827 240878854 240636710
1980.3B40636710m48152k95453J33216N10253O56676K85972m32916m27105J93157L54349
2000.6B41166707n4724k39965p3612p4152J01515M84604L37157L0641j23419o4578
2021B41490174M04753M73242j16881n27687l17451O5416K31527J77342K8462J92951
2041.4B42101848N25527L98587j01030l42987k07760K19252O14841L66047j61249l23877
2061.8B43089199j70562m7069l2578J23735K02302n0105k3264M36939M69312P935k76826
2084.3B43729018k14111m9007O3535M6809r8832Q1304K98172J00490J85389L43379
2104.7B44486146N1483m5448L8333m7926L3956J90344J37482o7652j52811J19395K98527
2127.1B45041829R0934l5334J66520K30093j09021k06791J09822K16122J9987k21041
$$ plain form
1980.3 240636710 240188558 239893105 240026321 240536574 241193250 241479222 241046306 240619201 240812358 241166707
2000.6 241166707 241111983 240872018 240798406 240724254 240825769 241310373 241647530 241678171 241554752 241490174
2021 241490174 241894927 242368169 242251288 241723601 241406150 241471566 241703093 241880435 241908897 242101848
2041.4 242101848 242627375 243025962 242924932 242581945 242374185 242593437 243208278 243574325 243413076 243089199
2061.8 243089199 242918637 242871568 242838990 242962725 243165027 243114922 243091658 243528597 243997909 244005844 243729018
2084.3 243729018 243514907 243465900 243529435 243576244 243477412 243558716 243856888 243957378 244142767 244486146
2104.7 244486146 244537629 244492181 244530514 244482588 244516544 244706888 244844370 244776718 244623907 244743302 245041829
2127.1 245041829 245132763 245097429 245263949 245494042 245385021 245178230 245288052 245504174 245524161 245303120
2147.5B45303120k22399J3429J55010M47314P93356M95110j16453k57566J4249Q5216
2167.9B46710386n4519R8906O5491k59746q4937J65477J84682L23876L31849J21668
2188.3B47603133o7409j59219j81682j34818L2894J84681O6310j80024j61939N9456
2208.7B47061383J13435R872O6031K28286J94572O6030j67433l51313L2615M96544
2229.1B47750022K45030k64476k3563M81531J75145k14614N476J25542j28001j24164
2249.4B48027928R0450J12374J10734P5381n1260k62577k55164J14013J35116Q0578
2269.8B48177573N44638N94612j74642o93798k59299N50132O59023J95485j23922k25082
2290.2B49244720l9749L56678N56875K43503j71940r0767O4168O9384K66265J90586
$$ plain form
2147.5 245303120 245080721 245094150 245249160 245696474 246489830 246984940 246868487 246610921 246625170 246710386
2167.9 246710386 246655867 246754773 246820264 246560518 246475581 246641058 246825740 247149616 247481465 247603133
2188.3 247603133 247535724 247376505 247194823 247060005 247092899 247277580 247343890 247163866 247001927 247061383
2208.7 247061383 247174818 247184690 247250721 247479007 247673579 247739609 247572176 247220863 247253478 247750022
2229.1 247750022 247995052 247730576 247707013 248188544 248363689 248149075 248154551 248280093 248152092 248027928
2249.4 248027928 248118378 248230752 248341486 248416867 248365607 248103030 247847866 247961879 248096995 248177573
2269.8 248177573 248722211 249316823 249142181 248448383 248189084 248739216 249398239 249593724 249469802 249244720
2290.2 249244720 249204971 249561649 250118524 250362027 250190087 250099320 250163488 250232872 250499137 250689723
2310.6B50689723l24417m34611j00360P6779J41207M3604l28216l82457L7010J49422
2331B49567684o17672j109261n9195J205187R74667M53256R61814L72771j408886k152920
2351.4B48187445j455136r21897n68088P57668J249649J148041J407154J233201J132302
2369.8B52170339J122169P49752K29441l07933p37663o92531l56101l25627l46452
2388.1B51505394j49478j34129r0506K3861j50856o8564L06089K07089K7418J87344
2408.5B51663662M9100j09431J59629K44975J33049J77491j3709l94489j96677J27275
2428.9B51840875j07531k58125J10268L84599J01775P395M23044M92483L44645K11038
2449.3B53550466m48935n38323L13316M57428L7868k7176j9483O314K50265K17073
$$ plain form
2310.6 250689723 250365306 249930695 249830335 249907114 250048321 250091925 249763709 249381252 249418262 249567684
2331 249567684 248950012 247840751 247781556 248986743 249961410 250414666 251376480 251749251 250340365 248187445
2351.4 248187445 246732309 245810412 245242324 245999992 247249641 248397682 249804836 251038037 252170339
2369.8 252170339 253292508 254042260 254271701 253963768 253226105 252533574 252177473 251851846 251505394
2388.1 251505394 251355916 251221787 251131281 251155142 251004286 250935722 251241811 251448900 251476318 251663662
2408.5 251663662 251712762 251603331 251762960 252007935 252140984 252318475 252304766 251910277 251713600 251840875
2428.9 251840875 251733344 251475219 251585487 251970086 252071861 252079256 252502300 252994783 253339428 253550466
2449.3 253550466 253101531 252563208 252876524 253333952 253371820 253344644 253325161 253331475 253581740 253798813
2469.7B53798813k37096m27533j11405L66326M67897o3666n54602j85780L55914K18153
2490.1B53627021J49850L26037P0818j06767L8967j379n6810p8753R2480M09503M0624
2512.5B54511591o00256o67665j67657N68573P66273K25622m1984M04884N97648n4632
2532.9B55542397o31958k55834L32687J32602n74813q76337j26790J014378J072287
2551.3B55628619M62085J59815l55579o16088l4329N57341O05173Q513n99139l20952
2571.7B55495459M2002l31085j94646L46452J00490j72425r0860Q0708K76193K07294
2592.1B55759582K88021L61092j61752k19382K85022K27373L2130n1912l23746m96991
2612.4B55699437k57790J57859K41883K94894O19516O40191J58493k97465l52096J2089
$$ plain form
2469.7 253798813 253561717 253134184 253022779 253389105 253857002 253793336 253238734 253052954 253408868 253627021
2490.1 253627021 253776871 254102908 254173726 254066959 254105926 254104547 254047737 253968984 254061464 254470967 254511591
2512.5 254511591 253911335 253243670 253076013 253644586 254410859 254636481 254594497 254999381 255597029 255542397
2532.9 255542397 254910439 254654605 254987292 255119894 254545081 253668744 253541954 254556332 255628619
2551.3 255628619 256090704 256250519 255894940 255278852 255244523 255801864 256407037 256415550 255816411 255495459
2571.7 255495459 255537461 255206376 255011730 255358182 255458672 255286247 255195387 255276095 255552288 255759582
2592.1 255759582 256047603 256408695 256246943 256027561 256312583 256539956 256572086 256520174 256196428 255699437
2612.4 255699437 255441647 255599506 255841389 256136283 256755799 257395990 257554483 257257018 256904922 256917011
2632.8B56917011L63085N6848m71566j97179O31399O27917m45266q62665j79857M18778
2653.2B56858505N67157K82917o0983J0170K74405J58232r3672M8894O0443R9726K44770
2675.7B58450564j81869l51909M05758P17640Q792k66246p3910j90120j25282J56611
2696.1B58550029M23938L82755k8014k28081m675L11341P8306k58573K198M4517k73399
2718.5B59000342j58548l8724j66782J23363M83599M18778J34390k22884k91541J10175
2738.9B59392168L42690N0012k9411J96509J38227J9520L1609N3868o8434j76727J77268
2761.3B60127299K24001j87158P2270N28284K56747k62521k60845l4906l8483J5945
2781.7B60440633L30116M35431J77044j7322k56766j61082M09876N22099J66353O035
$$ plain form
2632.8 256917011 257280096 257336944 256865378 256668199 257299598 257927515 257482249 256619584 256439727 256858505
2653.2 256858505 257425662 257708579 257647596 257657766 257932171 258090403 257996731 258045625 258106068 258205794 258450564
2675.7 258450564 258268695 257916786 258322544 259040184 259048976 258782730 258708820 258518700 258393418 258550029
2696.1 258550029 258973967 259356722 259328708 259100627 259095952 259407293 259485599 259227026 259229224 259273741 259000342
2718.5 259000342 258841794 258803070 258636288 258759651 259243250 259662028 259796418 259573534 259281993 259392168
2738.9 259392168 259734858 259784870 259755459 259951968 260090195 260109715 260141324 260195192 260126758 259950031 260127299
2761.3 260127299 260351300 260164142 260236412 260764696 261021443 260758922 260498077 260463171 260424688 260440633
2781.7 260440633 260770749 261206180 261383224 261365902 261109136 260948054 261357930 261880029 262046382 262052417
2802.1B62052417O5993m1239j4025L48948M65847J84253o6012k01855j02576L95738
2822.5B63087489P01658M79203l8240l15812L4385M89950N96475O12531M17213J360
2842.9B66066212J62944M91571J17533j84141J5143J15335J71215J80024l1665K5332
2863.3B67129503J27740q1770k1737J1288m00804l03872K36705J35433l20114q4229
2883.7B66428143O78506R46801N41899Q9780J04084J92505O333L6899K59727K48421
2904.1B69533098K09342P13468J252294O47362n81779o41215M23509J011994Q39904
2922.4B73407977L47383j03395j55754j99043n28153m82071Q4881J14664m61377o51441
2942.8B71373671m79427k5071M48562L2243l88790J8459K45776N9791l05288o11898
$$ plain form
2802.1 262052417 262118410 262077171 262063146 262412094 262877941 263062194 262996182 262794327 262691751 263087489
2822.5 263087489 263789147 264268350 264230110 263914298 263948683 264438633 265035108 265647639 266064852 266066212
2842.9 266066212 266229156 266720727 266838260 266654119 266669262 266784597 266955812 267135836 267104171 267129503
2863.3 267129503 267257243 267175473 267153736 267165024 266764220 266460348 266697053 266832486 266512372 266428143
2883.7 266428143 267106649 268053450 268595349 268685129 268789213 268981718 268988051 269024950 269284677 269533098
2904.1 269533098 269742440 270455908 271708202 272355564 271773785 271132570 271556079 272568073 273407977
2922.4 273407977 273755360 273651965 273496211 273297168 272769015 272286944 272371825 272486489 272025112 271373671
2942.8 271373671 270894244 270869173 271317735 271349978 270961188 270979647 271225423 271285214 270979926 270368028
2963.2B70368028p72960r76026l49991N11072R9969m34257p6835K01576n0124k56915
2983.6B68263537k15042j33272m8168J03786L87691M59329P7113k12323j83396j47596
3004B68351659M6808K34340n1502j16211L28813L08994j45137k72915j80099P4636
3024.4B68579386N40856O91060M91161J03303l64725l22293j85650j76002L13167M63612
3044.8B70133875J06320L03034O49951K41939k02525n2639k04984o14393m23938R2555
3065.2B70029195J81812J19824L56492L07206o6124j33086M42509Q04383J56816k98470
3085.6B71900557J96770N23664K30148J09990J73673j06413k43672R7026J50241p1675
3106B72960309o612J23493L66364O27208L00277q7134L17934N23702o1505k52612K87090
$$ plain form
2963.2 270368028 269595068 268619042 268269051 268780123 268880092 268445835 268369000 268570576 268520452 268263537
2983.6 268263537 268048495 267915223 267867055 267970841 268358532 268817861 268894974 268682651 268499255 268351659
3004 268351659 268398467 268632807 268581305 268465094 268793907 269102901 268957764 268684849 268504750 268579386
3024.4 268579386 269120242 269811302 270302463 270405766 270041041 269718748 269533098 269357096 269670263 270133875
3044.8 270133875 270240195 270543229 271193180 271435119 271232594 271179955 270974971 270360578 269936640 270029195
3065.2 270029195 270211007 270330831 270687323 270994529 270928405 270795319 271237828 272042211 272199027 271900557
3085.6 271900557 272097327 272620991 272851139 272961129 273134802 273028389 272784717 272881743 273031984 272960309
3106 272960309 272953697 273077190 273443554 274070762 274371039 274283905 274601839 275125541 275064036 274811424 275098514
3128.4B75098514M97550J20811J6261N9027k48794k27801L41441N45625K26479j85668
3148.8B76243445m78309m63370j24108L56342M89317M70076M32040K20184m8839k32328
3169.2B76864450P3668M48655L40790j01551l54033n1316M29358N37299L75360J50427
3189.6B78713107l25423m40459J40741N80698J38842l65172q6929j5181l57684m64152
3210B77518388k24616L13203N94147O52466O19180j05183n78854R387N83828L22442
3230.4B79704388k85730m01921j74735J65068L92273L49227M36511J96863n75408n68964
3250.7B79237572K00681K11206k50954j36923K09529J47689M5839M14960M68027l595
3271.1B80544031k756J43870k17873k97670K20072N45103M74751K46354l66234p33733
$$ plain form
3128.4 275098514 275596064 275716875 275733136 275792163 275543369 275315568 275657009 276202634 276429113 276243445
3148.8 276243445 275765136 275301766 275177658 275534000 276023317 276493393 276925433 277145617 277096778 276864450
3169.2 276864450 276938118 277386773 277727563 277626012 277271979 277220663 277650021 278187320 278562680 278713107
3189.6 278713107 278387684 277947225 278087966 278668664 278807506 278442334 278355405 278340224 277982540 277518388
3210 277518388 277293772 277606975 278201122 278853588 279472768 279367585 278788731 278798118 279381946 279704388
3230.4 279704388 279418658 279016737 278842002 279007070 279399343 279748570 280185081 280381944 279806536 279237572
3250.7 279237572 279438253 279649459 279398505 279261582 279471111 279618800 279664639 280079599 280547626 280544031
3271.1 280544031 280541275 280685145 280467272 280169602 280389674 280934777 281409528 281655882 281289648 280555915
3291.5B80555915l70014J88034O74892M63705l54051p24904k50154N65779Q37631K52184
3311.9B81839017o00182q84775m81810J64546M27980K72821K35290J10473K9262J99955
3332.3B81312577j98297o68280j89971M48171K42181m06205l91826Q1733p6760o06012
3352.7B79547311l47849L07262J70339k81874m34760l27919O2380J9316o91377r65781
3373.1B77057048l82681J71047L19518M30718n2154q98931p21104P0072M21238M31481
3393.5B76846252M51114K40058m47556j010001o50678K78298L37902m08235o65226
3411.9B74971928k78260J72350K92883j39810r40040j219362n82393K49706N58719
3430.2B73085721L1441r64161r95639j97553J55680L61521M69294j08313q35471q09971
$$ plain form
3291.5 280555915 280185901 280373935 281048827 281512532 281158481 280433577 280183423 280749202 281586833 281839017
3311.9 281839017 281238835 280354060 279872250 280036796 280464776 280737597 280972887 281083360 281112622 281312577
3332.3 281312577 281114280 280446000 280256029 280704200 280946381 280540176 280148350 280230083 280153323 279547311
3352.7 279547311 279199462 279506724 279677063 279395189 278960429 278632510 278694890 278714206 278022829 277057048
3373.1 277057048 276674367 276845414 277164932 277595650 277543496 276644565 275923461 275993533 276414771 276846252
3393.5 276846252 277297366 277537424 277089868 276079867 275429189 275707487 276045389 275637154 274971928
3411.9 274971928 274693668 274866018 275158901 275019091 274079051 272859689 272277296 272527002 273085721
3430.2 273085721 273117162 272153001 271157362 270959809 271115489 271477010 271946304 271837991 271002520 270192549
3450.6B70192549m08236J72984P78790M84381k57622o65617m13488J92821n3700o96332
3471B69326530n96791j51191j5143k51402l94303M4890M29824k4233n41601j98242
3491.4B67628338J97403K83607L24081k00178k24412K83067l52730q58120n95935n62835
3511.8B65922286j34856K62559o69267j019389M85312J097378Q3949l56119k13534
3530.1B65458319m45489l73367j24629p98311j069047L13781J750011J058840q29921
3548.5B64940187n78854N02095m91645j147595k11503L5483M2897J838952K881419
3566.8B67811436m88963k914108j459755K4196L27285K21971l72137l99314J255013
3585.2B64005624K698041K32589k601054j761149p1489K76361L28384R5424n34635
$$ plain form
3450.6 270192549 269784313 269957297 270736087 271220468 270962846 270297229 269883741 270076562 270022862 269326530
3471 269326530 268729739 268578548 268563405 268312003 267917700 267962590 268392414 268368181 267826580 267628338
3491.4 267628338 267825741 268109348 268433429 268233251 268008839 268291906 267939176 267081056 266485121 265922286
3511.8 265922286 265787430 266049989 265380722 264361333 264846645 265944023 266027972 265671853 265458319
3530.1 265458319 265012830 264639463 264514834 263716523 262647476 262961257 264711268 265770108 264940187
3548.5 264940187 264361333 264863428 264371783 263224188 263012685 263048168 263091065 264930017 267811436
3566.8 267811436 267322473 264408365 262948610 262972806 263300091 263522062 263149925 262750611 264005624
3585.2 264005624 266703665 266936254 264335200 262574051 262502562 262778923 263107307 263202731 262668096
3603.5B62668096l39598M38057M63407M14215L99407k08225J42772j08667j875609
3621.9B61993855j548547N73117K955571J741611j853016k140105j637227j140423
3638.2B58944836L32482Q19210K07219J233164L622025J887717k701283k920627k88394
3656.6B61136349l37828j664366j258571o10594k0600J864489K593808N66970J258459
3674.9B63528116R75449k244357k724137j775679p35819J356937L433265R51402j904536
3693.3B60860641j461041r60566n29922J258012J374650o09327p00205P83205J768619
3711.6B61784066L08509j217648n32418O01969J282282R64981j44951j229718j179912
3730B60637160J533218M155096K003591j668334l450568k261568K101231J299679j579653
$$ plain form
3603.5 262668096 262328498 262766555 263229962 263644177 264043584 263835359 263978131 263869464 261993855
3621.9 261993855 260445308 261018425 263973996 265715607 263862591 261722486 260085259 258944836
3638.2 258944836 259277318 260096528 260303747 261536911 265158936 267046653 264345370 261424743 261136349
3656.6 261136349 260798521 259134155 257875584 257264990 257244390 259108879 261702687 262269657 263528116
3674.9 263528116 264503565 262259208 259535071 257759392 257023573 258380510 261813775 262765177 260860641
3693.3 260860641 259399600 258439034 257909112 259167124 260541774 259932447 259232242 260015447 261784066
3711.6 261784066 262092575 260874927 260342509 260944478 262226760 263191741 263046790 261817072 260637160
3730 260637160 262170378 266325474 268329065 266660731 263210163 260948595 263049826 264349505 262769852
3748.3B62769852J089703J263339k348088k487823k98191O2101j327228n25303R53376
3766.7B59151738J004152O33821q71010j437087L297J050160k1719p23749M30829J35191
3787.1B59355623j103952q48249k13701K78782K05468M86765K326630M92838j362693
3805.4B59617511P52751J3206k092793p97175K354309J509841J29491J867693l06107
3823.8B63048727k398919j548082p78641J86543J328290K097916K452172O94152j122746
3842.1B63959412j146384j478456j896229r28435K724863M342422r42684k902951j396742
3860.5B60334816L72715Q75294l00780J3207J033507k459o02715n82002M57447J133420
3880.9B62732450j79838O04745P65752j472794j292247j87196m61526L6563J338516
$$ plain form
3748.3 262769852 263859555 265122894 262774806 260286983 259988792 260050893 258723665 258198362 259151738
3766.7 259151738 260155890 260789711 259918701 258481614 258484911 259535071 259513352 258789603 259220432 259355623
3787.1 259355623 258251671 257403422 257189721 257468503 257673971 258160736 260487366 260980204 259617511
3805.4 259617511 260370262 260383468 258290675 257493500 259847809 261357650 261487141 263354834 263048727
3823.8 263048727 260649808 259101726 258323085 258509628 259837918 261935834 264388006 265082158 263959412
3842.1 263959412 262813028 261334572 259438343 258509908 261234771 265577193 264634509 261731558 260334816
3860.5 260334816 260707531 261582825 261282045 261295252 262328759 262326300 261723585 261141583 261599030 262732450
3880.9 262732450 262552612 263157357 263923109 262450315 261158068 260970872 260509346 260545909 261884425
3899.2B61884425J881346J527723j56015k187491j831501o77296q76169P413J453683
3917.6B61026118L83779q12038o4057M60427L0250M21144P10469m05833j068563o65430
3938B60016266l3248N43371J19842k71294L91137j01700r90536m59180O2939J02222
3958.4B59379819L37176L43528p8883j51154k78112o01485J67601P20527l58634n01200
3978.8B58979183O13592L9842j002922p4171Q54246L36897j01402k05543p31182
3997.1B58708540
$$ plain form
3899.2 261884425 263765771 265293494 265137479 262949988 261118487 260441191 259565022 259572435 261026118
3917.6 261026118 261409897 260597859 260533802 260994229 261024479 261445623 262156092 261750259 260681696 260016266
3938 260016266 259983018 260526389 260646231 260374937 260766074 260664374 259673838 259214658 259277597 259379819
3958.4 259379819 259716995 260060523 259981640 259830486 259552374 258950889 259118490 259839017 259480383 258979183
3978.8 258979183 259592775 259632617 258629695 258555524 259409770 259746667 259645265 259439722 258708540
3997.1 258708540
##END=$$ End of the data block
