##TITLE=$$ Begin of the data block
##JCAMP-DX=5.00 $$ ACD/SpecManager v 10.08
##SPECTROMETER/DATA SYSTEM=16PC
##DATE=Thu Sep 12 15:32:48 2013
##DATA TYPE=INFRARED SPECTRUM
##DATA CLASS=XYDATA
##ORIGIN=
##OWNER=
##NPOINTS=3601
##FIRSTX=400.00000000
##LASTX=4000.00000000
##MAXX=4000.00000000
##MINX=400.00000000
##MAXY=43.15491486
##MINY=10.91311741
##XFACTOR=1.0000000000
##YFACTOR=0.000000100000000
##FIRSTY=22.64346695
##DELTAX=1.00000000
##XUNITS=1/CM
##YUNITS=TRANSMITTANCE
##XYDATA=(X++(Y..Y))
400B26434669N8535519M6625805L0943527J6647415P392044L953400M428177N719681
408D00680237N348053K575607j621551n483246p590142p520675n807381l420448j217003
417C75943451L35617J134109J287880J021462O53381N57137J018791K040672L246956
426C87239456M025612L871193K722511J051979l84407r93156o99806K5596M89693K26173
436C97574844p18002j839943k523842k432403j697769q14858l35159n66139j444817
445C85201912k617912l637238m141388l953094l096695j779671l56750P42721J153488
454C67515373P46422k48909j281776j706734j114197M13246K282906L654518L860703
463C74121552K763175Q43354j023636j994019j655121j96151J719284L292694L961677
$$ plain form
400 226434669 284970188 331595993 362539520 379186935 386578979 390532379 394960556 400680237
408 400680237 406028290 408603897 406982346 401499100 393908958 386388283 380580902 377160454 375943451
417 375943451 376279068 377413177 378701057 379722519 380375900 380933037 381951828 383992500 387239456
426 387239456 391265068 395136261 397858772 398910751 398526344 397533188 396833382 396858978 397348671 397574844
436 397574844 396856842 395016899 392493057 390060654 388362885 387548027 387212868 386646729 385201912
445 385201912 382584000 378946762 374805374 370852280 367755585 365975914 365619164 366361885 367515373
454 367515373 368261795 368012886 366731110 365024376 363910179 364323425 366606331 370260849 374121552
463 374121552 376884727 377728081 376704445 374710426 373055305 372859154 374578438 377871132 381832809
472C81832809L622284K621384J549873R54743J100578J872711K847557L487397L379211
481D03268547K421684Q84171o94542j732330j863022j108132J27030J241722J727791
490D04272919J413994N41267l74413q19625n59922K32163J057663J340751P17888p72552
500D07050133k687187m355622n158844m783249l350639j371498M57382J530838J579475
509C88910789P75910l48778j147003j158295l31192R45511K024269K313690J572190
518C93557091L3722j697159k931061l218536k552605j356659k66991J79482j95808
527C81551476j126481k024154k253418j436997L47557K569046M452095N307427M840965
536C92227516L293381J338348k26059q49723m86107M00047J080627R49669j53351j843986
$$ plain form
472 381832809 385455093 388076477 389626350 390581093 391681671 393554382 396401939 399889336 403268547
481 403268547 405690231 406574402 405879860 404147530 402284508 401176376 401303406 402545128 404272919
490 404272919 405686913 406228180 405853767 405034142 404474220 404706383 405764046 407104797 407822685 407050133
500 407050133 404362946 400007324 394848480 390065231 386714592 385343094 385800476 387331314 388910789
509 388910789 389686699 389337921 388190918 387032623 386701431 387646942 389671211 391984901 393557091
518 393557091 393590813 391893654 388962593 385744057 383191452 381834793 381567802 381747284 381551476
527 381551476 380424995 378400841 376147423 374710426 375057983 377627029 382079124 387386551 392227516
536 392227516 395520897 396859245 396633186 395783463 395297356 395697403 396778030 397727699 397574348 395730362
546C95730362l370400l976326l268966j412316R40361K933312L873176L505478K094918
555C97049599K85034j180229j757737j306915j20086J219902K095794K121430J306839
564C99713631N1498j039085j436577r46770J85356J380310J997872J651726M07829
573D01965790j235504k581749l067551k532196j288147L5248P93686O25915l94630
582C92320862j814232l024750l540993l207511k242699j118775l36837k03209o97785
591C76134071j488876k084084k052955j228142K02179J754189K844314L035927K237091
600C79353714P54852q19969j850586j913414r66987O40182K320786L493385L810654
609C84822617L282814K247543J206779O03753O34231J172409J841316K199135J957093
$$ plain form
546 395730362 392359962 388383636 385114670 383702354 384642715 387576027 391449203 394954681 397049599
555 397049599 397334633 396154404 394396667 393089752 392969666 394189568 396285362 398406792 399713631
564 399713631 399765129 398726044 397289467 396342697 396528053 397908363 399906235 401557961 401965790
573 401965790 400730286 398148537 395080986 392548790 391260643 391295891 392089577 392715492 392320862
582 392320862 390506630 387481880 383940887 380733376 378490677 377371902 377035065 376831856 376134071
591 376134071 374645195 372561111 370508156 369280014 369482193 371236382 374080696 377116623 379353714
600 379353714 380108566 379288597 377438011 375524597 374557610 375197792 377518578 381011963 384822617
609 384822617 388105431 390352974 391559753 392163506 392797737 393970146 395811462 398010597 399967690
618C99967690J131439N2108p81898r44405l07922Q57010J970100K391625J728821N3749
628D06118317k077980l836403m472809l663864j679421P15485K591629L269730K618179
637C99582863J089783n23034j485023j468926o77108L09410Q63418O37322k86255j476784
647C96565666k401008k682381k250710j331443l23601L57857M14047k46887j456147
656C86645393k783203l625908l417129j904869O24161L335838N130234N137176L185463
665C92327156k0904l161164m895706m511642k265664P54586L180847M027443L120613
674C88555565J092987j010971k277908k324448j380806p1144R47113J284904R42650
683C85757942K35939l94287n87387k04735O27442J573448K223396K263489J620369
$$ plain form
618 399967690 401099129 401151237 400369339 399424934 399117012 399974022 401944122 404335747 406064568 406118317
628 406118317 404040337 400203934 395731125 392067261 390387840 391103325 393694954 396964684 399582863
637 399582863 400672646 400149612 398664589 397195663 396518555 396827965 397691383 398328705 398042450 396565666
647 396565666 394164658 391482277 389231567 387900124 387576523 387934380 388348427 388101540 386645393
656 386645393 383862190 380236282 376819153 374914284 375538445 378874283 384004517 389141693 392327156
665 392327156 392306252 389145088 384249382 379737740 377472076 378226662 381407509 385434952 388555565
674 388555565 389648552 388637581 386359673 384035225 382654419 382583275 383530388 384815292 385757942
683 385757942 385993881 385599594 385012207 384807472 385434914 387008362 389231758 391495247 393115616
692C93115616N17578o00853j258278j168327l83377P16095J594047J814957J255112
701C95602570J61514r69544j632461j551132q01926K33383J052666J267052P72476
710C94134598k13585j261597j929130j958847j387787n22843K03972M32129L3646q32863
720C86697693j794434k430267k452278j827698p85179K85454J000328J138687P26623
729C80558929J5183o37169r24072p27463j67999M48189P69119N57251j96991j265717
739C78429260k280617k896118k943153k503357j868019j400147j363029j794663k486419
748C58893738l077851l223877k761192j794929o68221J79100L98369j16005j174774
757C46654358k368927l237991l458405k973289k008400r71718k81716j98631p28531
$$ plain form
692 393115616 393633194 393032341 391774063 390605736 390222359 390938454 392532501 394347458 395602570
701 395602570 395764084 394794540 393162079 391610947 390809021 391042404 392095070 393362122 394134598
710 394134598 393921013 392659416 390730286 388771439 387383652 386860809 387064781 387496910 387530556 386697693
720 386697693 384903259 382472992 380020714 378193016 377407837 377693291 378693619 379832306 380558929
729 380558929 380574112 379936943 379012871 378285408 378117409 378565598 379334717 379891968 379694977 378429260
739 378429260 376148643 373252525 370309372 367806015 365937996 364537849 363174820 361380157 358893738
748 358893738 355815887 352592010 349830818 348035889 347367668 347546768 347945137 347829132 346654358
757 346654358 344285431 341047440 337589035 334615746 332607346 331635628 331353912 331155281 330426750
766C30426750j636276k558403l162804l286171k993011k531758k211494k255878k697697
775C07093258l358898l923512m071312l612289k573090j197948J30939J024418J224060
784B90735626O98662l33557j467438k244625k313328j557045j38702J566124L123684
793B88069401M217186M765625M924011M971218N140114N485306N856476N991783N678596
802C35099716M891205L828125K826805K200432K079353K342644K672424K708359K225800
811C60874863J255035Q3275q66203j221924q38089J27678J270675K108307K285729
820C65079346J726150O54259n13954j362801j656799j425667r23996m91791l91464
829C60693283o95877j271782j853256k165795k041091j483803o66085J39542O68831
$$ plain form
766 330426750 328790474 326232071 323069267 319783096 316790085 314258327 312046833 309790955 307093258
775 307093258 303734360 299810848 295739536 292127247 289554157 288356209 288487148 289511566 290735626
784 290735626 291434288 291100731 289633293 287388668 285075340 283518295 283379593 284945717 288069401
793 288069401 292286587 297052212 301976223 306947441 312087555 317572861 323429337 329421120 335099716
802 335099716 339990921 343819046 346645851 348846283 350925636 353268280 355940704 358649063 360874863
811 360874863 362129898 362213173 361346970 360125046 359286957 359414635 360685310 362793617 365079346
820 365079346 366805496 367459755 366945801 365583000 363926201 362500534 361576538 361084747 360693283
829 360693283 359997406 358725624 356872368 354706573 352665482 351181679 350515594 350655136 351323967
838C51323967P73964M93660N1193k28577n6190O82716J856423L122406M066849M387321
848C66473732M034691L240967K417106J961518K072296K649269L332367L664741L302193
857C93148880K183838N80253r99259k008019k086830j217957K61269J793213K825966
866C94481354L038368K457199J424866M28467j22338o9580M46205J079064J459350
875D04622955J374512Q66509K05688k41127j85242M44565J457443K471161L069687
884D14086151K983589K216416J057205l3455o20003m89616K47726J202202J883164
893D22533379J929359J281662K14272p93763j283950j032029j50108R68971J832009
902D25499802K064018J565475N45464n78804j361084j509209r99031p4234Q56629J391754
$$ plain form
838 351323967 352097931 352591591 352642784 352414207 352358017 353040733 354897156 358019562 362086411 366473732
848 366473732 370508423 373749390 376166496 378128014 380200310 382849579 386181946 389846687 393148880
857 393148880 395332718 395912971 394913712 392905693 390818863 389600906 389862175 391655388 394481354
866 394481354 397519722 399976921 401401787 401830254 401707916 401638336 402084541 403163605 404622955
875 404622955 405997467 406863976 407069664 406828537 406643295 407087860 408545303 411016464 414086151
884 414086151 417069740 419286156 420343361 420309906 419689903 419200287 419448013 420650215 422533379
893 422533379 424462738 425744400 425958672 425164909 423880959 422848930 422698822 423667793 425499802
902 425499802 427563820 429129295 429674759 429095955 427734871 426225662 425226631 425152397 426009026 427400780
912D27400780J300926O25153l36953j151619j434936j026039o7749J043472J826286
921D28179321J927185J283875J58768r74579j643982j591110q84400J18981R43565
930D27517624J216545Q33969j640q87261j412429j349640p52182P6294P25517Q63838
940D26830635L83720n53169j590996k332344k511253k103691j335907n81017j91078
949D16014900l34472r11866j594200j966934j722374q09822N23796J831055K652969
958D13683052K717552K058487R97353l82n28602m13018K24419J031571J591339J609459
968D22971230J042099J11808p94105j296311j189994n36423L63617J099930J332511
977D23104362R40590P6104r04160j596107j726647j271248m60090L28750P40204N97038
$$ plain form
912 427400780 428701706 429326859 428989906 427838287 426403351 425377312 425309563 426353035 428179321
921 428179321 430106506 431390381 431549149 430574570 428930588 427339478 426455078 426574059 427517624
930 427517624 428734169 429568138 429566498 428679237 427266808 425917168 425164986 425241280 425966797 426830635
940 426830635 427214355 426661186 425070190 422737846 420226593 418122902 416786995 416205978 416014900
949 416014900 415680428 414768562 413174362 411207428 409485054 408675232 409199028 411030083 413683052
958 413683052 416400604 418459091 419456444 419456062 418927460 418514442 418738861 419770432 421361771 422971230
968 422971230 424013329 424125137 423331032 422034721 420844727 420308304 420671921 421771851 423104362
977 423104362 424044952 424121056 423216896 421620789 419894142 418622894 418162804 418491554 419231758 419828796
987D19828796k8801q57238j532708j784477j543007r65423l58658m0398j98936q11386
997D11707764j655197k406540k780533k655297k122650j446800r43642q37516j157990
1006C95701599j725387k233506k395553k082367j390991o08178q4686p9002o43959
1015C84457970j604615k636985l406678l706817l535042l086205k669410k585030l008537
1024C58218651l916359n075646o101989o571770o157951m750328k510643J62582K759132
1033C26055679M826126O115838O645240O643677O415405O184807O003075N758056N276337
1042C79924240M456711L360786K208481J282044P87429P48406R87854J209602J140557
1051C96106110O64520j21307r51157j520729j636200j311455p65533l20664k53448
$$ plain form
987 419828796 419799995 418942757 417410049 415625572 414082565 413117142 412758484 412718086 412519150 411707764
997 411707764 410052567 407646027 404865494 402210197 400087547 398640747 397697105 396859589 395701599
1006 395701599 393976212 391742706 389347153 387264786 385873795 385265617 385180931 385101929 384457970
1015 384457970 382853355 380216370 376809692 373102875 369567833 366481628 363812218 361227188 358218651
1024 358218651 354302292 349226646 343124657 336552887 330394936 325644608 323133965 323296547 326055679
1033 326055679 330881805 336997643 343642883 350286560 356701965 362886772 368889847 374647903 379924240
1042 379924240 384380951 387741737 389950218 391232262 392019691 392768097 393755951 394965553 396106110
1051 396106110 396770630 396649323 395698166 394177437 392541237 391229782 390464249 390143585 389890137
1060C89890137o66695j446724k323418l000259l292503l208161k937622k763252k933197
1069C67318306l558579m576377n787087o947098p870712q497353q901443r238358r657058
1078C02284241j0216923j0845852j1357632j1521091j1147862j0164566q638534o755810
1086B21635971m765053k911606j384716k82783M02527P84244J058979J460438K191620
1095B18189621L351955M890461O605740Q203144R384537R934559R768142Q926678P540760
1104B86795597N788345L875199K038021N47886l13187l16887O24237K385426M619865
1113C06044502O829701Q503818R274559R033013P957763O444970M965591L904304L438034
1122C66396255L497277L819656M071999L989944L479691K643966J722718R77516N71594
$$ plain form
1060 389890137 389223442 387776718 385453300 382453041 379160538 375952377 373014755 370251503 367318306
1069 367318306 363759727 359183350 353396263 346449165 338578453 330081100 321179657 311941299 302284241
1078 302284241 292067318 281221466 269863834 258342743 247194881 237030315 228391781 221635971
1086 221635971 216870918 213959312 212574596 212291813 212694340 213478584 214537563 215998001 218189621
1095 218189621 221541576 226432037 233037777 241240921 250625458 260560017 270328159 279254837 286795597
1104 286795597 292583942 296459141 298497162 299045048 298731861 298414974 299039211 301424637 306044502
1113 306044502 312874203 321378021 330652580 339685593 347643356 354088326 359053917 362958221 366396255
1122 366396255 369893532 373713188 377785187 381775131 385254822 387898788 389621506 390599022 391170616
1131C91170616M96788N82848N81283K86827l60641j243858k115059k704544k834931
1140C83859329k490387j811981j024933l39088J32370L98941N61027P38678J000557
1149C81024513J322632J591988J655769J389351P61986j33095j097717j898384k364007
1158C82253036k469635k363510k313690k590332l333397m478111n778770o927872p710152
1167C44287567q104668q275222q446389q733196r022217q977680q181190o339073l451729
1176B74756203J39217L851605P061100R306373J0413990J0503941R892673Q950958
1184C34876060P976075P122345O395187N696144M893074L890991K686043J381798J63383
1193C75081100p70416j293564j418533j309433j221733j397400j956062k844124l865585
$$ plain form
1131 391170616 391667404 392250252 392831535 393118362 392757721 391513863 389398804 386694260 383859329
1140 383859329 381368942 379556961 378532028 378192940 378325310 378724251 379285278 380023956 381024513
1149 381024513 382347145 383939133 385594902 386984253 387746239 387613144 386515427 384617043 382253036
1158 382253036 379783401 377419891 375106201 372515869 369182472 364704361 358925591 351997719 344287567
1167 344287567 336182899 327907677 319461288 310728092 301705875 292728195 284547005 278207932 274756203
1176 274756203 274895420 278747025 285808125 295114498 305528488 316032429 325925102 334876060
1184 334876060 342852135 349974480 356369667 362065811 366958885 370849876 373535919 374917717 375081100
1193 375081100 374310684 373017120 371598587 370289154 369067421 367670021 365713959 362869835 359004250
1202C59004250m783135n438080n827102o098977o477432p151069q190480r523296j0973873
1211B94540806j2335968j3439713j4184589j4536553j4501400j4098873j3346920j2261085
1219A85835705j0861473r179879p263727n176573k994594p99971J327238L318930N124760
1228A59330416O712751Q063870R163494R995212J0535794J0756492J0627232J0124550
1236B35309811R246063Q027077O555099M971562L453826K179623J281586Q12187P27711
1245B72564545Q98685J139527J249217J056042M64153n05580j691933k804089l482971
1254B68887596l403625k392502n11055J933346M461841O558857P813587Q019238P193813
1263B98561096N534954L332882Q88539j542092l769741n665703p148609q168831q698425
$$ plain form
1202 359004250 354221115 348783035 342955933 336856956 330379524 323228455 315037975 305514679 294540806
1211 294540806 282204838 268765125 254580536 240043983 225542583 211443710 198096790 185835705
1219 185835705 174974232 165794353 158530626 153354053 150359459 149559488 150886726 154205656 159330416
1228 159330416 166043167 174107037 183270531 193265743 203801537 214558029 225185261 235309811
1236 235309811 244555874 252582951 259138050 264109612 267563438 269743061 271024647 271836834 272564545
1245 272564545 273463230 274602757 275851974 276908016 277372169 276866589 275174656 272370567 268887596
1254 268887596 265483971 263091469 262580414 264513760 268975601 275534458 283348045 291367283 298561096
1263 298561096 304096050 307428932 308317471 306775379 303005638 297339935 290191326 282022495 273324070
1272B73324070q725185q250981p297516n918502m215127k344627n13382J053467K161503
1281B39273720K703094K699528K310390J800404J466980J551189K161236L237706M572162
1290B61776409N874577O860828P330055P206593O536961N454235M128360K721176J360569
1299C09249763J32790r09004j728287k289009k547150k457561j996250j191159j46389
1308B96117744R59034J908589K515659K697830K520104K184639J956539K053814K546711
1317C15460663L315201M088707M556312M500046L888969K891541J800308R09538M03824
1326C41815109L10097N26924R00421J302109J666184J978340K241783K451973K598037
1335C55790977K682534K732010K782020K844124K882080K825966K622490K289619J932221
$$ plain form
1272 273324070 264598885 256347904 249050388 243131886 238916759 236572132 236058750 237112217 239273720
1281 239273720 241976814 244676342 246986732 248787136 250254116 251805305 253966541 257204247 261776409
1290 261776409 267650986 274511814 281841869 289048462 295585423 301039658 305168018 307889194 309249763
1299 309249763 309382553 308473549 306745262 304456253 301909103 299451542 297455292 296264133 296117744
1308 296117744 297076778 298985367 301501026 304198856 306718960 308903599 310860138 312913952 315460663
1317 315460663 318775864 322864571 327420883 331920929 335809898 338701439 340501747 341411285 341815109
1326 341815109 342125206 342652130 343552551 344854660 346520844 348499184 350740967 353192940 355790977
1335 355790977 358473511 361205521 363987541 366831665 369713745 372539711 375162201 377451820 379384041
1344C79384041J693840J668281J823845J998597J978912J625900R70116K14424l69148
1353C90988808n96505m95758l26805m75959j272431k811470m867401o938591q408890
1362C64794998q763275p776527n602951k734681J57242K440071L715134L917160L285103
1371C53432274K223053J120033K12135m58259r79500j455536j911583k272339k419281
1380C47490997k279548j885033j360321q48274m23432n4550L58010Q90922J515694
1389C43404465K082901K389145K290611J791344J052284L11470k34833n19295o09550
1398C51958542o38733p12471q55751j029625j191597j347542j545143j809883k074394
1407C40753403k164154j872483j093788O0005J243401J989746J913490R04351p84302
$$ plain form
1344 379384041 381077881 382746162 384570007 386568604 388547516 390173416 391143532 391357956 390988808
1353 390988808 390392303 389896545 389569740 389093781 387821350 385009880 380142479 373203888 364794998
1362 364794998 356031723 348255196 342652245 339917564 340074806 342514877 346230011 350147171 353432274
1371 353432274 355655327 356775360 356987495 356529236 355549736 354094200 352182617 349910278 347490997
1380 347490997 345211449 343326416 341966095 341117821 340694389 340639839 340997849 341888771 343404465
1389 343404465 345487366 347876511 350167122 351958466 353010750 353322220 353087387 352568092 351958542
1398 351958542 351319809 350607338 349751587 348721962 347530365 346182823 344637680 342827797 340753403
1407 340753403 338589249 336716766 335622978 335682983 336926384 338916130 340829620 341733971 340949669
1416C40949669k604942l924981m281540l578300k129593n28831O06575R06601M09851
1425C25824509m68026j152572j217613o25115K35214P38221L59420j023597l028660
1434C19641781m925137n967445n730591m278564k102948J11237J749592K446937K136059
1443C03080921J006355n65357k092991l086719l211575k461948j249065k92779l01666
1452B90825176j572151l735676n846023o814156n986748l531379l87993K217846L431110
1461B68600006L209782K291469J706562K137185L513374N080376N883331N355091L654346
1470C01431522J561795K6817l46222M27742J807861L089428L790531L846779L535691
1479C19171944L224868L120079L155213L065948K582093J623459L98445o47431j017151
$$ plain form
1416 340949669 338344727 334419746 330138206 326559906 324430313 323901482 324508057 325414658 325824509
1425 325824509 325356483 324203911 322986298 322361183 322596397 323334618 323694038 322670441 319641781
1434 319641781 314716644 308749199 303018608 298740044 296637096 296748333 298497925 300944862 303080921
1443 303080921 304087276 303521919 301428928 298342209 295130634 292668686 291419621 291126842 290825176
1452 290825176 289253025 285517349 279671326 272857170 266870422 263339043 262951050 265168896 268600006
1461 268600006 271809788 274101257 275807819 277945004 281458378 286538754 292422085 297777176 301431522
1470 301431522 302993317 303020134 302673912 303101654 304909515 307998943 311789474 315636253 319171944
1479 319171944 322396812 325516891 328672104 331738052 334320145 335943604 336342049 335694618 334677467
1488C34677467m15077J045494K801399M027176M015198K576981K38990j934623k864685
1497C44168320k077370o9351J838035K134247p6370m548912r962349j4548664j6929741
1506B99927845j6692371j4401760j1103039p661419m353714r28307K968979P327690
1514B55083904J1587258J4843292J6298885J5678520J3368226J0240287P283669N244942
1522C49628983M419479M631996N364227N968247N910110M990311L459129J944886J171722
1531C87489090J562042K922020M422569M944497L657417N28183l537254p039681q568535
1540C86380348p475395m191589k5559L450165N111999M749337L079452J329422O03905
1549C93012085J335525L062630M631653M740944K594070j624374o688538j0756530
$$ plain form
1488 334677467 334262390 335307884 338109283 342136459 346151657 348728638 348967628 347033005 344168320
1497 344168320 342090950 342021599 343859634 345993881 345917511 341368599 331406250 316857586 299927845
1506 299927845 283235474 268833714 257730675 250069256 245715542 244787235 247756214 255083904
1514 255083904 266671162 281514454 297813339 313491859 326860085 337100372 344384041 349628983
1522 349628983 354048462 358680458 364044685 370012932 375923042 380913353 384372482 386317368 387489090
1531 387489090 389051132 391973152 396395721 401340218 404997635 405525818 401988564 394948883 386380348
1540 386380348 378904953 374713364 374687805 378137970 383249969 387999306 391078758 392408180 393012085
1549 393012085 394347610 397410240 402041893 406782837 409376907 407752533 401063995 390307465
1557C90307465j2132988j0050202n089302R87587N960388Q113518O977425L486938
1565C88560829n25780l244361l720322k244034o8207J327286J021538r26628l603401
1574C76576920n797501o643791o008034m438972k771225j643677j204186j134758r31320
1583C46003456k41470R31549K253342L256530L582878L137017K096061P99599m04129
1592C61414833j284141j781998j991387k087478k236634k527809k952308l439751l923531
1601C39189796m389648m865913n355645n764789n893212n527591m594040l266068j934299
1610B97598591j017552p16762q68530j013031o60420L96290J915913L304004L919239
1619C02857742L411694J901913r1210j907959l032131l259716k706127j707306p02248
$$ plain form
1557 390307465 378174477 368124275 363034973 364022560 369982948 378096466 385073891 388560829
1565 388560829 388035049 384790688 381070366 378826332 378758125 380085411 381106949 380180321 376576920
1574 376576920 370779419 364135628 358127594 353688622 350917397 349273720 348069534 346934776 346003456
1583 346003456 345761986 346693535 348946877 352203407 355786285 358923302 361019363 361818962 361414833
1592 361414833 360130692 358348694 356357307 354269829 352033195 349505386 346553078 343113327 339189796
1601 339189796 334800148 329934235 324578590 318813801 312920589 307392998 302798958 299532890 297598591
1610 297598591 296581039 295864277 294995747 293982716 293322296 293718586 295634499 298938503 302857742
1619 302857742 306269436 308171349 308080139 306172180 303140049 299880333 297174206 295466900 294764652
1628B94764652j43432m15192j725674l978271o700993r126549j0452938j0197448q466244
1637B43557911n974484l770198k773819l358727n184345p366448q904342r149494q086892
1646A88989162o293087m591369l584442l302574l166600k302646n8251L556824P766571
1655A77013588J1352005J3249569J3097114J1408177R262009P685661P097111P143840
1663B57309074P024517O069146M195881J950492J24226p70779q02745m99630m12732
1672B74187450o91928r89743p65304K30179J642761K626724K327633M35924k551555
1681B76452141n536137p372627p443371n928574l647098j603966n24216o19697j663075
1690B42113380l251342n064392o969529q951511j0961933j2812119j4183883j4746476
$$ plain form
1628 294764652 294621220 294206028 292480354 288502083 281801090 272674541 262221603 252024155 243557911
1637 243557911 237583427 233813229 231039410 227680683 222496338 215129890 206225548 197076054 188989162
1646 188989162 182696075 178104706 174520264 171217690 168051090 165748444 165690193 169247017 177013588
1655 177013588 188365593 201615162 214712276 226120453 235382462 243068123 250165234 257309074
1663 257309074 264333591 270402737 274598618 276549110 276673336 275902557 275099812 274600182 274187450
1672 274187450 273495522 272505779 271740475 271970654 273613415 276240139 278567772 279003696 276452141
1681 276452141 270916004 263543377 256100006 250171432 246524334 244920368 244396152 243776455 242113380
1690 242113380 238862038 233797646 226828117 217876606 206914673 194102554 179918671 165172195
1698A65172195j4303455j2884598j0736656q220110n665235l253804r77163J306706
1706A10437880L742847O329889Q826905J0773277J1631546J1008091Q850040N525704
1714A77126179J730556j749325m314804n741958o191235o037054n614710n025568m110002
1723A40072079k600918l63522K430411N310058P704058R221420R849739R946385J0022068
1732A91591778J0440082J1210537J2000809J2355518J1990853J0981579R728660Q725166
1740B79024982Q264981Q268776Q331909P967567O899109N236702L436394K069626J536102
1749C31036148J876297K777290L753510M387436M496956M149360L547669K880707K245597
1758C61150970J676140J232758J054306J304245K027664L020363L829002L926163K991753
$$ plain form
1698 165172195 150868740 137984142 127247486 119027376 113362141 110108337 109131174 110437880
1706 110437880 114180727 120510616 129337521 140110798 151742344 162750435 171600475 177126179
1714 177126179 178856735 177107410 172792606 167050648 160859413 154822359 149207649 144182081 140072079
1723 140072079 137471161 137107639 139538050 144848108 152552166 161773586 171623325 181569710 191591778
1732 191591778 202031860 213242397 225243206 237598724 249589577 260571156 270299816 279024982
1740 279024982 287289963 295558739 303890648 311858215 318757324 323994026 327430420 329500046 331036148
1749 331036148 332912445 335689735 339443245 343830681 348327637 352476997 356024666 358905373 361150970
1758 361150970 362827110 364059868 365114174 366418419 368446083 371466446 375295448 379221611 382213364
1767C82213364J136360j077233k855186l531036k872162j172142R05723K635498L517037
1776C78900223L416824K537117J278916R3879o25953o27709J28136J408195K718468
1785C89228096L443260L103600J624756n42031k557182l559723l091888j352349Q74977
1794C87171516K594757L085061K240371N94063r78470j710777j309166n7831J373024
1803C93002548K287369K300568J488227K94457p25327j179123r91020l73611L33328
1812C96437416Q52470J078606J067848R45587Q10433O95953N97954N16739M65698M35372
1822D03904076L54118J04561l93830j080322j720962j997872j690025q30689K73285
1831C96922340J198235J644592J606903J349602J199036J290245J449432J303635N56488
$$ plain form
1767 382213364 383349724 382272491 379417305 375886269 373014107 371841965 372747688 375383186 378900223
1776 378900223 382317047 384854164 386133080 386226959 385601006 384973297 385101433 386509628 389228096
1785 389228096 392671356 395774956 397399712 396857681 394300499 390740776 387648888 386296539 387171516
1794 387171516 389766273 392851334 395091705 395685768 394707298 392996521 391687355 391629524 393002548
1803 393002548 395289917 397590485 399078712 399373169 398647842 397468719 396477699 396104088 396437416
1812 396437416 397289886 398368492 399436340 400381927 401192360 401888313 402486267 403003006 403468704 403904076
1822 403904076 404258194 404362755 403968925 402888603 401167641 399169769 397479744 396649055 396922340
1831 396922340 398120575 399765167 401372070 402721672 403920708 405210953 406660385 407964020 408520508
1840D08520508p58591k222557l227882l311272k416840r27620N48478J500091J746979
1849C99451294J461372R91478O22216M28314K96707Q0681k40517n09186m83703j6518
1859D02082138P99027J617851J986961J578293L84560j231957k678757l396797l121490
1868C98019829k003708n29671P19338J340103J268234P54471J86653j29585j04065
1877C99521599J47095M20494N60035N23873L62091J48506o8436k67486m23012m91791
1887D00432968m36897k72980q3351K0142k5521j77307l03535k69471l8948K90528N46188
1898C99681816N94521M31366J77955j1215n7640m234L6621j0987j12342j42708J1482
1909D00594635L46489P13539Q97446P50541K88544l15018q31642j105385j119766r70611
$$ plain form
1840 408520508 407761917 405539360 402311478 399000206 396583366 395655746 396204224 397704315 399451294
1849 399451294 400912666 401904144 402526360 402954674 403251381 403332062 403091545 402582359 402098656 402082138
1859 402082138 402881165 404499016 406485977 408064270 408448830 407216873 404538116 401141319 398019829
1868 398019829 396016121 395486450 396205788 397545891 398814125 399568596 399755249 399625664 399521599
1877 399521599 399668694 400089188 400649223 401173096 401535187 401683693 401615257 401347771 400924759 400432968
1887 400432968 399996071 399723091 399639740 399659882 399634361 399457054 399153519 398884048 398845100 399135628 399681816
1898 399681816 400276337 400707703 400885658 400874443 400816803 400812569 400849190 400838203 400725861 400583153 400594635
1909 400594635 400941124 401654663 402552109 403302650 403591194 403276176 402444534 401339149 400219383 399248772
1919C99248772p73812n82084l68309p8774K91367O61125Q94508Q79135O01502J68724
1929D00942154k33994m27894l21732M5815N20820Q93250R79805O99272J13182n89104
1939D02621574j158828j389122j204872o97899q6022L89786N75562M69474K05994k8992
1949C99696655j01051O294J96076L25088K90489Q8082j86959l93409m19083k38991
1959C99263191P0687L67889N10063M19693J21498k65770n79490o84395n32303j83792
1969C98507271K18315N12733N90210M36478J31454j93901m17633m73938l68232j59798
1979C98782959P3395K65274L76282L90892L09906J46141p3243l04222m90036n79338
1989C98898010n47142m10995k27089o6223J8692J8196l2387p5264o6071k708P1602
$$ plain form
1919 399248772 398474960 397892876 397524567 397445793 397737160 398398285 399292793 400171928 400773430 400942154
1929 400942154 400708160 400280266 399958534 400004349 400525169 401418419 402398224 403097496 403210678 402621574
1939 402621574 401462746 400073624 398868752 398170853 398084831 398474617 399050179 399519653 399725647 399696655
1949 399696655 399595604 399601898 399797974 400123062 400413551 400501633 400314674 399921265 399502182 399263191
1959 399263191 399333878 399701767 400211830 400631523 400753021 400487251 399907761 399223366 398691063 398507271
1969 398507271 398725586 399238319 399828529 400265007 400396461 400202560 399784927 399310989 398942757 398782959
1979 398782959 398856354 399121628 399497910 399888802 400198708 400344849 400271606 399967384 399477348 398898010
1989 398898010 398350868 397939873 397712784 397646561 397665253 397683449 397651062 397575798 397509727 397507019 397578621
2000C97578621R2163J1826j64299l72696n16014n09034l25546j8387K95487M83131
2010C96555252M55055K08893j64070n14145o98509o43616l80936l2615K44446L31688
2020C95361443K04124n9586l18450m39911l65067j35727J29738K97012K83051R4566
2030C95051193j79329m11071m97475m04358j80016P0763K34718K39907Q4953j62430
2040C93846855l97224n22805m93354l32833j23100L3951O2408n2795k59628m62876
2050C91298599n66597n16014l19633m4098K13699L66097L67546K29988J7013j82113
2060C90864487k86751k56653j07803R4108K61116L22190K55012R7313p1487j66779
2070C91004753j40381k937J81007L24784L60450K71645R8915p8010j79139j58538k7161
$$ plain form
2000 397578621 397670784 397682610 397518311 397145615 396629601 396120567 395795021 395776634 396072121 396555252
2010 396555252 397010307 397219200 397055130 396540985 395842476 395198860 394817924 394785309 395029755 395361443
2020 395361443 395565567 395505981 395187531 394747620 394382553 394246826 394376564 394673576 394956627 395051193
2030 395051193 394871864 394460793 393963318 393558960 393378944 393449707 393684425 393924332 394009285 393846855
2040 393846855 393449631 392926826 392433472 392100639 391977539 392011490 392073898 392021103 391761475 391298599
2050 391298599 390732002 390215988 389896355 389852257 390065956 390432053 390799599 391029587 391046600 390864487
2060 390864487 390577736 390321083 390213280 390307388 390568504 390890694 391145706 391243019 391171532 391004753
2070 391004753 390864372 390861435 391042442 391367226 391727676 391999321 392098236 392020226 391841087 391682549 391655388
2081C91655388J53618K97050L29514K23884J3428k19498l77235l90091k48413j0109
2091C91427536K22969L49655L15857J39351r6741k83127l34014k26403j0795K14157
2101C91718445L47709L32718J80436l7804k25029l04031k49672r7008P8964J98746
2111C91943474K13852J25046k2469j60523k27966j94816p2594R1591K31819K88505
2121C92215919K29760O5574j53389l51905m58870m36669k98881j07651N3177J15890
2131C90872955O0730p3509k07100k58789j84402L8K25639M00429M50478L51371J36376
2142C91774216j18790l26805m23126l88375k51541p7209O2637J17188P6065k6741j29090
2153C90288429j69449j15814J6709J72882K80532K86789J83945J4267j49040k37999
$$ plain form
2081 391655388 391809006 392106056 392435570 392659454 392672882 392453384 392076149 391686058 391437645 391427536
2091 391427536 391650505 392000160 392316017 392455368 392358627 392075500 391741486 391515083 391504288 391718445
2101 391718445 392066154 392398872 392579308 392541504 392316475 392012444 391762772 391665764 391744728 391943474
2111 391943474 392157326 392282372 392259903 392099380 391871414 391676598 391604004 391695595 391927414 392215919
2121 392215919 392445679 392511253 392357864 392005959 391547089 391110420 390811539 390703888 390757065 390872955
2131 390872955 390933685 390860176 390653076 390394287 390209885 390209923 390435562 390835991 391286469 391637840 391774216
2142 391774216 391655426 391328621 390905495 390517120 390265579 390188370 390251007 390368195 390444260 390417519 390288429
2153 390288429 390118980 390003166 390019875 390192757 390473289 390760078 390944023 390958290 390809250 390571251
2163C90571251k22359j24702q774N3787J8959j06582k67144l84254l94211k77138o7978
2174C88790855J56937L13339L41530K31629K6359j96495l53394l86962k88124r8191
2184C88537483J06964K46353K67258J66054r117j79482k70004k42615j14135N2642
2194C88561401J78261K03934J18446l7918j94702k84576k74544j77765m5090O1493
2204C88108940R7084N2300m5510j46064k00806j83106r9868J3427J08796J47209J16386
2215C87968788L4638n8060j20239j26877q1063r307N1193O9122L1090n6114j69983
2226C87533188k79617l54729l72620l24669k20565q9112K9717R9563J03913N5160r651
2237C86170578m7493l1700L2692J10321J53465J27716L0785j04141k22168k72141k29988
$$ plain form
2163 390571251 390348892 390224190 390215416 390269203 390288162 390181580 389914436 389530182 389135971 388858833 388790855
2174 388790855 388947792 389261131 389602661 389834290 389860649 389664154 389310760 388923798 388635674 388537483
2184 388537483 388644447 388890800 389158058 389324112 389314995 389135513 388865509 388622894 388508759 388561401
2194 388561401 388739662 388943596 389062042 389024124 388829422 388544846 388270302 388092537 388047447 388108940
2204 388108940 388206024 388258324 388212814 388066750 387865944 387682838 387582970 387596397 387705193 387852402 387968788
2215 387968788 388003426 387945366 387825127 387698250 387617187 387607880 387659073 387728195 387759285 387703171 387533188
2226 387533188 387253571 386898842 386526222 386201553 385980988 385891876 385921593 386021156 386125069 386180229 386170578
2237 386170578 386123085 386091385 386124077 386234398 386387863 386515579 386546364 386442223 386220055 385947914 385717926
2248C85717926j11656L2615J37826J53274O6567q6861k36664l07960k58713j02806
2258C85003548R2430K36854K61612J54534l4142k17285l15094k94762j82838m7684
2268C84657173L5858K2774q5220k43874l87916m54903m05769k36359K1171L04833N39932
2279C83767700O62079O42433N00717L00866J25656M2228P1488J80969L00827L57895
2289C86952858L10211J67160j5907j62659k09427j31492M7378K69013M66957N94101
2299C88288193O38046O16417N56793M75426L66707K10838m120k59170m95720o25649
2309C89767761n61905k56996K63176Q85239J421547J660118J442299P42187k87437
2318C95075989j343537k080116k260322j877404j172065n19448k35328m07830q55293
$$ plain form
2248 385717926 385606270 385638885 385776711 385929985 385996552 385909691 385673027 385365067 385106354 385003548
2258 385003548 385095978 385332832 385594444 385748978 385714836 385497551 385182457 384887695 384704857 384657173
2268 384657173 384693031 384715805 384630585 384386711 383998795 383543892 383138123 382901764 382922935 383227768 383767700
2279 383767700 384429779 385072212 385572929 385873795 385999451 386041679 386113167 386294136 386594963 386952858
2289 386952858 387263069 387430229 387414322 387251663 387042236 386910744 386958122 387227135 387694092 388288193
2299 388288193 388926239 389542656 390099449 390574875 390941582 391152420 391148300 390889130 390393410 389767761
2309 389767761 389205856 388948860 389212036 390097275 391518822 393178940 394621239 395363426 395075989
2318 395075989 393732452 391652336 389392014 387514610 386342545 385823097 385587769 385179939 384324646
2327C84324646j242485j285782r23233l40347J58272L36647J44920l16048r39178j738205
2337C78179207k827263m241028n714378o610680o119385l669014O57006N966491J0799828
2346C66420784J3689194J3762779J1091347O609153J669426k518158n294952o640091
2354C98789482o967125o797828o502038o211357n886955n448990m870262m193153l494416
2363C48417358k840194k265320j777229j365166j004334o57692k85148J35460N91087
2372C38948822J033516J407967J689491J905098K122268K404404K764702L144875L434639
2381C58855782L522567L348236K929993K355881J746559J211433Q14324N63469M21295
2390C75769539L29094K35748J19133o256j01776j28060p2517L8376J47743J95618J50184
$$ plain form
2327 384324646 383082161 381796379 380873146 380532799 380691071 381027718 381172638 380856590 379917412 378179207
2337 378179207 375351944 371110916 365396538 358785858 352666473 348997459 349654465 355620956 366420784
2346 366420784 380109978 393872757 404964104 411573257 413242683 410724525 405429573 398789482
2354 398789482 391822357 385024529 378522491 372311134 366424179 360975189 356104927 351911774 348417358
2363 348417358 345577164 343311844 341534615 340169449 339165115 338507423 338222275 338357735 338948822
2372 338948822 339982338 341390305 343079796 344984894 347107162 349511566 352276268 355421143 358855782
2381 358855782 362378349 365726585 368656578 371012459 372759018 373970451 374784775 375348244 375769539
2390 375769539 376098633 376334381 376453514 376447258 376345482 376217422 376144905 376183281 376331024 376526642 376676826
2401C76676826K5177j26380k39411k68860k10876j01586J831N0087K2011o7672j77575
2412C75583572k58522k73933k15645j05019J4687R7466J12991N9967l5324j29624j81846
2423C74668770j69487r5329J5029J23787J94626K03171J44882L6698q7319j86577k28233
2434C74620018k01073j21612k7390L9559N2108J0109o1454j27869j62544j60027j36299
2445C73723526j16196j18980j46790j85356k10190j99775j44806n3330N1499J38206
2455C72737808J77574J53885P2594l9177j40190j91345j72425r3040R727Q5907R5063
2466C72696381K5978r7351k24686l03345l02124k28042j21918m0131k6359q9760j99852
2477C71088791l01094l41072k95182j80511m6501M8370O3820m311j24359k43683l12461
$$ plain form
2401 376676826 376702003 376575623 376336212 376067352 375856476 375754890 375756721 375806808 375828819 375761147 375583572
2412 375583572 375325050 375051117 374835472 374730453 374745140 374842606 374955597 375015564 374980240 374850616 374668770
2423 374668770 374499283 374403954 374418983 374542770 374737396 374940567 375085449 375122147 375034828 374848251 374620018
2434 374620018 374418945 374297333 374269943 374309502 374361610 374371719 374310265 374182396 374019852 373859825 373723526
2445 373723526 373607330 373488350 373341560 373156204 372946014 372746239 372601433 372548103 372599602 372737808
2455 372737808 372915382 373069267 373141861 373102684 372962494 372771149 372598724 372505684 372515411 372601318 372696381
2466 372696381 372722359 372625008 372400322 372096977 371794853 371566811 371444893 371404762 371378403 371288643 371088791
2477 371088791 370787697 370446625 370151443 369970932 369924431 369972801 370036621 370032310 369907951 369664268 369351807
2488C69351807l03994k23083j02539J1635P8239P5607Q774r3498j90392k45132k38876
2499C68128548j77842r0675j4534J9684N34n9280j29433j75057j72195j19057l6964
2510C67173729L7155O8283L8567m0817j32790j89362j74369q2207N5733J83448K45018
2521C67182388K10343Q8958p3967k18200k94647k84729k04316r3956J183M8599M0016
2532C66401672q697o7253j04332j02349o5193j7051Q354j4878r1629k00004l00369
2543C65438271l52135l33710k51999j38588l5248K4643K9870p096n6915q7547p6790
2554C64152756k0790O4354J48239J97448J88942J22414K1820p1525j18218r9792k9869
2565C64555779N1269R6245P4882q888j19095k04849k26250j72844o7634M4822J18218
$$ plain form
2488 369351807 369047813 368824730 368722191 368733826 368812065 368887672 368896446 368802948 368612556 368367424 368128548
2499 368128548 367950706 367860031 367845497 367865181 367865715 367806435 367677002 367501945 367329750 367210693 367173729
2510 367173729 367210884 367279167 367317734 367276917 367144127 366954765 366780396 366698189 366753922 366937370 367182388
2521 367182388 367392731 367481689 367407722 367189522 366894875 366610146 366405830 366311874 366313057 366361656 366401672
2532 366401672 366392975 366325722 366221390 366119041 366053848 366036797 366045151 366030273 365938644 365738640 365438271
2543 365438271 365086136 364752426 364500427 364361839 364326591 364351234 364381104 364374008 364317093 364229546 364152756
2554 364152756 364131966 364196320 364344559 364542007 364730949 364853363 364875183 364803658 364685440 364585648 364555779
2565 364555779 364607048 364703293 364778175 364769287 364650192 364445343 364219093 364046249 363978615 364023437 364141655
2576C64141655J22757N3482p0190k13509l35999m02679l92227l04451j63307j1750
2586C62423782J00518J36032Q6021k3651j42822k18392k20527j55983o4888J182P553
2597C61928825m4098j16882j58615j33133m2610P0877J45378J34087L1585j20811k53410
2608C61441193l05443k54440j29014O409Q3580O4011m4899j95580l23868l78341l39394
2619C59624214k23427p1449O8054J55449J71776J20354K4872p9117j54496j75209j35765
2630C59325256n3863L5324R5367J03264O1951k251n3367o3706k9068K9831P7553Q3542
2642C59609833L7346m5281j30577j82457j81007j30158n6114N722K7123J52o0348j22872
2654C58771362j53923j32408n9624M1008J32599J79215J60599Q0070l7079j52168k28081
$$ plain form
2576 364141655 364264412 364317894 364247704 364034195 363698196 363295517 362903290 362598839 362435532 362423782
2586 362423782 362524300 362660332 362746353 362722702 362579880 362361488 362140961 361984978 361920090 361921272 361928825
2597 361928825 361884727 361767845 361609230 361476097 361433487 361504364 361649742 361783829 361815414 361694603 361441193
2608 361441193 361135750 360881310 360752296 360758705 360842285 360906296 360861397 360665817 360341949 359963608 359624214
2619 359624214 359400787 359329338 359397392 359552841 359724617 359844971 359869843 359790726 359636230 359461021 359325256
2630 359325256 359271393 359306717 359402084 359505348 359567299 359565048 359511681 359447975 359418907 359448738 359526291 359609833
2642 359609833 359647179 359601898 359471321 359288864 359107857 358977699 358921585 358927307 358954430 358954582 358894234 358771362
2654 358771362 358617439 358485031 358425407 358466415 358599014 358778229 358938828 359018898 358981819 358829651 358601570
2665C58601570k42309j93406j01013K175Q2473J14899R0981J9416p7324j70211k33307
2676C57893944k51160k23656j66664j04751o2828n4474p6332j09139j26724j09253
2686C56608963n4665J9188Q1673J04485P6751J0567o4125j14174j21460r0942m7951
2697C56408310k3651l7842q7433j47781j85814j77193j19858l6277L7002O5651L3569
2708C55728683n0926j58081k50664k98805k90870k37618j65596j05286p9994r7389
2718C53993454j48582k13471k68784k96516k89154k50854j95618j42136j07727j02844
2728C51977768j26343j65443k00043k11792j93138j51939j09635q8692j01356j39160
2738C50490227j76850j83982j43700o3896K2430P2632N4283l6812j73492l08266l93486
$$ plain form
2665 358601570 358359261 358165855 358064842 358067017 358149490 358264389 358355370 358374786 358297462 358127251 357893944
2676 357893944 357642784 357419128 357252464 357147713 357084885 357030411 356954079 356844940 356718216 356608963
2686 356608963 356554298 356573486 356655159 356759644 356836395 356846962 356782837 356668663 356547203 356456261 356408310
2697 356408310 356384659 356346817 356259384 356111603 355925789 355748596 355628738 355592461 355629463 355695114 355728683
2708 355728683 355677757 355519676 355269012 354970207 354679337 354441719 354276123 354170837 354090843 353993454
2718 353993454 353844872 353631401 353362617 353066101 352776947 352526093 352330475 352188339 352080612 351977768
2728 351977768 351851425 351685982 351485939 351274147 351081009 350929070 350819435 350730743 350629387 350490227
2738 350490227 350313377 350129395 349985695 349921799 349944229 350016861 350071144 350034332 349860840 349552574 349159088
2749C49159088m00734l31268k12784q6975N951M0131Q964p4501j84021k87476l55796
2760C47280579l71552l34930k64321j90277j43814j42021j79024k27508k51122k24075
2770C44951935j45531m5471K9373L7804l2883j57165k80610l45916l21312k18087q6364
2781C43385773R765K2393n5848j90239l22113l98902l99361l40843k68097k28234k45895
2792C40968399l11432l87115m25530l93867k90070j43547k289Q8234J03531M9133m5471
2803C39209976j42441k12822k47001k54517k53105k56500k66495k75192k71988k53372
2813C36776543k26403k04849k01607k22511k65350l25318m01191m97895o24351p88040
2823C33019028r88808j216850j454087j674499j845818j928978j882209j670037j278476
$$ plain form
2749 349159088 348758354 348427086 348214302 348127327 348133278 348173409 348182373 348107872 347923851 347636375 347280579
2760 347280579 346909027 346574097 346309776 346119499 345975685 345833664 345654640 345427132 345176010 344951935
2770 344951935 344806404 344760933 344790306 344828110 344795227 344638062 344357452 344011536 343690224 343472137 343385773
2781 343385773 343395538 343417931 343362083 343171844 342849731 342450829 342051468 341710625 341442528 341214294 340968399
2792 340968399 340656967 340269852 339844322 339450455 339160385 339016838 339014549 339102783 339206314 339255447 339209976
2803 339209976 339067535 338854713 338607712 338353195 338100090 337843590 337577095 337301903 337029915 336776543
2813 336776543 336550140 336345291 336143684 335921173 335655823 335330505 334929314 334431419 333807068 333019028
2823 333019028 332030220 330813370 329359283 327684784 325838966 323909988 322027779 320357742 319079266
2832C19079266p28074p9631N75714J138782J529942J710892J690750J516113J251144
2841C27684898R55658O72455M23737K16713N0811p6675j68800k30561k69127k93540
2851C28965569l12348l31650l54347l81966m15534m56162n04379n57595o10084o54183
2861C24387321o84356p00684p09953p23953p52373p97157q49133q90045r00288q67691
2871C16511688p95707p03869o22120n79434n91716o55270p46842q33396q84991q88519
2881C09209824q52604q04501p77607p97119q69141r78222j095542j190930j245441
2890C00598717j255760j232911j194286j156139j128235j113529j109696j111336j110344
2899B90186481j097984j066131j010895r34811q46214p55844o70567n90572n10884
$$ plain form
2832 319079266 318351192 318271561 318847275 319986057 321515999 323226891 324917641 326433754 327684898
2841 327684898 328640556 329313011 329736748 329953461 330004272 329927597 329758797 329528236 329259109 328965569
2851 328965569 328653221 328321571 327967224 327585258 327169724 326713562 326209183 325651588 325041504 324387321
2861 324387321 323702965 323002281 322292328 321568375 320816002 320018845 319169712 318279667 317379379 316511688
2871 316511688 315715981 315012112 314389992 313810558 313218842 312563572 311816730 310983334 310098343 309209824
2881 309209824 308357220 307552719 306775112 305977993 305108852 304130630 303035088 301844158 300598717
2890 300598717 299342957 298110046 296915760 295759621 294631386 293517857 292408161 291296825 290186481
2899 290186481 289088497 288022366 287011471 286076660 285230446 284474602 283804035 283213463 282702579
2908B82702579m27684l45059k77958k47516k71797l57419m95262o64940q42475j008835
2918B77763634j152401j267491j349659j393699j393795j346436j252212j115036r40819
2927B66552086p36504n11646k82478p2041R3403J95217K31209K20299J94626J85756
2937B66069927K07424K49539K82345K72693K01702P3986q5086k43874l78857m84523
2947B66165276n69249o44016p09591p50294p39116o48918m67472k04392J09501M30336
2957B61972065P13959R25274J045780J073761J023903R21154P94639O68984N56965
2966B69696484M56676L54176K33764Q9417o7425k10056l07923l42044l15838k54059
2976B69333172j89324j44062j16691q2016m826J38912L45993N82314P95956R37347
$$ plain form
2908 282702579 282274895 281929836 281651878 281404362 281132565 280775146 280279884 279614944 278772469 277763634
2918 277763634 276611233 275343742 273994083 272600384 271206589 269860153 268607941 267492905 266552086
2927 266552086 265815582 265303936 265021458 264949417 265042820 265238037 265469246 265689545 265884171 266069927
2937 266069927 266277351 266526890 266809235 267081928 267283630 267357616 267272530 267028656 266649799 266165276
2947 266165276 265596027 264952011 264242420 263492126 262753010 262104092 261636620 261432228 261541729 261972065
2957 261972065 262686024 263611298 264657078 265730839 266754742 267675896 268470535 269139519 269696484
2966 269696484 270153160 270507336 270741100 270830517 270763092 270553036 270245113 269903069 269587231 269333172
2976 269333172 269143848 268999786 268883095 268801079 268796253 268935165 269281158 269863472 270659428 271596775
2986B71596775R78928R25216Q08392O75125N69153N19142N31712N94692O83479P71027
2996B78653641Q35991Q69732Q77437Q75206Q83007R15184R74121J046563J108264J132470
3006B88171616J100425J010361Q79765P40318O26926N64118N55629N82238O09073O00357
3016B95440826N36042M21295K85759J69105J02864R3918J20639J42098J17225K3880
3026B97453651j29261l06530m58946n44472n44242m69037l54270k45667j81675j80931
3036B94038620k37675l29075m27608n15575n90706o63491p45163q35476r17415r64947
3046B87811489r57756q97179q10089p38506p18441p61127q46043r32694r83715r84745
3056B79181194r51729r19418r18903r59091j021309j071358j079788j040287r72023
$$ plain form
2986 271596775 272575703 273500919 274309311 274984436 275553589 276072731 276604443 277199135 277882614 278653641
2996 278653641 279489632 280359364 281236801 282112007 282995014 283910198 284884319 285930882 287039146 288171616
3006 288171616 289272041 290282402 291162167 291902485 292529411 293093529 293649158 294231396 294840469 295440826
3016 295440826 295976868 296398163 296683922 296853027 296955891 297049809 297170448 297312546 297429771 297453651
3026 297453651 297324390 297017860 296558914 296014442 295470200 295001163 294646893 294401226 294219551 294038620
3036 294038620 293800945 293471870 293044262 292528687 291937981 291274490 290529327 289693851 288776436 287811489
3046 287811489 286853733 285956554 285146465 284407959 283689518 282928391 282082348 281149654 280165939 279181194
3056 279181194 278229465 277310047 276391144 275432053 274410744 273339386 272259598 271219311 270247288
3065B70247288r09462q84209r09309r75628j059036j133500j182270j201572j198444
3074B60793858j183854j167564j155758j150379j150036j150627j145592j129207j098442
3083B50462399j056691j013622r81407r69162r76887r95254j009884j009255r91363
3092B41458874r65252r45110r40648r49344r54876r34677q72040p67422o41212n25971
3102B32962322m52060m31805m53301m84809m89789m43840l45153k13166p6999M0035
3112B29611435J31741K08168K87227L79830M82463N77908O46191O78424O84739O91146
3122B34379272P26109Q03528R12552J020794J088943J091652J031647R40189Q63419
3131B42858105Q39538Q81119R69162J062336J117764J109428J038761R31015Q22125
$$ plain form
3065 270247288 269337826 268453617 267544308 266568680 265509644 264376144 263193874 261992302 260793858
3074 260793858 259610004 258442440 257286682 256136303 254986267 253835640 252690048 251560841 250462399
3083 250462399 249405708 248392086 247410679 246441517 245464630 244469376 243459492 242450237 241458874
3092 241458874 240493622 239548512 238607864 237658520 236703644 235768967 234896927 234129505 233488293 232962322
3102 232962322 232510262 232078457 231625156 231140347 230650558 230206718 229861565 229648399 229571400 229611435
3112 229611435 229743176 229951344 230238571 230618401 231100864 231678772 232324963 233003387 233688126 234379272
3122 234379272 235105381 235908909 236821461 237842255 238931198 240022850 241054497 241994686 242858105
3131 242858105 243697643 244578762 245547924 246610260 247728024 248837452 249876213 250807228 251629353
3140B51629353P42492P06253P08981P32193P53002P50999P14093O39953N36290M17766
3150B58331375L01666K02065J24969O6758J8806k5291o3839q5945p9537m2858Q316
3161B58756485M2858K8057n0964j79920l18203m18320m50172m18816l62282l29685
3171B56299038l54557m33331n28335n88627n81265n10463m17919l59650l76701m71840
3181B51676350o10047p35969q02441p91740p20368o26869n51777n19657n33218n77889
3191B45206375o33278o83040p19700p43351p58209p68605p77740p88708q04348q27522
3201B37701874q60005r00440r43508r80110j000004r96113r68342r25865q85448q65002
3211B28377037q75683r15527r69162j014748j034393j024094r95578r70078r66778
$$ plain form
3140 251629353 252371845 253078098 253787079 254519272 255272274 256023273 256737366 257377319 257913609 258331375
3150 258331375 258633041 258835106 258960075 259026833 259045639 259020348 258956509 258870564 258791027 258748169 258756485
3161 258756485 258799343 258827400 258776436 258596516 258278313 257859993 257409821 256991005 256628723 256299038
3171 256299038 255944481 255511150 254982815 254394188 253812923 253302460 252884541 252524891 252148190 251676350
3181 251676350 251066303 250330334 249527893 248736153 248015785 247388916 246837139 246317482 245784264 245206375
3191 245206375 244573097 243890057 243170357 242427006 241668797 240900192 240122452 239333744 238529396 237701874
3201 237701874 236841869 235941429 234997921 234017811 233017807 232021694 231053352 230127487 229242039 228377037
3211 228377037 227501354 226585827 225616665 224601917 223567524 222543430 221547852 220577774 219610996
3220B19610996r91478j032009j063461j059284j004086r00764p71256o47640n61657
3229B11579361n32150n58129o17790o76212o97842o61487n69001m45118l26042k41737
3239B06253853k01550j88808j70288j12629j53J58081L33081M89807O03103O65989
3249B07830486O90060O98719P17831P68165Q61130R95922J159039J326770J472016
3258B16520138J574688J630916J655674J675511J713714J776047J845760J891823J887360
3267B32171631J826019J727352J626816J556282J527691J529064J535073J525573J497784
3276B46523285J466579J450596J456185J469345J461219J405983J297665J156120J018467
3285B58705444R20201Q77533Q81214R04617R19170R08700Q75034Q31623P93095P66086
$$ plain form
3220 219610996 218619518 217587509 216524048 215464764 214460678 213559914 212788658 212141018 211579361
3229 211579361 211047211 210489082 209871292 209195080 208497238 207835751 207266750 206821632 206495590 206253853
3239 206253853 206052303 205863495 205693207 205580578 205580425 205738506 206071587 206561394 207164497 207830486
3249 207830486 208520546 209219265 209937096 210705261 211566391 212562313 213721352 215048122 216520138
3258 216520138 218094826 219725742 221381416 223056927 224770641 226546688 228392448 230284271 232171631
3267 232171631 233997650 235725002 237351818 238908100 240435791 241964855 243499928 245025501 246523285
3276 246523285 247989864 249440460 250896645 252365990 253827209 255233192 256530857 257686977 258705444
3285 258705444 259625645 260503178 261384392 262289009 263208179 264116879 264991913 265823536 266616631 267382717
3295B67382717P47814P30496P08141O79989O48441O14624N74360N19409M41990L41702
3305B73389683K28367J20296L8834M00J1578O7177J52034K44599L21045L61347L52268
3316B75287628K93560J98651R2983N703m0360l8833l109L8967N7678L5362k4357r8323
3328B75805550j55049j71375j43337q8940l7212j3142k4471n7564q5678q4515m5738
3339B74898529J7071P4501R6283O5803j1215j09329j95332k43454k46143k15626j75838
3350B73955250j49994j49441j69353j94512k07882k00271j74351j40801j12056r3708
3360B72362881q3618p2442m9934r861M7150J13659J77383K23866K40993K22397J72558
3371B73345032J06430M5910R575K651J2722J4095j7319q7852j78528k50301k63138
$$ plain form
3295 267382717 268130531 268861027 269569168 270249157 270897598 271512222 272086582 272605991 273047981 273389683
3305 273389683 273618050 273738346 273777180 273777580 273789158 273856335 274008369 274252968 274574013 274935360 275287628
3316 275287628 275581188 275779839 275872822 275878525 275838165 275799332 275796223 275835190 275892868 275928230 275903873 275805550
3328 275805550 275650501 275479126 275335789 275246849 275209637 275196495 275172024 275114460 275028782 274944267 274898529
3339 274898529 274915600 274990101 275086384 275152187 275140972 275031643 274836311 274592857 274346714 274131088 273955250
3350 273955250 273805256 273655815 273486462 273291950 273084068 272883797 272709446 272568645 272456589 272362881
3360 272362881 272279263 272206821 272156887 272147026 272194176 272307835 272485218 272709084 272950077 273172474 273345032
3371 273345032 273451462 273497372 273506947 273509598 273522320 273536415 273519096 273431244 273252716 273002415 272739277
3382B72739277j97392o7043Q3447J97620K30675J68457L2272j30901k66896l33213
3392B72456303l12710k18048q5297L8433J12286J16997O1626k0046q4992j01051o0940
3403B71902561J5202R2716J42117J54266J43528J36299J51882J89324K25257K27604
3413B73380756J74237O7653o3781j77937k37560k26498j54400n0583N0335J21708J52340
3424B73036270J46122J16005P7763M4231K4014K0370L1300M9762O6929P5455P3757
3435B73761978O5804N6419M3545J5240m5357j45970k71034l77846m10995l29571j32484
3446B72229729J33018L89729N65414O25324N84660M91581L96862L25737K73056K18258
3456B76233368J49956P9403L4923M2038J05324K02961K98214L57971L66592L29285
$$ plain form
3382 272739277 272541885 272474842 272558289 272755909 272986584 273155041 273187313 273056412 272789516 272456303
3392 272456303 272143593 271925545 271840248 271878681 271990967 272107964 272169590 272149544 272064552 271963501 271902561
3403 271902561 271917763 272010479 272152596 272306862 272450390 272586689 272738571 272927895 273153152 273380756
3413 273380756 273554993 273622646 273558865 273380928 273143368 272916870 272762470 272711887 272762222 272883930 273036270
3424 273036270 273182392 273298397 273376160 273420391 273444405 273464775 273496075 273545837 273612766 273688221 273761978
3435 273761978 273827782 273884201 273927746 273942986 273897629 273751659 273480625 273102779 272691784 272362213 272229729
3446 272229729 272362747 272752476 273317890 273943214 274527874 275019455 275416317 275742054 276015110 276233368
3456 276233368 276383324 276462727 276497650 276539688 276645012 276847973 277146187 277504158 277870750 278200035
3466B78200035K67258K08912J82514K08263K88315L98655M90875N09815M22802K44542
3476B81421986L9672j05609j28861k6798J43871L01495L88622M02851L86410L88794
3486B83212433M25548M70982M83761M48990L96671L80554M31042N16472N51681M50440
3496B87768574J93538j40972m09412m83475l28731l0613K53391L85723L27015J53828
3506B87688866O656L739J75667M58030P39689R29985J000691R81731R19609Q36144
3516B93740807P13863N16777K27737j26800m79527p50293q77037q34618o33545l10326
3526B91187038P8202M56524P38048Q50067P74327N78994M08993M23584O98910J155605
3536B97350292J564446J648082J235981L82863o26889j407814j668472j363163p05376
$$ plain form
3466 278200035 278467293 278676205 278858719 279066982 279355297 279753952 280244827 280754642 281177444 281421986
3476 281421986 281461658 281356049 281227188 281200390 281344261 281645756 282034378 282437229 282823639 283212433
3486 283212433 283637981 284108963 284592724 285041714 285438385 285818939 286249981 286766453 287318134 287768574
3496 287768574 287962112 287821140 287411728 286928253 286599522 286568909 286822300 287208023 287535038 287688866
3506 287688866 287695522 287699261 287874928 288332958 289072647 290002632 291003323 291985054 292904663 293740807
3516 293740807 294454670 294971447 295199184 295072384 294592857 293842564 292965527 292130909 291497364 291187038
3526 291187038 291265240 291721764 292459812 293309879 294084206 294663200 295072193 295495777 296194687 297350292
3536 297350292 298914738 300562820 301798801 302181664 301554775 300146961 298478489 297115326 296409950
3545B96409950l5400L75881M66251L80364L40099M86584Q02021J160088J451015J671543
3555C03508396J900234K171154K352314K148610J264858l55854k383080m164524n004597
3564C01437511m509639k802239m75826J683922L049087L384991K869263J928520J019745
3573C07585335M75235M47998R20906J718998K519989K904453K496147J160507q40168
3582C19389400k869663m158764m170990k891292q59032J090183K236691K303333J525459
3591C11595325M47617l97663p30400n60570n9814O01387J321983K021503K556229K707920
3601C19503517K282753J259995j26381j445046k242870k242813j457253j78489J127624
3610C16481037J967278J967792J016236o31905k341328l256263k650567l47099L019810
$$ plain form
3545 296409950 296374550 296750431 297216682 297597046 297937145 298423729 299225750 300385838 301836853 303508396
3555 303508396 305408630 307579784 309932098 312080708 313345566 312989712 310606632 306442108 301437511
3564 301437511 296927872 294125633 293649807 295333729 298382816 301767807 304637070 306565590 307585335
3573 307585335 308060570 308508568 309429474 311148472 313668461 316572914 319069061 320229568 319389400
3582 319389400 316519737 312360973 308189983 305298691 304439659 305529842 307766533 310069866 311595325
3591 311595325 312042942 311645279 310914879 310354309 310294495 310895882 312217865 314239368 316795597 319503517
3601 319503517 321786270 323046265 322919884 321474838 319231968 316989155 315531902 315353413 316481037
3610 316481037 318448315 320416107 321432343 320800438 318459110 315202847 312552280 312205181 315224991
3619C15224991O116142P439880O052628K129898l008156p453079r579124q767910n611630
3628C02543640j516762K019539M053364M449005L711186K599907J788234J692562K440567
3637C23781242L860169N450783O419258N900764L368454r52797n958099r997864j1590004
3646C20281906j0145454o291485j583328K247791M091682L871136K393723Q03241r021
3655C15660191K78492J459198L050079M541969N519371N685349M890747L214798J027450
3664C45327644j085510k566872l189315l204422l197136l700638m805641o029320o552887
3673C10995903n686073l274594J98002L846951O784858Q427906Q569794P268715M718666
3682C41850128J238365k641945o138267q356361q616982o791763l431149M24175L661480
$$ plain form
3619 315224991 321341133 328781013 334833641 336963539 333955383 326502304 316923180 308155270 302543640
3628 302543640 301026878 303046417 307099781 311548786 315259972 317859879 319648113 321340675 323781242
3637 323781242 327641411 333092194 339511452 345412216 348780670 347827873 341869774 331871910 320281906
3646 320281906 310136452 303844967 302261639 304509430 308601112 312472248 314865971 315669212 315660191
3655 315660191 315938683 317397881 320447960 324989929 330509300 336194649 341085396 344300194 345327644
3664 345327644 344242134 341675262 338485947 335281525 332084389 328383751 323578110 317548790 310995903
3673 310995903 305309830 302035236 302233238 306080189 312865047 321292953 329862747 337131462 341850128
3682 341850128 343088493 340446548 334308281 325951920 317334938 310543175 307112026 307536201 311197681
3691C11197681N513230N762081M675598K783012O68107j127243k126923j985741o45332
3700C24714470J497879L586502M570427L687897R15527k894134o319161p993507p229023
3709C14536877m308720l13816L396912N758419O345253N374755L451119J246185p18612
3718C34768372k126961k814408k701797j784210j79787J804161L650665M707032M369583
3727C39692650K347107j095772n049553q151550r066658p101288k654095K784729P185498
3736C18891068Q875007P335434L459168r17626l976822m840507l932953k579575k102813
3745C20210381k977105m558506n540390m828243k272968J194362M094449N252037M439468
3754C15013485K440071N31292k62108L04280J661186K843380L057174K068558K38648
$$ plain form
3691 311197681 316710911 322472992 327148590 329931602 330599709 329472466 327345543 325359802 324714470
3700 324714470 326212349 329798851 334369278 338057175 338972702 336078568 329759407 321765900 314536877
3709 314536877 310228157 309914341 313311253 319069672 325414925 330789680 334240799 335486984 334768372
3718 334768372 332641411 329827003 327125206 325340996 325161209 326965370 330616035 335323067 339692650
3727 339692650 342039757 340943985 335894432 327742882 318676224 311574936 308920841 311705570 318891068
3736 318891068 327766075 335101509 338560677 337643051 333666229 328825722 324892769 322313194 320210381
3745 320210381 317233276 312674770 307134380 302306137 300033169 301227531 305321980 310574017 315013485
3754 315013485 317453556 317984848 317722740 318027020 319688206 322531586 325588760 327657318 327895966
3763C27895966j732369l151932l583851k930011j391983O06994K508221L733807L859672
3772C25814514K801743R11255j120263k546577k915115k276993j128616j06068L80726
3781C19814606L52707J82685L01857Q95691J791115K597618K982140K873878K458268
3790C34250565J978988J517372R24340l2769j423645l003921m292488m842720m520264
3799C20555458l583851k500553j620960r45530j56708J094704K848873M689503N910720
3808C26291656N904809M521942K167930m18167k554855l922424m598542m837913m783516
3817C17770920m330387l241330j418476Q81405L068600M491157M789792M101791K973137
3826C29086609K022323J566773J447372J162529K26708j472130l545799n286904o047763
$$ plain form
3763 327895966 326163597 323011665 319427814 316497803 315105820 315712814 318221035 321954842 325814514
3772 325814514 328616257 329527512 328407249 325860672 322945557 320668564 319539948 319433880 319814606
3781 319814606 320167313 320349998 320651855 321547546 323338661 325936279 328918419 331792297 334250565
3790 334250565 336229553 337746925 338671265 338638496 337214851 334210930 329918442 325075722 320555458
3799 320555458 316971607 314471054 312850094 311904564 311747856 312842560 315691433 320380936 326291656
3808 326291656 332196465 336718407 338886337 338468170 335913315 331990891 327392349 322554436 317770920
3817 317770920 313440533 310199203 308780727 309662132 312730732 317221889 322011681 326113472 329086609
3826 329086609 331108932 332675705 334123077 335285606 335512314 334040184 330494385 325207481 319159718
3835C19159718n579110m121894k199784k62546J577358L519745N766964Q131180R852180
3844C35843811R816589P131577J759949n161438j1573410j5268898j4844418j0362530
3852B97341232l376331L710079Q642063J0199814Q566342N053901J379357j127243
3860C30389214k007981j679992j031380q64449j479568k579422l491249l562317k509575
3869C11183281n60951J660747L428040M218178L896312K705460J105690m35524j588860
3878C25612373k206802k285614j914864j253261n22461K7199K07595R423l37258m32453
3888C16903877Q9569J320649K945175M316101M727821L752785J464424j567574m502677
3897C29450150o553879p252770o551628m757404k367401J02119K233677L759098M561539
$$ plain form
3835 319159718 313580608 309458714 307258930 306996384 308573742 312093487 317860451 325991631 335843811
3844 335843811 345660400 352791977 354551926 349390488 337817078 322548180 307703762 297341232
3852 297341232 293964901 297674980 306317043 316516857 325083199 330137100 331516457 330389214
3860 330389214 328381233 326701241 325669861 324805412 323325844 320746422 317255173 313692856 311183281
3869 311183281 310622330 312283077 315711117 319929295 323825607 326531067 327636757 327201233 325612373
3878 325612373 323405571 321119957 319205093 317951832 317429371 317456570 317664165 317673588 317336330 316903877
3888 316903877 316993446 318314095 321259270 325575371 330303192 334055977 335520401 333952827 329450150
3897 329450150 322896271 315643501 309091873 304334469 301967068 302069187 304302864 308061962 312623501
3906C12623501M650574M125270L136979J862449M92058p70569j720390k192383k123489
3915C20084000j602745q59623j75000K46334L70293L26252K97413L78342M96044M59862
3925C20021172J09252n35850j232948j622506j425018o13613N46684J614437K181778
3934C19043388K059975J350937L75061m90379r79042j031151p80010m56887k62146
3943C18829746k71415m15555n39417n02357k61841J04122M47865O39076O32896M78363
3953C19141483K69986Q3770n6457j62697k42977k77748k35749j13182M2382J52721
3963C18601532J58825O0310r0751k36397l55854m65336n74284o45160o03772m05731
3973C15443382j03264J58310K32697R0408j39007k53392j40361J13964K77500J60541
$$ plain form
3906 312623501 317274075 321399345 324536324 326398773 326890831 326120262 324399872 322207489 320084000
3915 320084000 318481255 317621632 317446632 317692966 318063259 318389511 318686924 319065266 319561310 320021172
3925 320021172 320130424 319594574 318361626 316739120 315314102 314700489 315247173 316861610 319043388
3934 319043388 321103363 322454300 322829361 322338982 321359940 320328789 319548779 319091892 318829746
3943 318829746 318558331 318142776 317603359 317101002 316839161 316943283 317391148 318030224 318663120 319141483
3953 319141483 319411469 319495239 319438782 319276085 319033108 318755360 318519611 318406429 318448811 318601532
3963 318601532 318760357 318820667 318729916 318493519 318137665 317672329 317098045 316452885 315849113 315443382
3973 315443382 315340118 315498428 315731125 315821533 315682526 315429134 315288773 315402737 315680237 315840778
3983C15840778k06203n70011o63510m68349k94094n52101j354313k271939k542858
3992C06917400j713256l16716m1847l070774j0806904k2695408l5924072m6358604
4000A85989819
$$ plain form
3983 315840778 315634575 315064564 314401054 313932705 313638611 313086510 311732197 309460258 306917400
3992 306917400 305204144 304887428 304845581 301774807 290967903 268272495 232348423 185989819
4000 185989819
##END=$$ End of the data block
