##TITLE=$$ Begin of the data block
##JCAMP-DX=5.00 $$ ACD/SpecManager v 10.08
##SPECTROMETER/DATA SYSTEM=16PC
##DATE=Thu Sep 12 14:18:28 2013
##DATA TYPE=INFRARED SPECTRUM
##DATA CLASS=XYDATA
##ORIGIN=
##OWNER=
##NPOINTS=3601
##FIRSTX=400.00000000
##LASTX=4000.00000000
##MAXX=4000.00000000
##MINX=400.00000000
##MAXY=41.50677490
##MINY=16.46896744
##XFACTOR=1.0000000000
##YFACTOR=0.000000100000000
##FIRSTY=24.74333572
##DELTAX=1.00000000
##XUNITS=1/CM
##YUNITS=TRANSMITTANCE
##XYDATA=(X++(Y..Y))
400B47433357O2534847M5224209K4475365P558441j076355j476707K664337O591034
$$ 247433357 309968204 355192413 379667778 387226219 386149864 384673157 387337494 393928528
408C93928528P105408L782882j570587o477356r215584r366264p500076m546013j363487
$$ 393928528 401033936 404816818 403246231 396768875 387553291 378187027 370686951 366140938 364777451
417C64777451J341934K980919L164367J922493j66168k145615l126258k730179j236534
$$ 364777451 366119385 369100304 372264671 374187164 374020996 371875381 368749123 366018944 364782410
426C64782410O54297K249145L182678L451271L219719K612572J659203L96614j007500
$$ 364782410 365436707 367685852 370868530 374319801 377539520 380152092 381811295 382207909 381200409
435C81200409k245903k996025l077202k525063j545753m09775O32706J381111J694298
$$ 381200409 378954506 375958481 372881279 370356216 368810463 368400688 369033394 370414505 372108803
444C72108803J519394R40742J86463m46587p35474o50138l64075j37901j53695m11377
$$ 372108803 373628197 374568939 374755402 374308815 373573341 372923203 372559128 372421227 372267532 371856155
454C71856155p50503r73244r76181q04367o06651n32990o38771q43162r52187p33452
$$ 371856155 371105652 370132408 369156227 368351860 367745209 367212219 366573448 365730286 364778099 364044647
464C64044647k0294J182213K639961L926849M577790M306869L182526J645965L31917
$$ 364044647 364024353 365206566 367846527 371773376 376351166 380658035 383840561 385486526 385818443
473C85818443k32124J14365J089706K126350K668343K444572J577759M90799l18641
$$ 385818443 385586319 385700684 386790390 388916740 391585083 394029655 395607414 396098213 395779572
482C95779572n10483l4676Q75664J826286K433396K476272J973801J157608L52554
$$ 395779572 395269089 395234413 396110077 397936363 400369759 402846031 404819832 405977440 406329994
491D06329994j82571l75900l58277l63464n71366r92469j469612j792756j852035j715660
$$ 406329994 406147423 405771523 405413246 405049782 404478416 403485947 402016335 400223579 398371544 396655884
501C96655884j584320j646080j934929k291298k451286k208367j542702o40487K02904
$$ 396655884 395071564 393425484 391490555 389199257 386747971 384539604 382996902 382356415 382559319
510C82559319P34176Q57964O62384L54271J50146J77536M30145P82624J052322J081162
$$ 382559319 383293495 384151459 384813843 385168114 385318260 385495796 385925941 386708565 387760887 388842049
520C88842049Q03146K71339l66363r34563j305046j438408j372108j168556q62389
$$ 388842049 389645195 389916534 389550171 388615608 387310562 385872154 384500046 383331490 382469101
529C82469101m48647Q3809O98586J290779J718292J876106J759606J473198J171875
$$ 382469101 382020454 382104263 382802849 384093628 385811920 387688026 389447632 390920830 392092705
538C92092705R73320Q93554Q47207P08313L93982q0109o00205j006393j170006j055260
$$ 392092705 393066025 393959579 394806786 395515099 395909081 395828972 395228767 394222374 393052368 391997108
548C91997108p38372l73764j18943n1956j24855j84669o3782L07159Q27866J256294
$$ 391997108 391258736 390884972 390766029 390714073 390589218 390404549 390340767 390647926 391475792 392732086
558C92732086J329308R16404J11847p95974j464196j667060j397667q48961k96250
$$ 392732086 394061394 394977798 395089645 394293671 392829475 391162415 389764748 388915787 388619537
567C88619537M2305Q8349j00937l97453o75278q51784q93707q07266o30837m32320
$$ 388619537 388661842 388750191 388649254 388251801 387576523 386724739 385831032 385023766 384392929 383960609
577C83960609k95410k90985m41665p03087r75952j148301j144943r61723o70433l95584
$$ 383960609 383665199 383374214 382932549 382229462 381253510 380105209 378960266 377998543 377328110 376932526
587C76932526k72484l96080p74193j304932j792335k010498j797829j135864j73645
$$ 376932526 376660042 376263962 375489769 374184837 372392502 370382004 368584175 367448311 367274666
596C67274666Q25424J590271J947708J876297J490212R72633N05295K21901J93596
$$ 367274666 368100090 369690361 371638069 373514366 375004578 375977211 376482506 376704407 376898003
605C76898003M27780Q66089J384849J813698J987152J812515J321984O73713Q9989
$$ 376898003 377325783 378191872 379576721 381390419 383377571 385190086 386512070 387185783 387275772
614C87275772k36931k24762P3586N10521R21478J196404J310424J303139J228905J108398
$$ 387275772 387038841 386814079 386887665 387398186 388319664 389516068 390826492 392129631 393358536 394466934
624C94466934R10912N77240O9198n80635j246834j739006j873397j560669q69027k2010
$$ 394466934 395377846 395955086 396024284 395443649 394196815 392457809 390584412 389023743 388154716 388132706
634C88132706O81343R96322Q49610L79982j31455m11262l44925l9559K43569K49557
$$ 388132706 388814049 389810371 390659981 391039963 390908508 390497246 390152321 390112762 390356331 390605888
644C90605888j13716p23877j324463j683426j721229j525307j258697j042824r09615
$$ 390605888 390492172 389768295 388443832 386760406 385039177 383513870 382255173 381212349 380302734
653C80302734q45222q65936j026650j330795j611977j520843o97785R36127K969322
$$ 380302734 379457512 378591576 377564926 376234131 374622154 373101311 372403526 373339653 376308975
662C76308975M568100M860039L444214P10106k268563m247779m451714k960052o19355
$$ 376308975 380877075 385737114 389181328 389891434 387622871 383375092 378923378 375963326 375343971
671C75343971J449509K441177K205849J186142N3940o83136q72765o51283k38381K24038
$$ 375343971 376793480 379234657 381440506 382626648 382680588 381997452 381124687 380473404 380235023 380459061
681C80459061O95877J156196J528931J694183J575661J218834P87048M69971L70102
$$ 380459061 381154938 382311134 383840065 385534248 387109909 388328743 389115791 389585762 389955864
690C89955864M51240N74227N91202M27589J06812k81029o29997q56667r11140p80068
$$ 389955864 390407104 390981331 391572533 392000122 392106934 391825905 391195908 390339241 389428101 388648033
700C88648033m88396j03302K74163N37185O10505M77562J83219j89437n48401q16574
$$ 388648033 388159637 388056335 388330498 388867683 389478188 389955750 390138969 389949532 389401131 388584557
710C88584557r43566r13086p49016n16052l04527j96648k28500l68385n32456o29158
$$ 388584557 387640991 386727905 385978889 385462837 385158310 384961662 384733162 384364777 383832321 383203163
720C83203163o09474m92401l48282k56195k56615l34587m32129m86030m60053l61214
$$ 383203163 382593689 382101288 381753006 381496811 381240196 380905609 380473480 379987450 379527397 379166183
730C79166183k30102j18027o4773q4153j64718k81830m13399n51643p05223q87757
$$ 379166183 378936081 378818054 378753281 378669128 378504410 378222580 377809181 377257538 376552315 375664558
740C75664558j100082j314278j475677j524010j427040j208191r48105p53860p08504
$$ 375664558 374564476 373250198 371774521 370250511 368823471 367615280 366667175 365913315 365204811
749C65204811q27179j046562j255608j352958j299057j129608r30253p81860p18536
$$ 365204811 364377632 363331070 362075462 360722504 359423447 358293839 357363586 356581726 355863190
758C55863190p18117p31316p20291o83021o43578o23321o19317o10771n89714n90477
$$ 355863190 355145073 354413757 353693466 353010445 352366867 351743546 351124229 350513458 349923744 349333267
768C49333267o86073r48105j391182j942100k460328k800560k880325k711410k374840
$$ 349333267 348647194 347699089 346307907 344365807 341905479 339104919 336224594 333513184 331138344
777C31138344j962891j527977j075744o02150j45111J93481K80037K2812n53856j281319
$$ 331138344 329175453 327647476 326571732 325969582 325824471 326017952 326297989 326320801 325766945 324485626
787C24485626j890144k107811j770725q94089L31230J615810K683945L372383L671646
$$ 324485626 322595482 320487671 318716946 317822857 318154087 319769897 322453842 325826225 329497871
796C29497871L695984L606911L528786L501167L482132L392830L170929K806930K347184
$$ 329497871 333193855 336800766 340329552 343830719 347312851 350705681 353876610 356683540 359030724
805C59030724J871299J460457J169014J010437R54666R41162R03473P98416O29845
$$ 359030724 360902023 362362480 363531494 364541931 365496597 366437759 367341232 368139648 368769493
814C68769493M48265L23410L00446L63884M37126M17557K33917j14212n54161r77516
$$ 368769493 369217758 369541168 369841614 370205498 370642624 371060181 371294098 371179886 370625725 369648209
824C69648209j289826j444816j445809j324577j119270q66547o07720l92074k64588
$$ 369648209 368358383 366913567 365467758 364143181 363023911 362157364 361549644 361157570 360892982
833C60892982k43148k99187l63693l56865k27280K4262L49769O83518R74769J206055
$$ 360892982 360649834 360350647 359986954 359630089 359402809 359427071 359776840 360460358 361435127 362641182
843C62641182J390190J552582J713753J878471K035446K161484K229614K221222K135964
$$ 362641182 364031372 365583954 367297707 369176178 371211624 373373108 375602722 377823944 379959908
852C79959908J996498J837654J683769J524048J308708R75189M95720p8697o13365
$$ 379959908 381956406 383794060 385477829 387001877 388310585 389285774 389781494 389702797 389089432
861C89089432r32999r00764m89502J90773R30175J501313J748848J644783J288261
$$ 389089432 388156433 387255669 386766167 386956940 387887115 389388428 391137276 392782059 394070320
870C94070320Q52394N09415L62167M13094N76629P28875P71637O80656N17044L94287
$$ 394070320 394922714 395432129 395794296 396207390 396784019 397512894 398284531 398965187 399482231 399876518
880C99876518M18282O28776R75190J338272J585350J631126J469956J168212Q26722
$$ 399876518 400294800 400923576 401898766 403237038 404822388 406453514 407923470 409091682 409918404
889D09918404N34248L38974K44484K24609K43225K67220K72713K46696J89705J18065
$$ 409918404 410452652 410791626 411036110 411260719 411503944 411771164 412043877 412290573 412480278 412598343
899D12598343O0539M7951R7618J99890L18680M02908M09622L23334J63803k1476j76087
$$ 412598343 412658882 412706833 412804451 413004341 413323021 413725929 414135551 414458885 414622688 414601212 414425125
910D14425125k58064k51236j68495m0932R4872K08473K79312K96783K58599J71203
$$ 414425125 414167061 413915825 413747330 413706398 413801270 414009743 414289055 414585838 414844437 415015640
920D15015640N2109p3433j78642k47765k82669l01742l26004l62969l96576l92875
$$ 415015640 415067749 414994316 414815674 414567909 414285240 413983498 413657494 413294525 412897949 412505074
930D12505074l19024j65977L9978K42233L74146L83949K54021P171l00789n98983q22602
$$ 412505074 412186050 412020073 412060051 412302284 412676430 413060379 413314400 413321571 413020782 412421799 411599197
941D11599197r33876r35363q70057q04863q01887q88176j039352j184922j236839j128426
$$ 411599197 410665321 409729958 408859901 408055038 407253151 406364975 405325623 404140701 402903862 401775436
951D01775436q44230m28887K9984M35104P15599Q48961Q63533Q18405P75223P68128
$$ 401775436 400931206 400502319 400532303 400967407 401683006 402531967 403395500 404213905 404989128 405757256
961D05757256P90634Q01544P49969O06156L83148J36986n6267j37024r2239L4752J61705
$$ 405757256 406547890 407349434 408099403 408705559 409088707 409225693 409169426 409032402 408940163 408974915 409136620
972D09136620K05383J20048p9498l23906n20897n97915n36499l80326k13508j19934
$$ 409136620 409342003 409462051 409382553 409058647 408537750 407939835 407403336 407023010 406809502 406689568
982D06689568j44806k77138m61044o28891p33567p64808p43409p00988o62117o39038
$$ 406689568 406544762 406267624 405806580 405177689 404444122 403679314 402935905 402234917 401572800 400933762
992D00933762o38009o66160p32384q38280r71069j104927j213837j286583j332588
$$ 400933762 400295753 399629593 398897209 398058929 397087860 395982933 394769096 393482513 392149925
1001C92149925j371498j416244j457711j465835j405373j257858j035500p80945n55076
$$ 392149925 390778427 389362183 387904472 386438637 385033264 383775406 382739906 381958961 381403885
1010C81403885m18511m15000n61104q41942j213570j613960j977730k253914k418632
$$ 381403885 380985374 380570374 380009270 379167328 377953758 376339798 374362068 372108154 369689522
1019C69689522k477875k463913k426300k423096k508201k712288l016434l331108l496552
$$ 369689522 367211647 364747734 362321434 359898338 357390137 354677849 351661415 348330307 344833755
1028C44833755l321723k654534j458778J44844J895561L473358M605065N152931N145073
$$ 344833755 341512032 338857498 337398720 337543564 339439125 342912483 347517548 352670479 357815552
1037C57815552M742012M158935L583870L121414K781411K504310K207756J833268J374321
$$ 357815552 362557564 366716499 370300369 373421783 376203194 378707504 380915260 382748528 384122849
1046C84122849Q78524M22287P3433j44653k61994l44543m54102o13555p95060r42726
$$ 384122849 385001373 385423660 385497093 385352440 385090446 384745903 384291801 383678246 382883186 381940460
1056C81940460j012611j004563r67521r72786j075249j287308j579933j906929k234535
$$ 381940460 380927849 379923286 378955765 377982979 376907730 375620422 374040489 372133560 369899025
1065C69899025k554894k881393l229294l602066l990516m381791m770279n160408n561103
$$ 369899025 367344131 364462738 361233444 357631378 353640862 349259071 344488792 339328384 333767281
1074C33767281n977936o409302o845703p268601p644386p917518q010712p840748p344990
$$ 333767281 327789345 321380043 314534340 307265739 299621353 291703835 283693123 275852375 268507385
1083B68507385o509590n380802m056530k661190j317406j27582Q38623J552925K040901
$$ 268507385 261997795 256616993 252560463 249899273 248581867 248454285 249292908 250845833 252886734
1092B52886734K389870K739124L242302M006996N037689O211129P302074Q051472Q248272
$$ 252886734 255276604 258015728 261258030 265265026 270302715 276513844 283815918 291867390 300115662
1101C00115662P791023O711159N159607L372955J632309K20413o25305p62901j85967
$$ 300115662 307906685 314617844 319777451 323150406 324782715 325003128 324377823 323614922 323428955
1110C23428955R66606K440758L935471N179328N990067O296768O129112N587464M813194
$$ 323428955 324395561 326836319 330771790 335951118 341941185 348237953 354367065 359954529 364767723
1119C64767723L963966L188172K597999K241631K091179K056808K027016J915321J692505
$$ 364767723 368731689 371919861 374517860 376759491 378850670 380907478 382934494 384849815 386542320
1128C86542320J385956J051827P38792M65393K19688k4032k86331n72586q73337j166039
$$ 386542320 387928276 388980103 389718895 390184288 390403976 390379944 390093613 389521027 388647690 387481651
1138C87481651j416969j580620j606598j456375j125259o56624j35078L38401O81839
$$ 387481651 386064682 384484062 382877464 381421089 380295830 379639206 379504128 379842529 380524368
1147C80524368Q56552Q70209P59659N67093L23791M6692k52266n58624q54111j122780
$$ 380524368 381380920 382251129 383010788 383577881 383901672 383948364 383696098 383137474 382283363 381160583
1157C81160583j361351j585121j827087k129517k528991l038025l632775m251022m810562
$$ 381160583 379799232 378214111 376387024 374257507 371728516 368690491 365057716 360806694 355996132
1166C55996132n241318n516090n659828n721779n722771n606537n234527m440022l121147
$$ 355996132 350754814 345238724 339578896 333857117 328134346 322527809 317293282 312853260 309732113
1175C09732113j324864P33281K731247M360675N439721N962715O062736N915642N645790
$$ 309732113 308407249 309140530 311871777 316232452 321672173 327634888 333697624 339613266 345259056
1184C45259056N282021M784202M108086L265419K337685J443214O78978P8583l91922
$$ 345259056 350541077 355325279 359433365 362698784 365036469 366479683 367158661 367237244 366845322
1193C66845322q01506j209031j631584k045555k411575k708206k950135l184013l465347
$$ 366845322 366043816 364834785 363203201 361157646 358746071 356037865 353087730 349903717 346438370
1202C46438370l831787m289093m816170n382652n966721o564140p181435p822285q472366
$$ 346438370 342606583 338317490 333501320 328118668 322151947 315587807 308406372 300584087 292111721
1211B92111721r091988r617004r965286j0050316r795876r153766q117199o726399
$$ 292111721 283019733 273402729 263437443 253387127 243591251 234437485 226320286 219593887
1219B19593887n061321l225174j326980N31139K256699L769931N010243N949669O602192
$$ 219593887 214532566 211307392 209980412 210511551 212768250 216538181 221548424 227498093 234100285
1228B34100285P019195P264424P379226P361031P168388O754151O106777N272941M346829
$$ 234100285 241119480 248383904 255763130 263124161 270292549 277046700 283153477 288426418 292773247
1237B92773247L432102K603226J887550J278610P66468L63179J05648L3645J57681
$$ 292773247 296205349 298808575 300696125 301974735 302741203 303104382 303210030 303243675 303401356
1246C03401356M34189P61089R99641J016159P32403J69945n33314j144695j403542
$$ 303401356 303835545 304596634 305596275 306612434 307344837 307514782 306981468 305836773 304433231
1255C04433231j113166k24591J124535K639541L957558M762383M877853M304924L192597
$$ 304433231 303320065 303095474 304220009 306859550 310817108 315579491 320457344 324762268 327954865
1264C27954865J763725K32429j251106k612457l824234m863320n678768o190796o315059
$$ 327954865 329718590 329951019 328699913 326087456 322263222 317399902 311721134 305530338 299215279
1273B99215279o001778n262642m175529k867146j486282j80970R16558J703434K125225
$$ 299215279 293213501 287950859 283775330 280908184 279421902 279240932 280157490 281860924 283986149
1282B83986149K198200K021866J762905J607647J697388K076702K682171L376274M008350
$$ 283986149 286184349 288206215 289969120 291576767 293274155 295350857 298033028 301409302 305417652
1291C05417652M467163M702454M709148M495087M058418L389931K496872J431846L01972
$$ 305417652 309884815 314587269 319296417 323791504 327849922 331239853 333736725 335168571 335470543
1300C35470543p46651j567497k054100k167435j938095j449966q12035j35384M83170
$$ 335470543 334723892 333156395 331102295 328934860 326996765 325546799 324734764 324599380 325082550
1309C25082550R71031J289978J448097J503373J551933J690979J971931K365342K763176
$$ 325082550 326053581 327343559 328791656 330295029 331846962 333537941 335509872 337875214 340638390
1318C40638390L024177L041306K794609K357635J855927J402130J050033P91283N92575
$$ 340638390 343662567 346703873 349498482 351856117 353712044 355114174 356164207 356955490 357548065
1327C57548065M43001L76053M51851P10945J129379J606445J994973K164268K064400
$$ 357548065 357991066 358367119 358818970 359529915 360659294 362265739 364260712 366424980 368489380
1336C68489380J758156J399307J162338J153946J355820J633835J814956J791230J581573
$$ 368489380 370247536 371646843 372809181 373963127 375318947 376952782 378767738 380558968 382140541
1345C82140541J312294J123123J064530J060943R70955P03774L02581p4157k70653
$$ 382140541 383452835 384575958 385640488 386701431 387672386 388376160 388678741 388604584 388333931
1354C88333931k69394k46086m90418j239090k519035m097557n560532o469039o510506
$$ 388333931 388064537 387818451 387328033 386088943 383569908 379472351 373911819 367442780 360932274
1363C60932274n587464l834838j588478O85768K496910L466873L460121K639160J396675
$$ 360932274 355344810 351509972 349921494 350607262 353104172 356571045 360031166 362670326 364067001
1372C64067001J79749p01904j174088j351166j391449j368332j251907r98230o54793
$$ 364067001 364246750 363544846 362370758 361019592 359628143 358259811 357007904 356009674 355354881
1381C55354881l77426l26996n21621p69501p55921k42157P51458J909294K763214K933311
$$ 355354881 354977455 354650459 354128838 353359337 352603416 352361259 353112717 355022011 357785225 360718536
1391C60718536K323914J167602r4451j021996j361732j131134n77202m6387J74446
$$ 360718536 363042450 364210052 364115601 363093605 361731873 360600739 360023537 359977150 360151596
1400C60151596k4757n48935j168099j647033j860390j824494j629753j331329q93707
$$ 360151596 360126839 359577904 358409805 356762772 354902382 353077888 351448135 350116806 349223099
1409C49223099k42615O00739J418762J832542J491242L08914j411247l069649m043083
$$ 349223099 348980484 349581223 350999985 352832527 354323769 354632683 353221436 350151787 346108704
1418C46108704l985024k980270j477661n8480Q20885R91173N87578m4480n03769m99572
$$ 346108704 342123680 339143410 337665749 337607269 338428154 339419327 340006905 339962425 339458656 338959084
1428C38959084Q277P50962J231231R53179k84004k196579m077950n121918m842796
$$ 338959084 338967361 339718323 340949554 341902733 341618729 339422150 335344200 330222282 325379486
1437C25379486l337746j225662O93131J832466K024193J447792M08096q28056k025147
$$ 325379486 322041740 320816078 321509209 323341675 325365868 326813660 327221756 326393700 324368553
1446C24368553k884140l046760k297097q44001N83629J021557j50261k697639n488949
$$ 324368553 321484413 318437653 316140556 315296555 315880184 316901741 316751480 314053841 308564892
1455C08564892p043896o386547l663006r8953K706356L713264L007355J651020R43833
$$ 308564892 301520996 295134449 291471443 291372490 294078846 297792110 300799465 302450485 303394318
1464C03394318J586303L277722M964866N538159M513016K294921q8958j574211j606484
$$ 303394318 304980621 308258343 313223209 318761368 323274384 325569305 325480347 323906136 322299652
1473C22299652l56865J452675K975349L663788L486901K858314K343483K311630K719040
$$ 322299652 321942787 323395462 326370811 330034599 333521500 336379814 338723297 341034927 343753967
1482C43753967L138886L024788K067260M40903j213798k086869j633796Q2397K339478
$$ 343753967 346892853 349917641 351984901 352425804 351212006 349125137 347491341 347573738 349913216
1491C49913216M048919M276963K745170N1499k536202l668861k633477J66245L261566
$$ 349913216 353962135 358239098 360984268 361035767 358499565 354830704 352197227 352363472 355625038
1500C55625038M760399L306999j140938p173423j2562561j5351868j4792328j1589737
$$ 355625038 360385437 363692436 362551498 355378075 342815514 327463646 312671318 301081581
1508C01081581p344074l566303r00994R86424K871742N229530P825508R887124J0663547
$$ 301081581 293737507 290171204 289270210 290256634 293128376 298357906 306183414 316070538 326734085
1517C26734085R929581Q091621N890961L987846K730904K197723K340203L035278L999557
$$ 326734085 336663666 344755287 350646248 354634094 357364998 359562721 361902924 364938202 368937759
1526C68937759M737435M707374L684082K049408P03965N39894J781006L671684M809875
$$ 368937759 373675194 378382568 382066650 384116058 384820023 385359917 387140923 390812607 395622482
1535C95622482L978081R45854l286819o984253q594437p530899m380951m98924K701797
$$ 395622482 399600563 400546417 397259598 390275345 381680908 374150009 369769058 369270134 371971931
1544C71971931M343300M321328L188858J837654J121635J507797K828408M251747M579506
$$ 371971931 376315231 380636559 383825417 385663071 386784706 388292503 391120911 395372658 399952164
1553C99952164K838745j079865o126136j0399323j2001114j0006523n006790J105804
$$ 399952164 402790909 401711044 395584908 385185585 373184471 363177948 358171158 359276962
1561C59276962O010666Q024979O809959L395119m23775k964325l383369j951714J94512
$$ 359276962 365287628 373312607 380122566 383517685 383093910 380129585 376746216 374794502 374989014
1570C74989014J667976J522217k97814k956733n188675n980187n102157l184471j290779
$$ 374989014 376656990 378179207 377881393 374924660 369735985 363755798 358653641 355469170 354178391
1579C54178391k62604k50054p20215r02709l42217Q23746K020454K663651K525367
$$ 354178391 353915787 353665733 352945518 352042809 351700592 352524338 354544792 357208443 359733810
1588C59733810J797562Q67844L1700o31638j175689j631203j947785k074127k065239
$$ 359733810 361531372 362399216 362430916 361799278 360623589 358992386 357044601 354970474 352905235
1597C52905235k077942k242927k533417k779922k836304k748184k742424l010903l463478
$$ 352905235 350827293 348584366 346050949 343271027 340434723 337686539 334944115 331933212 328469734
1606C28469734l695526l255348k038784m87557O17409O65455l25890j658763k380066
$$ 328469734 324774208 321518860 319480076 318992519 319609928 320275383 319949493 318290730 315910664
1615C15910664j897831l68004J412144K508735K395535J188354n29022k094059l078194
$$ 315910664 314012833 313644829 315056973 317565708 319961243 321149597 320620575 318526516 315448322
1624C15448322l355026k987461k114601r62506P5322M45842l62701k495403n503006
$$ 315448322 312093296 309105835 306991234 306028728 306104050 306549892 306187191 303691788 298188782
1633B98188782q408470j0097523r849281p715989m544353j616345q4857m69285k434349
$$ 298188782 289780312 279682789 269833508 262117519 257573166 255956821 255871964 255402679 252968330
1642B52968330m948539o755658o959247n455303k989693p73830J81293l29056j520099
$$ 252968330 248019791 241264133 234304886 228849583 225859890 225086060 225267353 224938297 223418198
1651B23418198k013989o38981K816143P361737J1270828J3007660J2078552R287434
$$ 223418198 221404209 220765228 223581371 230943108 242213936 255221596 267300148 276587582
1659B76587582O234398M367790M177627N019379N646343N074082L202953Q12015j031055
$$ 276587582 282821980 287189770 291367397 296386776 302033119 307107201 310310154 311122169 310091114
1668C10091114j706657j415596r45607j024322j741104k462063k312546q91399J293640
$$ 310091114 308384457 306968861 306023254 304998932 303257828 300795765 298483219 297591820 298885460
1677B98885460L001976K967281O97766l148041p052040r424305r412861p276154m145012
$$ 298885460 301887436 304854717 305552483 302404442 295352402 285928097 276515236 269239082 265094070
1686B65094070j375045J04332R5214j001091k577476m191189n705795p187100q688869
$$ 265094070 263719025 263823357 263918571 262917480 260340004 256148815 250443020 243255920 234567051
1695B34567051j0098991j1135579j1475124j0917454r491729p453518n179272l010426
$$ 234567051 224468060 213332481 201857357 190939903 181448174 173994656 168815384 165804958
1703A65804958j115284N64118K246818M144841O272716Q336926R789753J0043277Q754464
$$ 165804958 164689674 165253792 167500610 171645451 177918167 186255093 196044846 206088123 214842587
1712B14842587O034927K475529j042996l669033m886818m674835l453922j853543m05330
$$ 214842587 220877514 223353043 222310047 218641014 213754196 209079361 205625439 203771896 203366566
1721B03366566O90193J613521K755509M409523O496525Q497772R673881R478455P932053
$$ 203366566 204056759 205670280 208425789 212835312 219331837 227829609 237503490 246981945 254913998
1730B54913998N709915L846779L196926L960533N573711P043419P535134O848545N491962
$$ 254913998 260623913 264470692 267667618 271628151 277201862 284245281 291780415 298628960 304120922
1739C04120922M316425L956738M438000N187721N425262M662819L005448J083069l12844
$$ 304120922 308437347 312394085 316832085 322019806 327445068 332107887 335113335 336196404 335883560
1748C35883560o51169R8000J506348K943611L878669M071236L591766K709198J735764
$$ 335883560 335232391 335330391 336836739 339780350 343659019 347730255 351322021 354031219 355766983
1757C55766983R14917L88184K22168M48455J063271J977692K955627L613014L533249
$$ 355766983 356681900 357070084 357292252 357740707 358803978 360781670 363737297 367350311 370883560
1766C70883560K476044N76286j610679l295594l810806k948647j081008J025390K592163
$$ 370883560 373359604 373935890 372325211 369029617 365218811 362270164 361189156 362214546 364806709
1775C64806709L184853K842255J940612R28307J23901l17306l23868J45225J040154
$$ 364806709 367991562 370833817 372774429 373702736 373826637 373509331 373185463 373330688 374370842
1784C74370842K103348K850570K757378J588173l53584k269860l249511k780152j072769
$$ 374370842 376474190 379324760 382082138 383670311 383316727 381046867 377797356 375017204 373944435
1793C73944435J027451K498283K694359J663971O3057j248017j663246j090088Q8387
$$ 373944435 374971886 377470169 380164528 381828499 381891556 380643539 378980293 377890205 377978592
1802C77978592J270828J941376J872940J172523J89400o53076j039200q83179l48281
$$ 377978592 379249420 381190796 383063736 384236259 384425659 383772583 382733383 381850204 381501923
1811C81501923K59628O69327P91053P37191P03430Q01506R69963J037560Q78982N31540
$$ 381501923 381761551 382430878 383221931 383959122 384662552 385464058 386434021 387471581 388350563 388882103
1821C88882103J64528p5531k06413m02184q20885j412429j879311j860161j206741
$$ 388882103 389046631 388971100 388764687 388362503 387541618 386129189 384249878 382389717 381182976
1830C81182976j38779Q74024J427536J465415J294747J313095J648636K005234J852607
$$ 381182976 381044197 381918221 383345757 384811172 386105919 387419014 389067650 391072884 392925491
1839C92925491Q39653q72841k619018l591461l324814j972389k03934J194916J749077
$$ 392925491 393765144 392892303 390273285 386681824 383357010 381384621 381180687 382375603 384124680
1848C84124680J486778Q19168K30827j182R6168K93808L52249J80512j21422l30048
$$ 384124680 385611458 386430626 386661453 386660271 386756439 387050247 387402496 387583008 387461586 387131538
1858C87131538k32048K41433R38186J515541J582871R12018l94364j888695k961196
$$ 387131538 386899490 387140923 388079109 389594650 391177521 392089539 391695175 389806480 386845284
1867C86845284l142586k356987r65348M31328J315918J501770J163712O58989K81486
$$ 386845284 383702698 381345711 380380363 380811691 382127609 383629379 384793091 385452080 385733566
1876C85733566J19438Q7700P1602M3259O2294J76391L30582L77579J91612k11029o49261
$$ 385733566 385853004 385940704 386012306 386055565 386117859 386294250 386624832 387002411 387194023 386982994 386333733
1887C86333733q86650p95136m46777o5461J31302P9232j03341k19917j46637Q3275
$$ 386333733 385447083 384651947 384205170 384139709 384271011 384350243 384246902 384026985 383880348 383963623
1897C83963623L22571M34189L93448K87323K20680K13737J83525K9107k50817n11627
$$ 383963623 384286194 384720383 385113831 385401154 385621834 385835571 386019096 386048203 385797386 385285759
1907C85285759n40657k14539L80211R62143J209068R55239K95982m67491j009178j159439
$$ 385285759 384745102 384530563 384910774 385872917 387081985 388037224 388333206 387865715 386856537 385697098
1917C85697098r74808o60248m14848l12119k86560k19497m4785K01836M15458N00718
$$ 385697098 384722290 384062042 383647194 383335075 383048515 382829018 382784233 382986069 383401527 383902245
1927C83902245M32853K62528P9460l6659m0932P2212K73285M94499O36559N94215L12195
$$ 383902245 384335098 384597626 384677086 384640427 384599495 384671707 384944992 385439491 386076050 386670265 386982460
1938C86982460j65138o86684j052170j110496q42629l72734R8191L98101M64020L51067
$$ 386982460 386817322 386130638 385078468 383967972 383125343 382752609 382850800 383248901 383712921 384063988
1948C84063988J77459M5281q354j2818k3422p5798j62659k39677k53105j71051o409
$$ 384063988 384241447 384286728 384278374 384265556 384242134 384166336 384003677 383764000 383510895 383339844 383333435
1959C83333435J81046L02238K78702Q4419k28310n41229p20634o85158m49524j20354
$$ 383333435 383514481 383816719 384095421 384179840 383951530 383410301 382689667 382004509 381554985 381434631
1969C81434631J60790K90451K52876J15738j8425p5111m3297L1547Q7853R2087N7831
$$ 381434631 381595421 381885872 382138748 382254486 382236061 382160950 382117653 382149200 382237053 382329140 382386971
1980C82386971L1471N6419J36185K25143K46811J39160j03798m14352o73256p65495
$$ 382386971 382418442 382474861 382611046 382836189 383083000 383222160 383118362 382704010 382030754 381265259
1990C81265259o40183l42560M845K62528L44123K55089P9041p7439j46370j29585q3732
$$ 381265259 380625076 380282516 380287361 380549889 380894012 381149101 381228142 381150703 381004333 380874748 380791016
2001C80791016p5913j37825k49596l53851l91006l29514j80244J0414J77841K63901
$$ 380791016 380715103 380577278 380327682 379973831 379582825 379253311 379073067 379083481 379261322 379525223
2011C79525223K36549J02959q9836k71378l75671l70713k71568j30615j0033M9553
$$ 379525223 379761772 379864731 379774895 379503517 379127846 378757133 378485565 378354950 378344917 378394470
2021C78394470M4022j145n1269q3046r2278q8157q1253p6256p0725o0653m4556k5444
$$ 378394470 378438492 378437347 378386078 378303032 378210754 378122597 378041344 377965088 377894363 377833710 377789154 377763710
2033C77763710j0452r995l4370q8730j66931k46544k95105k83623k05612q5030K9335
$$ 377763710 377753258 377743263 377708893 377620163 377453232 377206688 376911583 376627960 376422348 376337318 376366653
2044C76366653Q7853O4964k7962j48010k45323k85721k64129j98708j16348l7384K7961
$$ 376366653 376454506 376519470 376491508 376343498 376098175 375812454 375548325 375349617 375233269 375195885 375223846
2055C75223846P5798R8649Q5487K7809o9122j79634k63405k81563k16064q1902P7133
$$ 375223846 375299644 375398293 375483780 375511589 375442467 375262833 374999428 374717865 374501801 374419899 374497032
2066C74497032K06299K63443K37198J49231M1771m2916p8926o3858j3618M7951J00021
$$ 374497032 374703331 374966774 375203972 375353203 375394974 375352058 375273132 375209274 375195656 375243607 375343628
2077C75343628J28212J26762R6321M4098j6517o8055r4985r0828o2561k9450j3618
$$ 375343628 375471840 375598602 375694923 375739021 375722504 375654449 375559464 375468636 375406075 375376625 375363007
2088C75363007k9602p4959j31378j72768j78223j44348q6403l1776m769j4801n0888
$$ 375363007 375333405 375258446 375127068 374954300 374776077 374631729 374545326 374513550 374508781 374493980 374443092
2099C74443092q9874j08719r7961o4469k4528Q316L0174M5891N9967O8817O1989L1471
$$ 374443092 374353218 374244499 374146538 374082069 374057541 374065857 374096031 374141922 374201889 374270706 374332695 374364166
2111C74364166j7166o2981q0490n6839l204M9629O9199M1885j7700p6942j04866r3003
$$ 374364166 374347000 374284019 374203529 374146690 374143486 374193115 374262314 374304199 374286499 374209557 374104691 374011688
2123C74011688n8899l4752m5776r6588j66245k22320k35405j92375j00251J9265J38282
$$ 374011688 373952789 373918037 373872261 373775673 373609428 373387108 373151703 372959328 372859077 372878342 373016624
2134C73016624K30980K78702K73018K15340J16462n073j25847k21748k73323k71225
$$ 373016624 373247604 373526306 373799324 374014664 374131126 374126053 374000206 373778458 373505135 373233910
2144C73233910k20528j40076n6038P401L8223L9559K5787J2588P859Q354L891j4115
$$ 373233910 373013382 372873306 372817268 372824669 372862892 372902451 372928238 372940826 372948685 372957039 372960930 372946815
2156C72946815m6997q7547j23711j44195j42441j17569p5035k7122R155J6785j3352
$$ 372946815 372899818 372812271 372688560 372544365 372401924 372284355 372209320 372182198 372191353 372208138 372194786
2167C72194786p4806j44768j92375j92604j40076n1918L8986J00060J11503P2556j946
$$ 372194786 372119980 371975212 371782837 371590233 371450157 371398239 371437225 371537285 371648788 371721344 371719398
2178C71719398q9683j67542k16980k25753j91918j24626m4517K3536N9586N8060K8648
$$ 371719398 371629715 371462173 371245193 371019440 370827522 370702896 370658379 370681915 370741501 370799561 370828209
2189C70828209r422l9254n2452n1613m3602l3149k0676o523L815j221l2425q9989j56936
$$ 370828209 370818787 370779533 370727081 370675468 370631866 370598717 370578041 370571518 370575333 370574112 370541687 370451698 370294762
2202C70294762k03019k00347j39580l9292N9967J15052J02386L0403o5155j39808j63346
$$ 370294762 370091743 369891396 369751816 369712524 369772491 369887543 369989929 370020332 369955177 369815369 369652023
2213C69652023j33552p5112k2850l128j9874n6000q4267q4724n4245q278K8572L5019
$$ 369652023 369518471 369443359 369420509 369417381 369397507 369341507 369257240 369172516 369118271 369109993 369138565 369173584
2225C69173584L471n6724j23520j71814j83983j56364j00289l6430J3428L5019K5367
$$ 369173584 369177055 369120331 368996811 368824997 368641014 368484650 368384361 368347931 368361359 368396378 368421745
2236C68421745p362m8409q2969j00250r8038q1482o1989n1117n5313p0725q3580p7629
$$ 368421745 368414383 368365974 368283005 368182755 368084717 368003235 367941246 367890129 367834816 367764091 367680511 367602882
2248C67602882m4174R766O0997Q1215N2566k0218j10511j82152k09046j87492j36147
$$ 367602882 367558708 367568474 367629471 367710686 367763252 367743034 367632523 367450371 367241325 367053833 366917686
2259C66917686q3007m7684l2234k4224r689J2360K6588R308n3978j55258k63214l36304
$$ 366917686 366834679 366786995 366754761 366730537 366720848 366733208 366759796 366769104 366715126 366559868 366296654 365960350
2271C65960350l45116k88734j94817j02081l5210J2055P3051J84059L53966N49317
$$ 365960350 365615234 365326500 365131683 365029602 364994392 365006447 365079498 365263557 365617523 366166840
2281C66166840P04612P55425O73446M83475K50740M7570p7782j17149r3689m0780J5297
$$ 366166840 366871452 367626877 368300323 368783798 369034538 369082108 369004326 368887177 368793488 368752708 368768005
2292C68768005O3401J04141J45759K01607K88429M19198N89561P68089Q98781R20792
$$ 368768005 368831406 368935547 369081306 369282913 369571342 369990540 370580101 371348190 372246971 373167763
2302C73167763P98263N41725K07482j21575l65829m67377l96118j46599K59743P63626
$$ 373167763 373966026 374507751 374715233 374593658 374227829 373760452 373364334 373217735 373477478 374241104
2312C74241104J256027J586380J600953J208610M42047n21507j403008j925621j936569
$$ 374241104 375497131 377083511 378684464 379893074 380335121 379813614 378410606 376484985 374548416
2321C74548416j487465q24203k77062r7313l27530p79686j145401j179389q46215l33862
$$ 374548416 373060951 372236748 371959686 371862373 371534843 370755157 369609756 368430367 367584152 367250290
2331C67250290P3967J84059q77l35923p11059j203079k052040l430863n145225o502305
$$ 367250290 367324257 367508316 367507439 367171516 366460457 365257378 363205338 359774475 354629250 348126945
2341C48126945o513328m392586q9607N479889J0695839J3897209J4107590J1433334
$$ 348126945 341613617 337221031 337131424 342611313 353307152 367204361 381311951 392745285
2349C92745285O934853K071952j945152m559212n865249o304093o303024o080170n674667
$$ 392745285 399680138 401752090 399806938 395247726 389382477 383078384 376775360 370695190 365020523
2358C65020523n098228m448891l899078l586884l517036l553353l507728l252907k782250
$$ 365020523 359922295 355473404 351574326 347987442 344470406 340917053 337409325 334156418 331374168
2367C31374168k183570j566735j000328m97513m1313L82004P74918J138458J484527
$$ 331374168 329190598 327623863 326623535 326126022 326084709 326466713 327241631 328380089 329864616
2376C29864616J830712K179413K502098K744484K851905K797509K594948K290534J941376
$$ 329864616 331695328 333874741 336376839 339121323 341973228 344770737 347365685 349656219 351597595
2385C51597595J596565J287652J028518Q17909O43006M85534L30506J75781L6240o5384
$$ 351597595 353194160 354481812 355510330 356328239 356971245 357456779 357787285 357963066 357999306 357933922
2395C57933922j10283r6855m1352K9602R0371J21917J13144N8937l5400j49117k46009
$$ 357933922 357823639 357726784 357685432 357715034 357805405 357927322 358040466 358099403 358064003 357914886 357668877
2406C57668877k86522k49062j47133k8305M9668M9972k0904j18447j88102j97564j53350
$$ 357668877 357382355 357133293 356986160 356957855 357007523 357057495 357036591 356918144 356730042 356532478 356379128
2417C56379128r2049n2567n1193p4539r2087q0376l8375J3389M6692M4289Q812m1008
$$ 356379128 356287079 356234512 356183319 356108780 356016693 355936317 355897942 355911331 355958023 356002312 356011124 355970116
2429C55970116q3390j06239j10969j08681j08910j12610j10778r2545n4817q316K5787
$$ 355970116 355886726 355780487 355669518 355560837 355451927 355339317 355228539 355135994 355081177 355072861 355098648
2440C55098648K6398j3962q2855j52550j94244j92757j55716j07498p6904p9995j13639
$$ 355098648 355125046 355111084 355028229 354875679 354681435 354488678 354332962 354225464 354148560 354068565 353954926
2451C53954926j56556j83487j76467j33629o8169q39M8485O7215N2375R690m7684j02348
$$ 353954926 353798370 353614883 353438416 353304787 353236618 353235779 353284264 353351479 353403854 353413544 353365860 353263512
2463C53263512j36528j38398j07765n8250j3161M807j4763o3668j18713j54304j56594
$$ 353263512 353126984 352988586 352880821 352822571 352809410 352814217 352799454 352735786 352617073 352462769 352306175
2474C52306175j30348r6283p7248q4648j13487j45683j63269j57585j32676j00593
$$ 352306175 352175827 352079544 352002296 351917648 351804161 351658478 351495209 351337624 351204948 351104355
2484C51104355p2708n6076n3902o7673r9220j46637k00424k41852k51198k16865j46027
$$ 351104355 351031647 350975571 350921669 350853996 350754776 350608139 350407715 350165863 349914665 349697800 349551773
2495C49551773o3209j793J3313k3384r4261j67008k08854j99700j38626m3907N5008
$$ 349551773 349488564 349486771 349500084 349476700 349382439 349215431 349006577 348806877 348668251 348624344 348679352
2506C48679352J26953J48964J13449L1319p1640j62125k11792k06757j53083p4730
$$ 348679352 348806305 348955269 349068718 349100037 349028397 348866272 348654480 348447723 348294640 348219910
2516C48219910k098L8642L6126m120o3744j21383j60904j76011j69525j48391j19629
$$ 348219910 348217812 348256454 348292580 348288460 348224716 348103333 347942429 347766418 347596893 347448502 347328873
2527C47328873q7738n6839l0709j4305j0414j7700k9869l9673m2534l9940l8681m5280
$$ 347328873 347241135 347184296 347153587 347139282 347128868 347111168 347081299 347041626 346999092 346959152 346920471 346875191
2539C46875191o1074q1596r9449j09902j14936j20659j33438j53046j72920j82190
$$ 346875191 346814117 346732521 346633072 346523170 346408234 346287575 346154137 346001091 345828171 345645981
2549C45645981j72539j42479r8228n0545j0490J4152K0180J0261j0147l2921n1155
$$ 345645981 345473442 345330963 345232735 345182190 345171700 345185852 345206032 345216293 345206146 345173225 345122070
2560C45122070o1874o5155o3286n7182m4594k1133J3809N4359Q6861R5825P2212J9303
$$ 345122070 345060196 344995041 344931755 344874573 344829979 344808846 344822655 344877014 344963875 345059700 345131912 345151215
2572C45151215m8333j11427j55182j74255j72234j55220j28288r2773n0965r918J8425
$$ 345151215 345102882 344991455 344836273 344662018 344489784 344334564 344206276 344113503 344062538 344052620 344071045
2583C44071045K1095p820o2332j25046j74637j95579j85662j55296j20888r4108p5379
$$ 344071045 344092140 344084320 344021988 343896942 343722305 343526726 343341064 343185768 343064880 342970772 342895393
2594C42895393n5465k4453J8082N8975P7629N9891J0681m5089p5913o2790j4381L7155
$$ 342895393 342839928 342815475 342833557 342892532 342970161 343030052 343040733 342995644 342919731 342856941 342842560 342879715
2606C42879715N3787J7433n8593j36490j77574j66970j22604q2512q0566j26114j98593
$$ 342879715 342933502 342950935 342892342 342755852 342578278 342411308 342288704 342206192 342125626 341999512 341800919
2617C41800919k62146k85607k56996j85699r3117j831O9923J08605J05095N8059k1324
$$ 341800919 341538773 341253166 340996170 340810471 340717354 340715523 340785446 340894051 340999146 341057205 341035881
2628C41035881j07613j67770j76048j28098m6463K9640O3782M0779k5902j01051j47209
$$ 341035881 340928268 340760498 340584450 340456352 340409889 340439529 340503311 340544090 340518188 340417137 340269928
2639C40269928j42555r0790j7624M3259O5613M3487q926o4049r5177q8844n0697j221
$$ 340269928 340127373 340036583 340018959 340062218 340127831 340171318 340162392 340098343 340003166 339914322 339863625 339862404
2651C39862404L3493L6468P019l9901q0986r7885q4725m9972j1216J4840J8920J603
$$ 339862404 339895897 339932365 339939384 339899483 339818497 339720612 339635887 339585915 339574699 339589539 339608459 339610062
2663C39610062k9488o4697r7084j23062j41831j52206j51596j36834j06315o3439j7280
$$ 339610062 339580574 339515877 339418793 339295731 339153900 339001694 338850098 338713264 338606949 338543510 338526230
2674C38526230J9340L4829K4681m502l6850n3901m3183o904L9138P0992O8512K5635
$$ 338526230 338545570 338580399 338605080 338600578 338563728 338509827 338466644 338459740 338498878 338569870 338638382 338664017
2686C38664017m5815j21383j74637j88942j63651j13945o2065k8229k2087l9940o8779
$$ 338664017 338618202 338496819 338322182 338133240 337969589 337855644 337793579 337765350 337743263 337703323 337634544
2697C37634544r2544j00784r2545p7438o8779p7515j05057j43089j76010j89476j75705
$$ 337634544 337542000 337441216 337348671 337271233 337202454 337124939 337019882 336876793 336700783 336511307 336335602
2708C36335602j36681q2207k5939J8425L9520K9907j2016p8965j54685k16332k43187
$$ 336335602 336198921 336116714 336090775 336109200 336148720 336178627 336166611 336087646 335932961 335716629 335473442
2719C35473442k26784j77231j20010q5335r2468j39809k06031k61193k82440k64625
$$ 335473442 335246658 335069427 334949417 334864082 334771614 334631805 334425774 334164581 333882141 333617516
2729C33617516k20032j70975j35612j21079j21879j25847j21765j05057p7210m4098
$$ 333617516 333397484 333226509 333090897 332969818 332847939 332722092 332600327 332495270 332418060 332373962
2739C32373962j2588J0757K0333J1444j7815o2904j13106j53389j71394j63994j40305
$$ 332373962 332361374 332372131 332392464 332403908 332386093 332323189 332210083 332056694 331885300 331721306 331581001
2750C31581001j17531j10740j23978j46828j61590j55144j29890j04180j00403j30081
$$ 331581001 331463470 331352730 331228752 331081924 330920334 330765190 330635300 330531120 330430717 330300636
2760C30300636j83563k33383k49252k16294j43699n9510N188L1395J8692k1667p6714
$$ 330300636 330117073 329883690 329634438 329418144 329274445 329214935 329220123 329251518 329270210 329248543 329171829
2771C29171829j39351k06070k70767l19900l36533l09906k45247j64223r5138n9509
$$ 329171829 329032478 328826408 328555641 328235741 327899208 327589302 327344055 327179832 327084694 327025185
2781C27025185o2333r2697j32293j67046j90811k04849k10915k09160j97868j77765
$$ 327025185 326962852 326870155 326737862 326570816 326380005 326175156 325964241 325755081 325557213 325379448
2791C25379448j54839j37977j35155j47781j70288j92032k02599j94435j64986j16577
$$ 325379448 325224609 325086632 324951477 324803696 324633408 324441376 324238777 324044342 323879356 323762779
2801C23762779n7411j53L8681M4518J0529n7564j43280k24381k83890l15284l22762
$$ 323762779 323705368 323705215 323743896 323788414 323798943 323741379 323598099 323373718 323089828 322774544 322451782
2812C22451782l15704l02086k84309k62375k39373k24342k31056k71301l49064m59423
$$ 322451782 322136078 321833992 321549683 321287308 321047935 320823593 320592537 320321236 319972172 319512749
2822C19512749n91526p36027q86154j034107j164093j248112j250744j142845r16577
$$ 319512749 318921223 318185196 317299042 316264935 315100842 313852730 312601986 311459141 310542564
2831C10542564n92956k17552J54438M75540P15980Q64888R24034R02462Q14361O81629
$$ 310542564 309949608 309732056 309886494 310362034 311078014 311942902 312866936 313769398 314583759 315265388
2841C15265388N32628L96595K92301K19517J59111Q4228k3117j59321k97851m02737
$$ 315265388 315798016 316194611 316486912 316706429 316865540 316949768 316926651 316767330 316469479 316066742
2851C16066742m45328m20208l47690k65923k14405k18964k82726l87592n01652n93166
$$ 316066742 315621414 315201206 314853516 314587593 314373188 314154224 313871498 313483906 312982254 312389088
2861C12389088o40831o40564o04935n55553n14508m95224n00259n21488n46112n60971
$$ 312389088 311748257 311107693 310502758 309947205 309432697 308937473 308437214 307915726 307369614 306808643
2871C06808643n57346n31464m86526m31194l79143l45078l41854l76301m46834n43404
$$ 306808643 306251297 305719833 305233307 304802113 304422970 304077892 303736038 303359737 302912903 302369499
2881C02369499o49147p42359q01716q12473p73430p01694o30970n98507o29406p20807
$$ 302369499 301720352 300977993 300176277 299363804 298590374 297888680 297257710 296659203 296029797 295308990
2891B95308990q40492r39293r74960r32198q29296p07321o08864n58223n54905n78423
$$ 295308990 294468498 293529205 292554245 291622047 290792751 290085430 289476566 288918343 288363438 287785015
2901B87785015o02817o06900n80463n23548m44489l58581k85416k43416k42138k76260
$$ 287785015 287182198 286575298 285994835 285471287 285026798 284668217 284382801 284139385 283897247 283620987
2911B83620987l26996l72219l98827m11052m26483m64554n32723o22692p14912p91226
$$ 283620987 283293991 282921772 282522945 282111893 281685410 281220856 280688133 280065441 279350529 278559303
2921B78559303q41961q65860q63266q30154p58953o45905m99153l39145j90468p0133
$$ 278559303 277717342 276851482 275988216 275158062 274399109 273753204 273254051 272914906 272724438 272654305
2931B72654305K0046R0503J53962K14939K65922K94056K89421K52991J94950J28517
$$ 272654305 272674351 272764854 272918816 273133755 273399677 273693733 273983154 274236145 274431095 274559612
2941B74559612O2619j259o5079j31092j97945k62336l22457l78494m30107m70619m83284
$$ 274559612 274622231 274620972 274555893 274424801 274226856 273964520 273642063 273263569 272833462 272362843 271879559
2952B71879559m44928l35197j50337Q8386L37124N42584O60934O76022O03580M84886
$$ 271879559 271434631 271099434 270949097 271037483 271374607 271917191 272578125 273254147 273857727 274342613
2962B74342613L67356K86693K54421K58637K73971K74411K44579J82056R5787N8q9913
$$ 274342613 274709969 274996662 275251083 275509720 275783691 276058102 276302681 276484737 276580524 276580582 276490669
2973B76490669j61400k04982k15798j92280j34887m5166P4062K16141L67012N04379
$$ 276490669 276329269 276124287 275908489 275716209 275581322 275536156 275610218 275826359 276193371 276697750
2983B76697750O02779O43101O23417N61619M88815M34056M10957M13399M23813M27131
$$ 276697750 277300529 277943630 278567047 279128666 279617481 280051537 280462494 280875893 281299706 281726837
2993B81726837M21696M18873M31823M64535N07584N45349N68581N81989O01387O40621
$$ 281726837 282148533 282567406 282999229 283463764 283971348 284516697 285085278 285667267 286268654 286909275
3003B86909275O98643P56149P83844P57942O74382N51586M24156L27873K86636L03765
$$ 286909275 287607918 288364067 289147911 289905853 290580235 291131821 291555977 291883850 292170486 292474251
3013B92474251L61614M27322M65241M49257L74069K57549J32904L3608k2564m1390
$$ 292474251 292835865 293263187 293728428 294177685 294551754 294809303 294942207 294975815 294953251 294911861
3023B94911861m6825o6814j17932j97353k87018l63407m09355m18740l96633l54557
$$ 294911861 294865036 294798222 294680290 294482937 294195919 293832512 293423157 293004417 292607784 292253227
3033B92253227l07617k70653k55050k65236k95372l32165l61748l78456l88565m05903
$$ 292253227 291945610 291674957 291419907 291154671 290859299 290527134 290165386 289786930 289398365 288992462
3043B88992462m41761m94652n49850n87978n97458n82810n61523n53456n67970n99289
$$ 288992462 288550701 288056049 287506199 286918221 286320763 285737953 285176430 284622974 284055004 283455715
3053B83455715o31161o47392o41708o19602n95341n84355n97095o35109o91605p52849
$$ 283455715 282824554 282177162 281535454 280915852 280320511 279736156 279139061 278503952 277812347 277059498
3063B77059498q03509q30669q29487q03948p63530p19242o79303o50215o39343o57215
$$ 277059498 276255989 275425320 274595833 273791885 273028355 272309113 271629810 270979595 270340252 269683037
3073B69683037p11251p97500q94089r64947r75971r14688q00018o73714n77507n29346
$$ 269683037 268971786 268174286 267280197 266315250 265339279 264424591 263624573 262950859 262373352 261844006
3083B61844006n17216n12848m97761m80556m91371n57499o76766q08868q94909q91209
$$ 261844006 261326790 260813942 260316181 259835625 259344254 258786755 258109989 257301121 256406212 255515003
3093B55515003p98645o62498n47543m98867n16891n59674n70430n11895l87096k34604
$$ 255515003 254716358 254053860 253506317 253007450 252490559 251930885 251360455 250848560 250461464 250226860
3103B50226860j05324l5438l0461o8836j17264j48143j49842j25274q3657l3397K2449
$$ 250226860 250121536 250086098 250055637 249986801 249869537 249721394 249571552 249446278 249362621 249329224 249351673
3114B49351673Q2474J44749K03075K49691K80819L00713L22799L63789M35047N33771
$$ 249351673 249434147 249578896 249781971 250031662 250312481 250613194 250935993 251299782 251734829 252268600
3124B52268600O41709P30877P75299P64179P08103O35510N81550N72129O12926O86226
$$ 252268600 252910309 253641186 254416485 255180664 255888767 256524277 257105827 257677956 258290882 258977108
3134B58977108P58190P94315P72152O92196N76172M57859L69339L29476L37886L78190
$$ 258977108 259735298 260529613 261301765 261993961 262570133 263027992 263397331 263726807 264064693 264442883
3144B64442883M25491M55990M53968M14619L43189K52877J60026Q0757K6074j011n436
$$ 264442883 264868374 265324364 265778332 266192951 266536140 266789017 266949043 267029800 267055874 267054863 267049427
3155B67049427K785J4114K3232K9640L3226L0498J2570k9755r7999j80283k52972k91195
$$ 267049427 267052212 267066326 267089558 267119198 267152424 267182922 267195492 267165737 267067738 266887455 266634483 266343288
3167B66343288k83908k43569k03571k03076k64854l80135n07621n92060n90878m98028
$$ 266343288 266059380 265815811 265612240 265409164 265144310 264764175 264256554 263664494 263073616 262575588
3177B62575588l50036k10514j39103j62850k63614l88909m80747n05543m68616m07029
$$ 262575588 262225552 262015038 261875935 261713085 261449471 261060562 260579815 260074272 259605656 259198627
3187B59198627l66077l75156m35410n25513o16531o86760p27196p36999p19452o79283
$$ 259198627 258832550 258457394 258021984 257496471 256879940 256193180 255465984 254728985 254009533 253330250
3197B53330250o25687n74474n43118n41954n66234n97687o16150o14052o02703o04572
$$ 253330250 252704563 252130089 251586971 251045017 250478783 249881096 249264946 248650894 248048191 247443619
3207B47443619o37169o98738p68414q19130q36105q25081q07209q02898q17643q40950
$$ 247443619 246806450 246107712 245339298 244520168 243684063 242858982 242051773 241248875 240431232 239590282
3217B39590282q55598q51460q31356q06808p86991p70855p48730p09476o49643n74436
$$ 239590282 238734684 237883224 237051868 236245060 235458069 234687214 233938484 233229008 232579365 232004929
3227B32004929m95625m24671l70083l37849l31897l52650l93181m37965m67263m66537
$$ 232004929 231509304 231084633 230714550 230376701 230044804 229692154 229298973 228861008 228393745 227927208
3237B27927208m33846l80802l22494k65255j99738j07059K7008J96514L71761N09491
$$ 227927208 227493362 227112560 226790066 226524811 226325073 226218014 226245022 226441536 226813297 227322788
3247B27322788N74036N55210M75349L80173L20034L29533M16298N60360P25422Q74652
$$ 227322788 227896824 228452034 228927383 229307556 229627590 229957123 230373421 230933781 231659203 232533855
3257B32533855R84192J050244J086311J112671J144962J185112J222267J239090J223545
$$ 232533855 233518047 234568291 235654602 236767273 237912235 239097347 240319614 241558704 242782249
3266B42782249J175137J105671J033382R74999R40189R29756R37233R51176R58061
$$ 242782249 243957386 245063057 246096439 247071438 248011627 248941383 249878616 250829792 251787853
3275B51787853R45206R05418Q41942P69921P12509O91280P14474P71408Q35209Q74824
$$ 251787853 252733059 253638477 254480419 255250340 255962849 256654129 257368603 258140011 258975220 259850044
3285B59850044Q68588Q14838P30724O44684N82409N56145N60799N77793N85575N70679
$$ 259850044 260718632 261533470 262264194 262908878 263491287 264047432 264608231 265186024 265771599 266342278
3295B66342278N34248M91466M62628M61464M86679N21221N41801N31121M85725M15669
$$ 266342278 266876526 267367992 267830620 268292084 268778763 269299984 269841785 270372906 270858631 271274300
3305B71274300L35025K52629J69143Q3180l24o5689r2774o9599l223Q0604J48964J77746
$$ 271274300 271609325 271861954 272031097 272114277 272113953 272048264 271955490 271885891 271882668 271963272 272112236 272289982
3317B72289982J61362J10759M2782k9335r8629j59187k00520k09160j78375j18523
$$ 272289982 272451344 272562103 272604885 272575550 272476921 272317734 272117214 271908054 271729679 271611156
3327B71611156n8574l4352o7787j51119k46773l04794k89803k00424p2021M0741R1209
$$ 271611156 271552582 271518230 271450443 271299324 271052551 270747757 270457954 270257530 270185509 270226250 270317459
3338B70317459O2561k5959j30787k07786k33898k15188j80416j62048j76620k16084
$$ 270317459 270380020 270354061 270223274 270015488 269781590 269566402 269385986 269223938 269047318 268831234
3348B68831234k52552k55432k09694j26000l6068K1801K1611l9349j40076k46124l23925
$$ 268831234 268578682 268323250 268113556 267987556 267951488 267973289 267994900 267955551 267815475 267569351 267245426
3359B67245426l53546l33900k80705k17934j66683j36566j22509j09711q3198l8185
$$ 267245426 266891880 266557980 266277275 266059341 265892658 265756092 265633583 265523872 265440674 265402489
3369B65402489J6670O3362Q6060P8907M7817K785n1842j20392k10285l18375m22973
$$ 265402489 265419159 265482521 265568581 265647488 265695305 265698090 265646248 265525856 265315571 264997196 264574223
3380B64574223m86641m73214l69606j97982j1216J27507J72844J16138j2073j56460
$$ 264574223 264087582 263614368 263244762 263046780 263035564 263163071 263335915 263452053 263439980 263283520
3390B63283520k61898k94476k53334j66569p6084j8368j0356m3889r2830j25561j20392
$$ 263283520 263021622 262727146 262473812 262307243 262231159 262212791 262202435 262158546 262065716 261940155 261819763
3401B61819763p3261J182P5913J23501J26419Q5220J9760l8662o2523m5356j0853m597
$$ 261819763 261746502 261747684 261823597 261947098 262073517 262158737 262178497 262139835 262077312 262031956 262021103 262016506
3413B62016506p0343k18181m08631n62038n95951m70486k13509Q8520L32203M47293
$$ 262016506 261946163 261727982 261319351 260757313 260161362 259690876 259477367 259565887 259898090 260345383
3423B60345383M23946L07007J62811M3278l1567o7215p6503o6147l5706J3714P4577
$$ 260345383 260769329 261076336 261239147 261282425 261250858 261183643 261107140 261040993 261005287 261019001 261093578
3434B61093578J34678J84231K18296K29950K04601J22147k6836k21329m03805m99134
$$ 261093578 261228256 261412487 261630783 261860733 262065334 262187481 262160645 261939316 261535511 261036377
3444B61036377m52385k61326J6689K92397M88567N73197N62858M97685M10442L11413
$$ 261036377 260583992 260322666 260339355 260631752 261120319 261693516 262256374 262754059 263164501 263475914
3454B63475914J97620P4139l4199r1171p2803J2722J26018K17190K52056K26555J60408
$$ 263475914 263673534 263747673 263713474 263622303 263549500 263562222 263688240 263905430 264157486 264384041 264544449
3465B64544449Q0433P610m3774n7144j1158J07346K83336M60415N56260N02395K89307
$$ 264544449 264624882 264632492 264588718 264531574 264520416 264627762 264911098 265371513 265927773 266430168 266719475
3476B66719475j5278k91462m27609l79066j89953L7251K04773K74086K75592K72294
$$ 266719475 266704197 266412735 265985126 265606060 265416107 265453358 265658131 265932217 266207809 266480103
3486B66480103L04508L59783L89843L58620K82821K27089K53391L61920M72202M66824
$$ 266480103 266784611 267144394 267534237 267892857 268175678 268402767 268656158 269018078 269490280 269957104
3496B69957104K74372o6548m13246n97038n26772k48298Q1997K93236L01799J54782
$$ 269957104 270231476 270164928 269751682 269154644 268627872 268379574 268461571 268754807 269056606 269211388
3506B69211388j1368o2676N3788K90927N46685P31392Q10337P99179P28473O14052
$$ 269211388 269200020 269137344 269191132 269482059 270028744 270760136 271570473 272369652 273098125 273712177
3516B73712177M53282K46105J1978k12059l93257n18093n88074n95779n09625k88868
$$ 273712177 274165459 274411564 274423542 274211483 273818226 273300133 272712059 272116280 271606655 271317787
3526B71317787P3071N08938Q80718J040725R21631N97267K64912J46275L54404Q09288
$$ 271317787 271390858 271899796 272780514 273821239 274742870 275340137 275605049 275751324 276105728 276915016
3536B76915016J258202J401024J058578K85740o35567j332321j530609j196613n45178
$$ 276915016 278173218 279574242 280632820 280918560 280282993 278950672 277420063 276223450 275678272
3545B75678272Q8291M39225M52213K84405J78451K93198O10199R76925J247768J406670
$$ 275678272 275766563 276205788 276658001 276942406 277120857 277414055 278024254 279001179 280248947 281655617
3555B81655617J565361J826992K118320K141056J520310Q3942j915798l814163m821701
$$ 281655617 283220978 285047970 287166290 289307346 290827656 290911598 288995800 285181637 280359936
3564B80359936m438286k744103l80992J770935L025684L178196K505150J524181P04899
$$ 280359936 275921650 273177547 272796555 274567490 277593174 280771370 283276520 284800701 285505600
3573B85505600L04337L74546Q51860J604366K400303K878189K632122J430931n51071
$$ 285505600 285809937 286184483 287036343 288640709 291041012 293919201 296551323 297982254 297431183
3582B97431183k684937m122486m225006k932777q29315J160240K260074K222233J372643
$$ 297431183 294746246 290623760 286398754 283465977 282636662 283796902 286056976 288279209 289651852
3591B89651852L33538l67184n37624k97108J33171O24733J173267J775971K297478
$$ 289651852 289985390 289618206 289080582 288783474 288916645 289541378 290714645 292490616 294788094
3600B94788094K469577K047806J013241l45669j540947k123623j899357r99202K08339
$$ 294788094 297257671 299305477 300318718 299973049 298432102 296308479 294409122 293409920 293618259
3609B93618259J278344J829242J625634O36463r01680k452202l272457k693138n09186
$$ 293618259 294896603 296725845 298351479 298987942 298086262 295634060 292361603 289668465 289159279
3618B89159279K732696N788422P194366N986462K276993k671146o975289r011993q172817
$$ 289159279 291891975 297680397 304874763 310861225 313138218 310467072 303491783 294479790 286306973
3627B86306973n080433j175290K056485L756485L924446L170089K244034J674748J679191
$$ 286306973 281226540 280051250 282107735 285864220 289788666 292958755 295202789 296877537 298556728
3636B98556728K267495L332672M602146N534363N369415L459167k45285m891033q909893
$$ 298556728 300824223 304156895 308759041 314293404 319662819 323121986 322876701 317985668 309075775
3645C09075775j0711994r529228n886269j370487K195911L684922L139209J549836
$$ 309075775 298363781 288834553 282948284 281577797 283773708 287458630 290597839 292147675
3653B92147675J51825k70329L49445J577950K909679M040680M838848N155201M745865
$$ 292147675 292299500 292029171 292378616 293956566 296866245 300906925 305745773 310900974 315646839
3662C15646839L432484J367798q76026k558194l229465l060646k749138l026753m101886
$$ 315646839 319079323 320447121 319571095 317012901 313783436 310722790 307973652 304946899 300845013
3671C00845013n447808o105022n293713k909012M26369L746472O250610P579174P728291
$$ 300845013 295397205 289292183 283998470 281089458 281515827 285262299 291512909 299092083 306820374
3680C06820374O776161M724750J616898k186833n861740q318271q689232o804810l332252
$$ 306820374 313596535 318321285 319938183 317751350 311889610 303571339 294882107 288077297 284745045
3689B84745045N26390L590660N173702N225315M143982K466927O66752q66604j762390
$$ 284745045 285271435 288862095 294035797 299261112 303405094 305872021 306538773 305672169 303909779
3698C03909779j691285n36689J395721L331547M272747L468418Q62579k757797o042576
$$ 303909779 302218494 301681805 303077526 306409073 310681820 314150238 315012817 312255020 306212444
3707C06212444p669315o948700m128666k52399L338546N583477O074028N072709L232975
$$ 306212444 298543129 291594429 287465763 287213364 290551910 296135387 302209415 307282124 310515099
3716C10515099J231575m80042j706123k380333k432995j771927l93772J469002L292122
$$ 310515099 311746674 311266632 309560509 307180176 304747181 302975254 302581482 304050484 307342606
3725C07342606M370975M074307K140026j119519m804210p652951q474521o655922k539063
$$ 307342606 311713581 315787888 317927914 316808395 312004185 304351234 295876713 289220791 286681728
3734B86681728K554398O761131Q460045P051506L300343j015206m019375m731121l543872
$$ 286681728 289236126 295997257 304457302 311508808 314809151 313793945 309774570 305043449 301499577
3743C01499577j885968j257934k252903m186421n574855n136929k655983Q58593L794842
$$ 301499577 299613609 298355675 296102772 291916351 286341496 281204567 278548584 279407177 283202019
3752B83202019M913673M041519K066517L08304k86980L83492J669655K666321K746067
$$ 283202019 288115692 292157211 294223728 294532032 294245052 294628544 296298199 298964520 301710587
3761C01710587J819896K56462j384639k599469l057346k624474j372413L99246K179127
$$ 301710587 303530483 303786945 302402306 299802837 296745491 294121017 292748604 293147850 295326977
3770B95326977L370247L520088K546368Q16669r96132k221756k502994j935997r71489
$$ 295326977 298697224 302217312 304763680 305580349 304584217 302362461 299859467 297923470 296951981
3779B96951981j39924K37008J90353L3512J31683O59314J489181K280598K699566K623920
$$ 296951981 296812057 297049065 297239418 297272930 297404613 298063927 299553108 301833706 304533272 307157192
3789C07157192K191925J661759J189995P01408l8395j185875k605858l860283m449272
$$ 307157192 309349117 311010876 312200871 312902279 312863884 311678009 309072151 305211868 300762596
3798C00762596m142971l158741k025280j210098p77512l45382N99918K247505M203034
$$ 300762596 296619625 293460884 291435604 290225506 289447994 289102612 289702530 291950035 296153069
3807B96153069N642547N797520M442024K044239n21202k489433l589306m047909m254360
$$ 296153069 301795616 307593136 312035160 314079399 313558197 311068764 307479458 303431549 299177189
3816B99177189m368305m179058l308888j589699O88248K854137M216156M452973L774433
$$ 299177189 294808884 290629826 287320938 285731239 286419487 289273624 293489780 297942753 301717186
3825C01717186K752666J949616J584282J445045J074353R7675j510544l371696m878540
$$ 301717186 304469852 306419468 308003750 309448795 310523148 310620823 309110279 305738583 300860043
3834C00860043n498944n035000l698330j955089k31037J341343K953663M874191P056312
$$ 300860043 295361099 290326099 286627769 284672680 284441643 285782986 288736649 293610840 300667152
3843C00667152Q874474R239044P128182K289581m313965j0661507j4457626j4184360
$$ 300667152 309541626 318780670 325908852 328198433 323884468 313222961 298765335 284580975
3851B84580975r862328l093109L659077Q166942R353047P580490M254322J023273r75342
$$ 284580975 274718647 271625538 275284615 283451557 292804604 300385094 304639416 305662689 304687347
3860C04687347j480846j002636l90091l44448j091995k328606l410759l689709k835464
$$ 304687347 303206501 302203865 301813774 301469326 300377331 298048725 294637966 290948257 288112793
3869B88112793j009884J192970L014317L872909L604775K477894R97123l65562j344414
$$ 288112793 287102909 288295879 291310196 295183105 298787880 301265774 302262897 301897335 300552921
3878C00552921j883621k020874j789913j227417m60777K45246N79148L87478j55983
$$ 300552921 298669300 296648426 294858513 293631096 293170319 293415565 293994713 294382191 294226208
3887B94226208n74742l44009P60879K453328M013748M636516L840237J709213j156215
$$ 294226208 293651466 293307457 294068336 296521664 300535412 305171928 309012165 310721378 309565163
3896C09565163l921643n857563o562652o008950m453983k309875l1662J968612L390961
$$ 309565163 305643520 299785957 293223305 287214355 282760372 280450497 280418835 282387447 285778408
3905B85778408M099102M126701L625412K776623J725083N75676n55478j497650k051449
$$ 285778408 289877510 294004211 297629623 300406246 302131329 302707005 302151527 300653877 298602428
3914B98602428k083282j628094r07230k27871J82762K97871K77996L27968N25589P44267
$$ 298602428 296519146 294891052 293983822 293755951 293938713 294236584 294514580 294842548 295368137 296112404
3924B96112404P33890L08419m86966j349124j857911j705341q75244L33385J449967
$$ 296112404 296846294 297154713 296667747 295318623 293460712 291755371 290880127 291213512 292663479
3933B92663479K056789J973858J312332L86906m46262r42879j043797q55503n67226
$$ 292663479 294720268 296694126 298006458 298393364 297947102 297004223 295960426 295104923 294537697
3942B94537697l51772k92092l59497m42200m13093k02332J57604N42183P99199Q29181
$$ 294537697 294185925 293893833 293534336 293092136 292679043 292476711 292634315 293176498 293975697 294804878
3952B94804878O38199L24669J4725k08912l34416l91159l96804l33481j76678N1556
$$ 294804878 295443077 295767746 295782471 295573559 295239143 294847984 294451180 294117699 293941021 293992577
3962B93992577K62451L44028K43397J6327k05898l13244l00846k61689k92682l93868
$$ 293992577 294255028 294599056 294842453 294858780 294652882 294339638 294038792 293777103 293484421 293090553
3972B93090553m58812l73154j38817R7466J52626k7943l01704m34494l06588l5133
$$ 293090553 292631741 292258587 292119770 292217236 292369862 292341919 292040215 291605721 291299133 291264000
3982B91264000J12343l8796l88012o27517n38330k56939k28062q06351j813678k501240
$$ 291264000 291376343 291337547 290949535 290322018 289783688 289526749 289298687 288492336 286678658 284177418
3992B84177418k116299p69596P5436j937905q693657k0089721l3419228m4252605
$$ 284177418 282061119 281291523 281366959 279429054 270735397 250645676 217226448 172973843
4000A72973843
$$ 172973843
##END=$$ End of the data block
