##TITLE=$$ Begin of the data block
##JCAMP-DX=5.00 $$ ACD/SpecManager v 10.08
##SPECTROMETER/DATA SYSTEM=Varian
##DATE=20 Nov 2012 15:53:22
##DATA TYPE=INFRARED SPECTRUM
##DATA CLASS=XYDATA
##ORIGIN=
##OWNER=
##NPOINTS=3735
##FIRSTX=399.26403809
##LASTX=4000.35498047
##MAXX=4000.35498047
##MINX=399.26403809
##MAXY=77.58372498
##MINY=32.95048523
##XFACTOR=1.0000000000
##YFACTOR=0.000000100000000
##FIRSTY=60.38429642
##DELTAX=0.96440572
##XUNITS=1/CM
##YUNITS=TRANSMITTANCE
##XYDATA=(X++(Y..Y))
399.3 603842964 577036743 555436935 560729103 565273857 558950348 559494667 569138718 567679329
407 567679329 560407906 553445320 555478821 559706192 562038651 563767014 564417953 565905266 566437035
415.7 566437035 566290359 550566292 538986320 566030807 569928551 569001923 557431145 557951393
423.4 557951393 565888329 569332504 572212944 564131775 555088615 552212029 558646355 559365005 551655922
432.1 551655922 549572792 551641159 552900162 549213142 550849419 552306480 550835571 550636253 553592644
440.7 553592644 561392746 557990837 548057823 548539772 555860939 563729172 570166855 571087456 570872498
449.4 570872498 571345978 569237938 568195419 564829445 565293083 569493561 569964104 568490295 564472237
458.1 564472237 567045403 565526772 562724075 563070984 558486710 558089981 561650124 563757744 565096436
466.8 565096436 564572792 559645386 557386589 561869774 561998482 549113007 539473076 540706596 542053757
475.5 542053757 544633598 546124573 546634674 552074356 553583755 550838585 549712791 546217308 542634277
484.1 542634277 544538536 545647621 542921257 541272354 543359146 547376099 550088844 553324318
491.8 553324318 552281723 549008942 546409721 540818520 538999214 542471237 545674171 545393562 545455742
500.5 545455742 545028534 539693336 537739182 536548233 535660019 534004402 530982513 530446777 528839455
509.2 528839455 529007225 531488609 533652000 533182945 531610947 530381012 527597656 521863861 516416321
517.9 516416321 514260864 511793251 513314667 516302643 517804222 517729034 516731682 516853104 515193634
526.6 515193634 514805679 512391510 509689140 508933105 508731346 512209663 513853264 515753784 517657127
535.2 517657127 518486519 518483276 516477089 517389221 518908310 521586571 525518570 528701820 531687737
543.9 531687737 533392372 533018875 531444511 531301117 530011406 527909508 527671890 528259544 528693237
552.6 528693237 527880707 526879654 526433258 526701317 525513306 522728271 519888687 519027519 518685455
561.3 518685455 515711670 514496155 512678719 511099739 509783249 507182922 506088715 502761879
569 502761879 500026817 496852951 495377197 495157127 493257523 494150658 494850006 496598549 497070808
577.7 497070808 497012863 498228760 500218620 502448006 503678589 507370186 509543343 512901840 516947975
586.4 516947975 517772980 518933754 519823952 521290131 522498283 523659325 524781151 524475212 524018860
595 524018860 524813232 525818748 524906082 525157547 526061897 526219254 525765419 524577141 524698563 524533386
604.7 524533386 523544769 523671036 525155563 524573593 523522148 523908501 523473434 524184341 525091248
613.4 525091248 525932159 526627007 527628212 529185295 529877205 532058296 534209175 534988899 535769882
622 535769882 537732201 539567337 540362473 542123032 544330978 546701279 548787766 549263802 547455482
630.7 547455482 546135674 547734032 549212112 549241600 550199356 552965202 555358696 556136703 555879326
639.4 555879326 556200485 556479645 555894394 555141678 554885559 557257233 559233055 559415092 560190392
648.1 560190392 561173553 563299332 564524040 563567238 562450562 562349319 562318573 561738434 562675552
656.8 562675552 564400330 565686035 567046318 568940010 569686127 568543472 567408638 566800575 566580429
665.4 566580429 566192856 563665543 560452576 567211494 571317749 573550835 574514275 574338760 574114075
674.1 574114075 573134422 572248230 572875328 574094810 576044388 578340950 580524292 581957970 582844734
682.8 582844734 582477226 581673660 580677071 578452530 578087807 579274979 581278191 583255272 584241371
691.5 584241371 585311852 585510864 585461006 583845558 580257721 577257690 575806465 575783691 576169777
700.2 576169777 577089539 577485619 577055969 576380882 575610008 574281082 572552223 571074028 569106178
708.8 569106178 568731499 569426498 571198044 575059814 577947464 578564911 578109131 579637871 581335640
717.5 581335640 581444397 581610680 582296143 584678192 587734451 591789169 595032120 597137756 600049133
726.2 600049133 601373787 601573982 602214813 603629265 605537872 606769142 608005180 610760536 614382591
734.9 614382591 615963326 616606750 617509003 617323112 617195473 617620354 618186417 617766876 617023392 617040253
744.5 617040253 617464294 619314499 620125351 619126587 616939774 613002548 610544739 608577118 606452637
753.2 606452637 605896797 604596405 604061775 604581108 603241882 602427979 601288452 598251495 596333580
761.9 596333580 595223694 594413605 594566307 594640427 594890594 596288834 597906303 599981308 602139778
770.6 602139778 602725296 603351898 605307732 607795944 610640526 614313431 618655319 622510033 625431290
779.2 625431290 628338928 630539093 630976791 632262802 635490990 637570724 639416466 642613297 645154648
787.9 645154648 646818085 648035889 649493637 650361633 650785294 651382751 651018753 651943283 654240036
796.6 654240036 656526031 659018478 661719284 663394928 663641052 664041977 664285431 665483246 666188049
805.3 666188049 666644440 668939438 670986252 672430801 672879486 672954865 672313995 671658173 671076660
814 671076660 669942322 670009079 670201950 671231537 672135468 673206635 674630585 674424591 674333191 673478394
823.6 673478394 672281799 670905228 669735794 669395523 669359512 670297928 670515289 670024567 668526917
832.3 668526917 666553879 664422684 661476974 659465332 657806168 655922089 654683151 654426651 654144211
841 654144211 654181519 654326935 652204208 649598160 647856293 646116333 644482117 642880707 641866837
849.6 641866837 642333374 643194046 642703857 641192398 639506721 637571564 634931526 631534767 628109207
858.3 628109207 626132240 624938774 624315681 625618057 627822914 630542870 633880844 637035522 639857674
867 639857674 642503510 645156631 647622375 651355057 655880966 660729446 665475235 667636032 669732819
875.7 669732819 671504288 671878128 671782532 670862122 669921799 669553757 669999619 669712067 669456406 669212723
885.3 669212723 667520142 665121841 662667694 660052338 656732254 653628006 651568069 651505890 651545181
894 651545181 650754318 650011368 648204346 646390839 644112015 641766739 639727058 637934189 636909065
902.7 636909065 635091782 634451141 634301758 632011299 629591141 627755241 624444427 619268761 614856491
911.4 614856491 612189064 610034561 607007370 603609657 600926819 597737770 594342804 590891418
919.1 590891418 587603416 585864677 582978630 579529533 578054123 577483864 577571564 577487450 577755165
927.8 577755165 577978096 577431488 576919212 576447334 576387215 576444016 576958580 577767143 578913841 581018639
937.4 581018639 582912521 584327393 586115417 588244553 589734039 590085831 590365715 591062164 591158524
946.1 591158524 590758286 589761162 587763405 584864006 580466232 575522041 570420036 564914627 560017242
954.8 560017242 554907036 549623795 544015160 538792648 534206810 528436317 522258568 515790253
962.5 515790253 509131775 501944656 494896011 488072281 481395302 474961395 467321396 460274773
970.2 460274773 452722321 445281410 437588348 429245682 421854782 413839836 406529503 398281326
977.9 398281326 390524902 383797722 377752876 372430458 366228065 361075630 356061249 352750969
985.6 352750969 348830719 345322113 343185196 341067734 340441208 339008980 339004784 337975616 337385712
994.3 337385712 337218475 336309319 336827278 336177559 336717072 336537704 337109833 337672920 337553825 337812767
1004 337812767 336529808 337008667 336872139 337549858 336716614 334970703 335184784 334104042 333512421
1012.6 333512421 332004929 331867218 331506729 331010132 330675125 329615097 330144501 329504852 330143013
1021.3 330143013 330448532 331845894 333473244 334123573 336339340 337422943 338994865 339097404 340247154
1030 340247154 341867447 342867012 344284286 344781723 347170639 348520622 349627304 350253868 351173744
1038.7 351173744 350895805 349471016 350386505 349856796 350811157 351822968 352618065 352862892 353435783
1047.4 353435783 355205956 354987297 356164017 356032677 357818947 359412613 359871902 362803383 365143547
1056 365143547 368988686 371704445 375138245 377683792 380544434 385447235 389178467 393508453 396579056
1064.7 396579056 400562363 403691864 406803741 408723488 407446823 405081100 399878731 395623322
1072.4 395623322 390448227 385822029 381982689 378446198 376545677 374746857 376334686 375863495
1080.1 375863495 375541649 375583572 376131935 378509827 379235420 381595383 383094940 385799179 388668060
1088.8 388668060 391238060 394069252 396371307 399693031 400825500 402339096 404139442 407040939
1096.5 407040939 408855934 409979362 412281723 412432098 413682480 413899460 414658165 415082779 414152832
1105.2 414152832 414287834 414117126 415736008 417152786 419388275 421379814 423560753 425739899 426845322
1113.9 426845322 429211998 431164017 434188118 436008797 437607689 438513145 438913765 441099319 441720848
1122.6 441720848 443155937 444400406 446128159 447603874 448680687 450660019 452277527 455551109
1130.3 455551109 457202110 459251366 461580849 462667580 463908195 464480171 465063515 463891411 462967834
1139 462967834 460950356 458561211 456841965 453546028 450582542 446764870 443867111 440729370 437562103
1147.6 437562103 434928627 432283440 430715828 428178749 426368980 423846474 422831345 423054695
1155.4 423054695 422682991 422321320 421496086 422424965 422522888 424138184 425780182 426802711 429484062
1164 429484062 432048073 435886078 439063377 442365837 446590958 451826897 456834335 461810875 467347527
1172.7 467347527 471917839 477612762 483213387 488667526 493842125 499378319 505340576 510569878
1180.4 510569878 515813599 520046425 524790115 529447441 533678093 537818489 541266327 545036774
1188.1 545036774 548279495 550788765 552780037 554864845 557089005 558848343 559887657 560272179
1195.9 560272179 560796890 560900345 561085205 561402130 561315269 561616631 562074585 562741165 563431969 564088478
1205.5 564088478 564981384 565869141 566657524 567948456 569445267 570541878 571658134 572560654 573941612
1214.2 573941612 575582047 576724586 578481407 580777893 582041359 582629623 583361320 583513603 583654175
1222.9 583654175 583628464 582938271 582371368 581936073 581826973 581911850 581582947 580429573 579032440 578320427
1232.5 578320427 577652855 576643143 575340195 574465942 574202805 573858833 573571091 573099213 572623787
1241.2 572623787 572392235 572371292 571983948 571593781 571658936 571672211 572312622 573229637 574120140 574877739
1250.8 574877739 575886497 577015839 577342300 577787476 578298187 578620605 578778992 579109993 579692192
1259.5 579692192 579502106 579738464 580686264 581331139 581770401 582140350 582516632 583162003 584107018 584664459
1269.2 584664459 585143204 586046944 587118073 588517342 589923325 590935555 591329002 591294250 591631889
1277.8 591631889 591548004 590987511 590867615 590872040 590803795 590933151 591456909 591554985 591136627 591105995 591263847
1288.4 591263847 590913925 590387878 590162086 589728966 589225006 588818321 588739090 588819733 588432503 587822037
1298.1 587822037 586921768 586342697 585998878 585096397 583996315 583062820 582212524 581465378 580967598
1306.8 580967598 580346184 579962158 579518242 578433609 577571259 576812286 575893707 574893227 574331398
1315.4 574331398 574602737 574533043 573950806 573175583 572635498 572678452 572396507 571586266 570263214 569029579
1325.1 569029579 567950592 566328278 564791145 563192368 561567955 559966049 558409653 557188759
1332.8 557188759 555735893 554454231 552825851 551255112 550365753 549573555 549005547 548503647 548750572
1341.5 548750572 549315033 550161438 550663109 550787773 550745735 550640373 550553513 549976196 549800110 549913216
1351.1 549913216 550275459 550378113 550060577 549931030 549402847 548702507 547809029 547271652 546527672 545133438
1360.8 545133438 544347267 543867798 543060455 542787476 543250198 543023300 542827110 541985741 540423775
1369.4 540423775 540709915 540645638 540579643 540602417 540127907 540566292 542087021 543448486 543806496 544597282
1379.1 544597282 544756012 544860573 545220413 545769501 547103767 548295097 550213585 551826630 553275299
1387.8 553275299 555371056 557511711 559069939 560175667 561296768 561654167 560215416 558835907
1395.5 558835907 560671768 561834602 561973915 560748024 560265884 561248703 560758247 560047836 559103737
1404.2 559103737 557075348 556296005 556750298 556976013 555918770 555067825 554118042 553518410 552963753
1412.8 552963753 552302589 551697693 550699654 549892807 548538017 548203011 545494843 546153679 548396034
1421.5 548396034 548567848 548489609 547111626 547961540 549043541 548758049 549388123 549200439 548909950
1430.2 548909950 549526100 550970917 551393547 552093277 554057274 554732437 552309875 551507072 554165268
1438.9 554165268 555620956 556411743 557408218 557849426 559090157 559028015 559266891 559501991 559035873
1447.6 559035873 557711754 558128242 559166908 558216476 557831612 557220840 557464714 557110329 556074448
1456.2 556074448 551684341 547930031 552885094 553724365 555869637 556375465 556984825 558817482 557676353
1464.9 557676353 560330429 561940727 565007935 567461548 570610199 574401894 576017532 579764709
1472.6 579764709 582698326 589459877 593239021 596615524 600364685 604270058 608589478 611508827
1480.3 611508827 615266838 617141418 620464516 623004837 624944038 627385139 627501755 630582886
1488.1 630582886 632733307 633719330 633283615 636906090 640954208 642340012 644698486 646149521 644432449
1496.7 644432449 645533524 646839752 646417542 648174210 650601349 651591949 653316116 654168396 653952866
1505.4 653952866 646373138 643905869 649475021 651549988 654285736 656487045 657779922 657337952
1513.1 657337952 659664078 661061401 660961456 661600266 658640137 663258438 665562134 661407089 658885117
1521.8 658885117 660649261 665793381 667735825 667344284 667649536 669262924 669737701 670677032 672765427
1530.5 672765427 672925186 673430405 671413040 668976593 671637421 673856735 676345520 678215942 674639206
1539.2 674639206 664453430 669448700 668522720 668001938 672633667 673087997 672798538 675244904 677087936
1547.9 677087936 678497620 678349609 676408691 678006592 679615784 679492722 675923386 675390701 679129410
1556.5 679129410 681177826 669148941 656227036 665808029 674130859 677351151 678525696 678426590
1564.2 678426590 675944214 675232468 676025620 676625519 676224747 671065979 672124557 674227982 674002151
1572.9 674002151 672786407 672102966 670206909 662142563 663489532 664792023 664543610 664241028 663350067
1581.6 663350067 662584000 661349487 660028992 657745819 655183792 653119583 650996628 649329224
1589.3 649329224 647082901 646141205 644775314 643371201 641659393 638863449 636614799 633614540
1597 633614540 631714058 629201775 626840668 624442024 622733192 621760483 619193916 617422829 615308762
1605.7 615308762 613454742 610281677 608169518 605633812 602389641 601687279 599734001 599064217 597311974
1614.4 597311974 596857567 596114845 587294884 588323441 587832069 587342682 585742836 585440407 584122353
1623.1 584122353 579619026 580546608 580705605 581261978 578513412 577096405 577282753 576525879 575915222
1631.7 575915222 574626617 575604553 576168404 571522026 570016060 572369728 574042511 575522079 576767769
1640.4 576767769 575949402 576616211 576576080 578129730 580362358 579711418 579690399 579006767 582222786
1649.1 582222786 584632835 587368050 589760666 585082626 579953270 585739441 591028786 594218140
1656.8 594218140 597098236 599042587 601133423 603238564 605188675 605554504 605456276 609193573 612008514
1665.5 612008514 614200439 616447754 618689270 618185768 620213203 624510193 626131554 629222908
1673.2 629222908 632773705 633856659 633083191 636457443 640068893 642481842 644490509 645489807 648877945
1681.9 648877945 652548676 649859314 642472458 650421906 656688156 659928589 660994720 662508621
1689.6 662508621 664210358 666606598 668756943 670155487 673064423 674714050 667828598 671035080
1697.3 671035080 675251236 679342194 677538376 671364365 677184906 680833969 681497498 680367813
1705 680367813 680789261 679911652 681093140 683254623 683452225 683121872 684076462 685066147 685399704 683552628
1714.7 683552628 682015762 684867020 684580078 677614517 682069092 685581818 687342453 688080902 688102188
1723.4 688102188 687700119 688275375 689029770 688666611 689028015 689989700 688692245 687930374 690057373
1732 690057373 692041321 688743286 683677826 687575760 690613403 691389923 692849960 692272644 690537109
1740.7 690537109 693868103 695633621 694758377 696352158 699352264 700880585 701390152 701848679 702135620
1749.4 702135620 705352249 705716705 706840897 711698685 714881134 717797775 720089264 719327087 720415726
1758.1 720415726 723116989 725293121 727064438 725789871 726252823 729858246 732100754 733989639
1765.8 733989639 736427307 737763596 735725403 736522903 738571320 737304916 735313873 735813904 740132523
1774.5 740132523 742601929 742559738 744821701 745546417 746013412 745730057 744748840 745803223 746777191
1783.2 746777191 747778091 747564774 748449478 750334320 751394348 752280426 753386307 752769775 750926056
1791.8 750926056 748514481 748748474 751982651 752896805 753047943 755306168 757262726 757707901 756602707
1800.5 756602707 757686996 757066803 756601028 757582550 757345581 757938614 758792725 759528046 760969849
1809.2 760969849 762121811 760933456 761176300 762265167 761990891 762029953 761506653 761887131 762114792
1817.9 762114792 762782516 764230118 764545441 765406418 765167160 765777817 766553879 763361282 763155975
1826.5 763155975 764627533 765630264 764695358 762487183 764905396 767349548 768003693 768073273 767734299
1835.2 767734299 767578583 766983185 766106491 766758728 766945801 767603455 768538437 769761276 770098190
1843.9 770098190 765221100 766517639 768509064 767873688 766962280 767432709 767955399 768029861 769314041
1852.6 769314041 770065918 770601959 770668640 770080414 769816513 768963623 768660049 768638763 769126282 769555130
1862.2 769555130 770052643 770645523 770966339 771546783 770799789 769957809 767736664 766599426 768209381
1870.9 768209381 769399033 770237045 770522614 771318283 771713104 771629410 771610107 771410370 771050034 770470352
1880.6 770470352 770646133 770834808 771560822 771892471 772045135 772573395 772497101 773379669 772754974 770408096
1890.2 770408096 770686722 771584778 771818237 772221451 772523041 772113113 772754211 773028488 773105240 773120651
1899.8 773120651 772659378 772622986 772434235 772538834 772446289 772848816 773443604 773607635 773930969 773503418
1909.5 773503418 772295837 771811142 772497330 772265701 772244492 772388458 772875595 774480820 772963409
1918.2 772963409 772306900 773119507 773042374 772948151 771679153 771448669 772238693 772829361 772820358 773202896
1927.8 773202896 773810043 773734894 773537674 773072357 773014145 772632751 772440720 772489853 772547989 773022690
1937.5 773022690 773395233 773904572 773688354 774152756 773746185 771494827 771754913 772143707 772137146 772253113
1947.1 772253113 772784042 773411865 773764877 774034195 773666992 773260803 773099136 772894363 772244644 772192459
1956.7 772192459 772730026 772870483 773182983 773593750 773871536 773791275 773871613 773630981 773110886 772794724
1966.4 772794724 771693420 771414261 772287140 773064346 773528137 774007568 774215393 774043427 773824768
1975.1 773824768 773158951 772765503 772767944 772748184 772717972 772833862 773251038 773825302 774418945 774266357
1984.7 774266357 773563004 772823715 772521973 772246323 771830444 772310181 772539978 772350082 773284912 774360352
1994.3 774360352 774134064 773414154 773046188 772483444 772209167 772208633 772240677 772381439 772693863 772931137
2004 772931137 772876358 773008575 773206177 772953110 772238464 771701126 771176987 770936737 771139679 771628265
2013.6 771628265 772384644 772512589 772296600 771789627 771586838 771182098 770212250 769963760 769935226 770004425
2023.3 770004425 769932480 770290222 770724640 770795212 771065140 770495453 770057755 769493103 768613052 768036270
2032.9 768036270 767809753 768214645 768220139 768413544 768948517 769295425 769155502 768899078 768365097 767530212
2042.6 767530212 767625580 767312241 767111588 767180481 767229843 767730942 767824249 767950211 767525330 767196426
2052.2 767196426 767080841 766716537 766488953 766333847 766743011 767046204 767612228 767733536 767535400 767599487
2061.9 767599487 767194672 767257156 766965027 766564178 766664886 766810303 766865082 766813354 767083206 767228775
2071.5 767228775 767409744 767374802 767355194 767164612 766793900 766988449 767046051 766981888 766849136 767103729
2081.1 767103729 767352829 767382660 767546844 767243347 767116013 767165146 767019958 766730118 766808014 767027893
2090.8 767027893 767162170 767645569 767605286 767206726 766998138 767239075 767461090 767415466 767433777 767484436
2100.4 767484436 767894516 767930832 767426071 766798477 766890793 767542877 767678146 767520676 767431030 767614822
2110.1 767614822 767321854 767276764 767541962 767426987 767455597 767400742 767681580 767916641 768159256 768078461
2119.7 768078461 767746429 767758026 767445602 767621918 767807388 767711182 767443008 767160797 767317657 767387848
2129.4 767387848 767574539 767420883 767449265 767796631 768005981 767873993 767410660 767699356 767795944 767362442
2139 767362442 767174225 767381897 767449951 767356415 767653580 767628098 767377853 767332230 767468872 767328033 767119217
2149.6 767119217 766896667 766828308 767484665 767777786 768010864 768070602 767946014 767974930 767547760 767559433
2159.3 767559433 767881927 767809982 767521210 767832642 768188477 768219147 768678055 769043503 768939819 768119659
2168.9 768119659 767796631 768127441 768372879 768464661 768410873 769159470 769768677 769862976 769746094 769835815
2178.5 769835815 770275040 770176468 769925842 769779129 769998016 770137863 770431213 770789719 770855789 771338730
2188.2 771338730 771461029 771204147 770753250 770630722 770603790 770387573 770879288 771388321 771555252 771576843
2197.8 771576843 771802597 771749496 771761475 772078018 772034378 772041702 771687622 771842041 772389603 772704544
2207.5 772704544 772814560 772607880 772913284 772948303 772771835 772745972 772717896 772514114 772422333 772754898
2217.1 772754898 772834091 773369522 773860474 773884048 773880081 773815689 773630600 773429337 773507156 773303833 773307877
2227.7 773307877 773331528 773682480 774481735 774782562 774630661 774072571 774019394 773877487 773697662 773557587
2237.4 773557587 773537979 774081421 774009552 774274902 774648209 774909058 774923325 774393158 774181137 774050522
2247 774050522 774312592 774189758 774147110 774291458 774629669 775215988 774763794 774613190 774515076 774391632
2256.7 774391632 774429932 774235001 774258423 774514771 775024872 774830093 774812927 775047150 775169678 775288544
2266.3 775288544 774864197 774730911 774838486 774707031 774310303 774607239 774921036 775117035 775450134 775312271
2275.9 775312271 775504913 775080948 775109940 775218811 774755020 774857483 774737015 774966965 775183029 775680542
2285.6 775680542 775691071 775503769 775837250 775217133 774984207 774708633 774673309 774732742 774893799 775657959
2295.2 775657959 775561142 775431366 775000458 774959717 774775314 774194183 774297333 774022369 774107971 774249649
2304.9 774249649 774515533 774631577 774834595 774846115 774094772 774348602 773987885 773451462 773175888 773170395
2314.5 773170395 774012375 774254303 774356384 774224701 774072647 773348160 773130798 773677216 773078461 772986832
2324.2 772986832 772958145 772606506 772056656 771926880 772186050 771923141 772196426 772564697 771751862 769960937
2333.8 769960937 770168381 771108475 770777512 771458282 772174149 771753082 771805038 772027817 770693436 769540329
2343.4 769540329 769897842 769820862 768827362 768687134 769621277 770734787 771152496 770731812 771386642 771214752
2353.1 771214752 770116425 768446884 767151489 769345856 769286346 768493347 769435730 770049591 769505615
2361.8 769505615 768246384 769134216 768470459 767280579 766639175 766958923 767716827 767613220 768359528
2370.4 768359528 768377838 768501968 768741379 768762894 768266983 767885742 768474731 768443832 768831558 769002533
2380.1 769002533 768484955 768555222 768952713 769075928 769001694 769020462 768830948 768614426 767818375 767501984
2389.7 767501984 767967072 767923813 768179855 768390350 768727798 769001083 768572159 767796631 767298203 767258072
2399.4 767258072 766796265 766638718 766500549 766356354 766521759 766547699 766705704 766614838 766507950 765938721
2409 765938721 765387268 765503464 765628052 765582199 765546722 765682983 765344238 765168839 764979858 764557648
2418.7 764557648 764286194 763922958 763828583 763574600 763485947 763376160 763196259 763107529 763034439 762925491
2428.3 762925491 762389755 762540359 762252350 761384964 761084671 760938644 760914841 760736542 760965118 761058273
2438 761058273 760857162 760313950 759528046 759428482 759242401 758984833 758772964 758586197 758431931 758648376
2447.6 758648376 758705978 758130493 757992706 757618790 757272797 756902618 756558838 756864395 757017593 757018890
2457.2 757018890 756514130 755924530 755598831 755557556 755506668 755083389 754839249 754363251 753998337 753968964
2466.9 753968964 754204330 754436188 754362488 754110870 753489990 753144836 752963715 752562256 752131805 752129211
2476.5 752129211 752015305 751624451 751959305 752405777 752353821 751514893 750845947 750520172 750197830 750376358
2486.2 750376358 750014114 749862976 750176010 750242462 750045166 749552841 749437485 749254913 748915253 748674698
2495.8 748674698 748562164 748509521 748286209 747976608 747926178 748195343 748178558 748234177 747987213 747127380
2505.5 747127380 746555786 746762772 747245941 747244110 747139511 746838531 746735458 746884995 746809692 746491776
2515.1 746491776 745985565 745975189 745652237 745019379 744851379 745127869 745567398 745700607 745518265 744755325
2524.7 744755325 744253464 744047089 743683624 743446732 743280182 743015747 742586288 742669220 742686005 742792740
2534.4 742792740 742946930 742547684 742193146 741380539 740609894 740328217 740578156 741007462 740897522 740594711
2544 740594711 740423737 740673599 740394745 739770966 739284592 738672409 738637085 738835068 738688507 738574066
2553.7 738574066 738905716 738703537 738211441 738009033 737270279 736783600 736723862 736329498 735853348 735830460
2563.3 735830460 735811539 735782776 735939560 735609360 735156555 734688416 734274597 733935928 733639679 733478775
2573 733478775 733280182 733477173 733617401 733228836 732897873 733171616 733052826 732376328 732005386 731471558
2582.6 731471558 730920105 730533371 730813599 731062622 730805740 730745926 730391541 730340195 730000000 729288940
2592.2 729288940 729262314 729474869 729348145 728916550 728890228 728659134 728434448 728642197 728800812 728595734
2601.9 728595734 727853699 727349777 727044754 726983185 726750183 726571808 726798172 726738739 726869812 726480789
2611.5 726480789 725726166 725167313 724571915 724283676 724141312 724182129 723972168 723614807 723529053 723493423
2621.2 723493423 723003159 722200851 721735764 721315842 720994568 720601196 720377731 720470505 720248184 719901581
2630.8 719901581 719313965 718675766 718456421 718117599 717367859 716984024 716684036 716067963 715800400 715567856
2640.5 715567856 715185928 714944916 714839172 714363174 713561783 712993622 712517242 712144775 711694794 711362762
2650.1 711362762 711283340 711010895 710567627 710241699 709878387 709371796 709200897 708796616 708096161 707693100
2659.8 707693100 707372742 707257538 707128677 706613464 706232758 706206131 705654373 704811249 704297028 703943253
2669.4 703943253 703505936 703041916 703299637 703605118 703395691 702971420 702577209 702220535 701684189 701507416
2679 701507416 701085815 700537491 700252609 700152969 700301514 699910889 699475098 699080734 698735352 698257141
2688.7 698257141 697375488 696804810 696579971 696873016 697030487 696900101 696654663 696249619 695877533 695185013
2698.3 695185013 694682236 694242859 693765259 693386841 693114700 693044662 692887192 692757416 692385635 691812286
2708 691812286 691206436 690659943 689991074 689608307 689576721 688976898 688952103 689152298 688731003 688424072
2717.6 688424072 688059082 687806091 687669220 687233429 686512070 686146469 685995255 685548477 685235672 685175705
2727.3 685175705 684881744 684457245 684398117 684045334 683315048 682574081 682265701 682390289 682365494 682479324
2736.9 682479324 682281265 682011642 681739807 681470642 681228867 680508575 680250702 680194550 680230789 680039291
2746.5 680039291 679697189 679947128 679769058 679283829 678636322 678196945 678018265 677724686 677315369 676669464
2756.2 676669464 676597748 676747971 676972961 677103729 676583939 675772629 675501938 675711899 675168228 674794464
2765.8 674794464 674832535 674483185 674080887 674038925 674070053 673805161 673967819 673846207 673277206 672608109
2775.5 672608109 671803284 671213150 670834961 671095810 671167603 670978165 670821228 670448532 669802322 668981476
2785.1 668981476 668547745 668135681 668177185 667957611 667445602 667222290 666548767 666092834 665338669 664846725
2794.8 664846725 664671631 664141006 663924561 662917023 661765900 661560440 661407852 660656738 659848785
2803.4 659848785 659369812 658762207 658111267 657281113 656664886 656440887 655971527 655304489 654421234 653289185
2813.1 653289185 652724380 652350693 651356277 650636215 649750137 648394470 647347488 646560822 645767517
2821.8 645767517 644796753 644040985 643474503 643039169 642005157 640570374 639786263 639036369 638234253
2830.4 638234253 637105446 636022377 635083275 633606682 632145195 630724754 629583893 628820152 627644768
2839.1 627644768 625475426 623275299 621561317 619680748 617734299 615195618 612585754 610368652
2846.8 610368652 607742920 604937859 602439308 600282669 598506470 597255402 596277046 595886002 595603256
2855.5 595603256 594876595 594626541 594922638 595197258 595023613 594775772 594181633 593363724 593046341 592429810
2865.2 592429810 591397705 590297279 588791580 586608009 585011063 583844643 581944008 580245895
2872.9 580245895 578719063 577206841 575609207 573918037 572410622 570947113 569436455 567782135
2880.6 567782135 566597786 565245399 563877258 562935638 561800156 561169281 560983963 560515556 559413109
2889.3 559413109 558583260 557970772 556928329 556184273 555768204 555777054 555428505 554802055 554333992 553870087
2898.9 553870087 553660011 552774582 551741066 551126900 550296364 549121971 548455238 547985535 546686325
2907.6 546686325 546027222 545526505 544203300 542632980 540594826 538011055 534917030 532267723 530312080
2916.3 530312080 528105392 525794029 524000015 522288132 520436516 518919106 517998924 517736320 517148132
2925 517148132 516304855 515888176 515870171 515608521 515358925 516246567 517216759 518556175 519985123 520868149
2934.6 520868149 522164116 523517647 525374908 527417488 529523125 531670723 533738441 536571770
2942.3 536571770 539251213 541271324 543270950 545478210 547341309 549467049 551852798 553802834
2950 553802834 556174316 558130875 559609718 561402016 563343353 565028877 566523094 568390694 570228043
2958.7 570228043 572272568 574087219 575722885 577863350 579906235 581548729 583033257 585279083
2966.4 585279083 587635384 588996201 589959488 591349449 593003349 594508247 596349144 598228188
2974.1 598228188 599423523 600426788 602135468 603991470 605267220 606415176 607511330 608402901
2981.8 608402901 609357338 610461807 611464691 612724915 613756752 614457817 615660782 616595535 616902733
2990.5 616902733 617085915 617495003 617712708 617975502 618733482 619289398 619784317 620208588 620418549 620135612
3000.2 620135612 619859352 620005989 619805069 619679031 619686737 619642220 619452133 619360428 619638176 619367294
3009.8 619367294 618730583 618423920 618019142 617542534 617362175 616807213 616446877 616452141 615892944 615111694
3019.5 615111694 614537315 614274597 613080063 611973801 611932297 611420441 610747108 609797821 609108925
3028.1 609108925 608703270 607988472 607405968 606586952 605710678 604637413 603690109 603207207 602577324
3036.8 602577324 601390800 600390739 599778595 598715019 597931938 597105103 596132088 595149689 593920403
3045.5 593920403 592864113 591813545 591099586 590091171 589430428 589120293 588152580 587318611 585918999
3054.2 585918999 584474678 583694534 582779274 581584816 580642319 580202370 579323959 577944450 576713371
3062.9 576713371 575885429 575170517 574498787 573544807 572426682 571473770 570098534 569328537 568879242
3071.5 568879242 568004761 567109871 565908661 564368744 562872887 562417908 561903114 560616455 559615936
3080.2 559615936 558767586 557879333 556690865 555542183 554771347 553870392 552576599 551680870 550808945
3088.9 550808945 549442711 548669739 548080635 547217331 545904312 544626007 543879471 542942772 541793938
3097.6 541793938 540515518 539672318 538756790 537654114 537210197 536885262 536010551 534707375 533741913
3106.2 533741913 532430611 531281281 530780602 529912643 528783531 527140388 525999603 525440178 524463310
3114.9 524463310 523419571 522402496 521646233 521009598 520177803 518941536 517589035 516541672 515485916
3123.6 515485916 514555168 514136734 513386688 512022820 511046715 510013046 508852234 507921219 507015381
3132.3 507015381 505888329 504922447 504630318 503918343 503156052 502386513 501141090 499989738 498812218
3141 498812218 497809372 496512489 495368004 494612236 494018097 493536339 492554054 491760979 490997505
3149.6 490997505 490076332 488861809 487713127 486966591 485873070 484833870 483657455 482971764 482714653
3158.3 482714653 481633682 480034065 478878021 478484650 477658882 476508026 475468521 474765778 474596710
3167 474596710 474063187 472919388 471816101 471176376 470249825 469306755 468313942 467287025 466554222
3175.7 466554222 465516281 464826508 463924484 463090286 462628975 462069016 461883354 460870857 459474640
3184.4 459474640 458482552 457441139 456283722 455261955 454854889 454392624 453640137 452883148 452081909
3193 452081909 451240883 450719910 450098305 449065514 448256798 447176857 446039886 445480385 445120163
3201.7 445120163 444509850 443906822 443252335 442524300 441777802 440452690 439772263 439410782 438686028
3210.4 438686028 438019447 437131462 437134933 436775475 435261459 434282188 434175148 434029350 432876625 431901894
3220 431901894 431160583 430356026 430083580 429576149 428682137 427981911 427774200 427346725 426358299 425472374
3229.7 425472374 424603729 423912201 423691406 423284950 422811966 422147255 421083221 420669441 420445747
3238.4 420445747 420019455 419095993 418018150 417927246 417801857 417134857 416054916 415531082 415429764
3247 415429764 414658241 413950500 413187599 412258110 411111488 410593071 410807190 410331688 410087967 409962006
3256.7 409962006 409329376 408763199 408244858 407655640 406838150 406237488 406302147 405912361 404944229 404556732
3266.3 404556732 404210205 403944244 403931885 403744774 402913208 401761627 401468582 400796661 400220833 400139008
3276 400139008 399661255 399514465 399169159 398822556 397982864 397049332 397036552 396699829 396267319 395854607
3285.6 395854607 395496025 395344009 395153580 395103378 394713478 394046288 393831329 393832550 393383369 392499695
3295.3 392499695 391309586 390495567 390362778 390489693 390389824 389989700 389559174 388697243 388622055 388906517
3304.9 388906517 388127899 387417908 386778984 385893593 385126228 385134430 385684700 385604210 384437561 383227272
3314.6 383227272 382948189 382567024 382177162 381970100 381720276 381278725 380594864 380407104 380086517 379566994
3324.2 379566994 378896255 378172531 377684250 377096939 376488647 376027451 376038475 375498695 374591293 373909492
3333.8 373909492 373347397 373076744 372108345 371077271 370795898 371059036 370856972 370018272 369364891
3342.5 369364891 368764381 368443604 367685471 367251167 367243881 366581383 366005402 365278206 364547768 364119873
3352.2 364119873 363612366 362565651 361772575 361506462 361067162 361176910 360980721 360038261 359033127
3360.8 359033127 358718910 358849182 358437538 357888870 356677094 355829353 355562782 354458580 353876343
3369.5 353876343 354168625 353866158 353198395 352909164 352161522 351346321 350919380 350661621 350647202 349861526
3379.2 349861526 348715363 348142090 348177948 348072395 347491989 347179756 346915894 346626778 346261864 345932312
3388.8 345932312 345628281 345101700 344755707 344194946 343507385 343295250 343164177 343080521 343048248 342723083
3398.4 342723083 342336235 342107391 342111397 342072029 341828423 341407166 341042404 341123505 340756378 340579109
3408.1 340579109 340986900 340697517 340012970 339711304 340094185 340124626 339859009 339532433 339175110 339090576
3417.7 339090576 338670120 339218292 339652557 339334831 339625626 339438438 339083481 338822556 338673553 338475647
3427.4 338475647 338440018 338772469 338972054 338975220 338687897 338737221 338845444 339032249 339000740 338906784 339384804
3438 339384804 339980545 340515480 340572090 341195869 341221008 341104774 341853447 341693268 341827011 341475220
3447.6 341475220 341872101 343017082 342892990 342786140 342872849 343313408 343740730 344842453 345857735
3456.3 345857735 345793266 345969505 346148605 346844635 347384109 347630730 347686958 347812233 348656235 349325142
3466 349325142 350007172 350418167 351050453 351452484 351656837 352460747 352814331 353267059 353817749 354250145
3475.6 354250145 354785423 355305557 355330963 355602226 356768265 357363243 357672462 358012466 358781052 359323654
3485.2 359323654 359503899 360235748 360386124 360762520 361681976 362551651 363274536 364154358 365059204 365527763
3494.9 365527763 366038361 365928841 366484222 368004761 368800392 368818436 369300194 370180702 369941521 370291519
3504.5 370291519 371524200 372232437 372864418 374584236 375480576 374821892 375633278 376290588 376951866
3513.2 376951866 377553825 378149185 379430504 379849434 380949783 382146339 382683029 383668137 384931488
3521.9 384931488 385378685 384658890 385315781 386519699 387590332 388319206 389018021 389955826 390551758
3530.6 390551758 391055832 391848106 393041954 393515663 395179901 396215096 395804176 397399254 398409386
3539.2 398409386 399192924 399790764 400668488 401963501 402932663 403706055 403047218 403899117 404592705
3547.9 404592705 406374321 408321304 409336510 411330452 410824127 411575699 412964973 414090271 415430412
3556.6 415430412 415808830 417750778 418815460 419763260 420808640 422320862 423426247 424212303 428344345
3565.3 428344345 428144379 427154961 427963104 428277740 431867294 433562622 435177460 436658287 438300400
3574 438300400 440207214 441285896 442845001 443287315 445460625 447342720 448222694 449976845 451728973
3582.6 451728973 453345222 454629402 459161530 461092415 458898964 459844437 459082375 462506409 466000061
3591.3 466000061 468832474 469702606 470164833 474150047 473195992 475367012 479523315 480578728 483022385
3600 483022385 482801018 484003716 487348557 489362297 491340904 494374504 497316971 496635895 499155235
3608.7 499155235 497467499 497749481 506233139 507127800 505550957 509909286 508877106 512582283 516350822
3617.4 516350822 515636711 517295418 516432915 517255554 520988998 524783020 527397346 529353218 531128197
3626 531128197 533877869 541232414 539966202 527503853 533152428 539475822 545467949 546159286 543599129
3634.7 543599129 546444550 550205917 551874275 551689034 553725090 556969719 559261169 559455299 560166588
3643.4 560166588 562741661 566329918 572808533 571111183 567372475 572983360 569191055 563837471
3651.1 563837471 566662025 574992714 579823265 583251495 586906242 577807045 580532150 586662750
3658.8 586662750 588332253 589328690 589600792 591753731 592478943 593599243 595602493 596625061 601181030
3667.5 601181030 602865143 600262184 600364189 594817543 599197197 608955040 618169594 615232048
3675.2 615232048 594433556 599877586 608550720 613036156 610468369 610876770 613852463 615095940
3682.9 615095940 617298393 618340073 618449173 622921181 629299889 619871483 616160507 623600273
3690.6 623600273 616743736 618234062 624928856 625470734 627045975 627506294 627289009 629206696 629853745
3699.3 629853745 631797676 634434967 629411697 627427406 632119904 633430252 634035530 635075836
3707 635075836 638131523 642324829 634130592 638315697 643274231 628642654 633039780 638106575
3714.8 638106575 639090576 640161362 642811813 644407425 641029510 641430130 646344299 641977310 638179703
3723.4 638179703 644992218 646383514 645315781 642492676 642580872 646568832 647628937 653237457 648967209
3732.1 648967209 641671219 652254486 651501617 641073608 643844223 646969452 647159348 649975433
3739.8 649975433 653130569 648945618 652346954 663483810 647243423 632346382 646409988 654617996
3747.5 654617996 660501709 655081482 643634033 655109940 651255569 645359726 652025757 657221756
3755.3 657221756 660012970 653917694 655661392 660915680 653342667 652683792 657681732 659154739
3763 659154739 659599304 663231735 660017242 654430389 658146210 663946075 664195480 655542221 657684631
3771.7 657684631 661149216 661019821 661116180 661122131 662362442 663266830 666516190 665729523 656995010
3780.3 656995010 660673752 664092026 665011292 667246780 664021225 662794342 663801041 664497299 665724487
3789 665724487 665311661 665500488 665873184 666564865 666268311 667313843 671063690 666727829 662382507
3797.7 662382507 665359573 669881210 674979935 666939316 657640152 662669678 667163849 672404099
3805.4 672404099 676945190 665626755 661924057 667758484 670235748 670415421 670449905 670657196 671828842
3814.1 671828842 676725616 672943802 658845749 666068344 671975632 676398315 678766632 661369705
3821.8 661369705 662950439 667995071 671233597 674433746 674007263 670011826 670500412 672712097 675543137
3830.5 675543137 676102676 667934265 671606903 678580856 671931152 672254562 680884399 670949707 666482925
3839.2 666482925 674539566 668285446 669251785 676649780 672929993 669004517 672408752 674708328
3846.9 674708328 675692520 677894821 676506653 678208847 684273224 677358398 674960861 657500534
3854.6 657500534 663531952 675050125 673106995 672404327 675887604 679178848 682138519 676223068
3862.3 676223068 676607208 683296738 674976578 669000778 673994675 680048370 686987534 678143158
3870 678143158 667631531 672488480 679202423 681066132 671009521 673628464 677482834 677406311 680798798
3878.7 680798798 686023254 678596725 670625763 677633209 679224243 680972061 684935989 671980362
3886.4 671980362 674392319 678552094 679872589 684553909 683003082 673722839 675218353 678977966
3894.1 678977966 677839737 679251709 680894012 683777542 685353165 674662704 679387894 680866547
3901.8 680866547 674980011 679641953 676507187 675405731 676563873 677791824 679921112 679343796
3909.6 679343796 679897614 680390778 680327148 679748459 679470444 681970291 683531265 678638763 676502991
3918.2 676502991 682229767 682175827 677761612 680118484 681580963 682403259 680150909 677090149 679507065
3926.9 679507065 681185913 681667709 680648193 681475143 683198776 678869476 678012848 680021210 680577621
3935.6 680577621 681635056 681757355 681611862 681645203 680989532 682502441 683618698 679440155 679334106
3944.3 679334106 680815659 681456299 682642517 680211182 680791931 680722275 678858643 681908340 683082123
3953 683082123 682446518 681796417 681571655 681702805 680973282 681163177 680798111 682555466 683968506 681931992
3962.6 681931992 681730728 682100754 682254944 682637482 682295074 681906586 681735611 681934662 682371292 682061462
3972.2 682061462 681542053 681576538 681723328 682098923 682187500 682481766 682739716 682649765 682944412 683234634
3981.9 683234634 683341980 683147430 682849350 681958084 681877136 682748871 683242569 683826218 683157043 682475052
3991.5 682475052 682361679 682525177 682761459 681997604 681929245 681807938 681919632 682676849 683049469
4000.2 683049469
##END=$$ End of the data block
