##TITLE=$$ Begin of the data block
##JCAMP-DX=5.00 $$ ACD/SpecManager v 10.08
##SPECTROMETER/DATA SYSTEM=Varian
##DATE=20 Nov 2012 15:53:16
##DATA TYPE=INFRARED SPECTRUM
##DATA CLASS=XYDATA
##ORIGIN=
##OWNER=
##NPOINTS=3735
##FIRSTX=399.26403809
##LASTX=4000.35498047
##MAXX=4000.35498047
##MINX=399.26403809
##MAXY=77.75068665
##MINY=32.98759460
##XFACTOR=1.0000000000
##YFACTOR=0.000000100000000
##FIRSTY=59.92924881
##DELTAX=0.96440572
##XUNITS=1/CM
##YUNITS=TRANSMITTANCE
##XYDATA=(X++(Y..Y))
$$ plain form
399.3 599292488 579065628 567889023 570045547 574388275 569012680 564929810 569117050 574320755
407 574320755 568105927 552548447 557203789 568601456 573450050 570277290 565025558 569969292
414.7 569969292 574172592 577851715 577977524 583059273 583551941 566567001 563780823 557636528 556532364
423.4 556532364 562499695 571069527 580211983 580568085 574192963 563857117 559601631 558590050
431.1 558590050 555681648 552963791 552859802 555538216 559091568 560077782 557818375 558051758 555506248
439.8 555506248 556373482 559519386 558256378 558927002 558208046 559449196 559811363 567707558 578731384
448.4 578731384 580291824 576740456 572093582 572733841 570768166 565559082 567197227 574037666 581895866
457.1 581895866 576977577 571571083 571253929 570516090 567870636 564001732 562068367 558918076 556482315
$$ packed form
399.3E99292488k0226860j1176605K156524M342728n375595m082870M187240N203705
407E74320755o214828j5557480M655342J1397667M848594l172760n251732M943734
414.7E69969292M203300L679123J25809N081749M92668j6984940k786178o144295j104164
423.4E56532364N967331Q569832R142456L56102o375122j0335846m255486j011581
431.1E58590050k908402k717857j03989K678414L553352R86214k259407K33383k545510
439.8E55506248Q67234L145904j263008O70624p18956J241150L62167P896195J1023826
448.4E78731384J560440l551368m646874O40259j965675n209084J638145O840439P858200
457.1E81895866m918289n406494l17154p37839k645454l868904j933365l150291k435761
$$ plain form
465.8 556482315 559021111 567632370 570674400 569500656 566429100 559510498 552553482 547814255
473.5 547814255 551389885 553617439 553274193 551707573 547504845 552181549 558435135 557016792 551964226
482.2 551964226 547471390 544414520 546163254 547711143 546647758 551686211 553553238 550094604
489.9 550094604 550353966 551808052 551721802 550284538 547205582 540072060 535334435 538348083 541745720
498.6 541745720 543223991 547952919 550148964 548582382 548477478 544605141 540235596 536280746 531516495
507.3 531516495 531295280 532167816 532638550 534429741 537568245 536428261 533647499 530483360 527909241
516 527909241 525810585 519772835 516475067 514692307 517050362 519729462 518159790 516522827 516593170
524.6 516593170 518250389 515672569 512894287 510423126 509216690 510605316 512563591 516716423
$$ packed form
465.8E56482315K538796Q611259L042030j173744l071556o918602o957016m739227
473.5E47814255L575630K227554l43246j566620m202728M676704O253586j418343n052566
482.2E51964226m492836l056870J748734J547889j063385N038453J867027l458634
489.9E50094604K59362J454086q6250j437264l078956p133522m737625L013648L397637
498.6E41745720J478271M728928K196045j566582j04904l872337m369545l954850m764251
507.3E31516495k21215Q72536M70734J791191L138504j139984k780762l164139k574119
516E27909241k098656o037750l297768j782760K358055K679100j569672j636963P0343
524.6E16593170J657219k577820k778282k471161j206436J388626J958275M152832
$$ plain form
532.4 516716423 517470322 516947861 518524971 520527802 519026146 517147980 519340782 521181030 524626999
541 524626999 525720978 527359467 532888718 535157928 534845009 533184052 531995621 530270119 527926178
549.7 527926178 526825829 527756081 530297318 530498352 529698524 528955498 528856583 527165642 524143791
558.4 524143791 522332268 520232086 518735580 516008682 514882317 514191017 512365608 511201859 509126778
567.1 509126778 506583977 503015060 501040115 498369484 496310120 494483452 492592926 494325676
574.8 494325676 495149269 496483574 496565361 497696724 499948235 501428146 503856621 504921837 508132095
583.5 508132095 511091690 514205780 517340012 519326820 521858749 521909027 521735840 522408600 523576050
592.1 523576050 524067802 524306717 524509926 523161049 523132553 524139557 525526924 526252556 526643906
$$ packed form
532.4E16716423P53899n22461J577110K002831j501656j878166K192802J840248L445969
541E24626999J093979J638489N529251K269210l12919j660957j188431j725502k343941
549.7E27926178j100349R30252K541237K01034p99828p43026r8915j690941l021851
558.4E24143791j811523k100182j496506k726898j126365o91300j825409j163749k075081
567.1E09126778k542801l568917j974945k670631k059364j826668j890526J732750
574.8D94325676Q23593J334305Q1787J131363K251511J479911K428475J065216L210258
583.5E08132095K959595L114090L134232J986808K531929N0278j73187O72760J167450
592.1E23576050M91752K38915K03209j348877k8496J007004J387367P25632L91350
$$ plain form
600.8 526643906 527012405 526466942 526149368 525682945 525928764 526894493 527841187 526348000 525145950
609.5 525145950 526428490 526028442 525835342 526639404 527903519 529158478 530626106 531636009 531879616
618.2 531879616 533901558 535155983 535372620 535727348 537176437 539160309 540626335 543299789 545985603
626.9 545985603 547915344 548312874 548548393 548729706 548160286 548621597 549246368 550408363 552396927
635.5 552396927 554500847 555763206 556305008 557933006 559606476 558971024 557369881 556430397 555495644
644.2 555495644 556896706 559397240 560382767 561876488 563772964 565518074 566539307 566353073 564699287
652.9 564699287 563923950 563820953 563025017 564835358 566792946 567836990 569191895 570247269 570583839
661.6 570583839 569456978 568932076 568027115 567413177 568387260 566799431 562751884 569379196 574361382
$$ packed form
600.8E26643906L68499n45463l17574m66423K45819R65729R46694j493187j202050
609.5E25145950J282540m00048j93100Q04062J264115J254959J467628J009903K43607
618.2E31879616K021942J254425K16637L54728J449089J983872J466026K673454K685814
626.9E45985603J929741L97530K35519J81313n69420M61311O24771J161995J988564
635.5E52396927K103920J262359N41802J627998J673470o35452j601143r39484r34753
644.2E55495644J401062K500534R85527J493721J896476J745110J021233j86234j653786
652.9E64699287p75337j02997p95936J810341J957588J044044J354905J055374L36570
661.6E70583839j126861n24902r04961o13938R74083j587829m047547O627312M982186
$$ plain form
670.3 574361382 577161331 577475929 576218262 574915237 573895416 573197327 574208450 576112251 578345375
678.9 578345375 580553169 581904106 583329773 584730949 584266968 583066254 582195549 580117340 578541222
687.6 578541222 578983688 581322632 584245148 585577736 585681305 585959778 586661110 585055161 581630402
696.3 581630402 579141731 577562943 577253799 577474327 577947121 578601685 578826027 578030090 576664543
705 576664543 575391579 573844719 572799377 571704903 570846710 570898972 572528992 575583572 577649078
713.7 577649078 579067650 580304108 581501160 581859436 580849457 581070747 584417915 588540802 590423164
722.3 590423164 592653656 596046257 598812561 600594368 601660919 602871704 603551254 604055672 605359879
731 605359879 607668762 610277061 612597847 615241814 616984825 618827400 620909958 620953560 620022163
$$ packed form
670.3E74361382K799949L14598j257667j303025j019821o98089J011123J903801K233124
678.9E78345375K207794J350937J425667J401176m63981j200714q70705k078209j576118
687.6E78541222M42466K338944K922516J332588J03569K78473P01332j605949l424759
696.3E81630402k488671j578788l09144K20528M72794O54564K24342p95937j365547
705E76664543j272964j546860j045342j094474q58193N2262J630020L054580K065506
713.7E77649078J418572J236458J197052L58276j009979K21290L347168M122887J882362
722.3E90423164K230492L392601K766304J781807J066551J210785O79550N04418J304207
731F05359879K308883K608299K320786K643967J743011J842575K082558M3602r31397
$$ plain form
739.7 620022163 618374786 617072449 617387695 618348122 619246712 619769135 619807663 618940659 618468742 618253250
749.3 618253250 616829491 614217148 610275803 607333794 607501526 607968445 607556534 608311348 606471863
758 606471863 602041168 600069237 598808975 597137985 596144257 595156746 594313774 595571365 597604828
766.7 597604828 598589363 599442024 599635696 600777664 602652626 604605789 607662163 609674721 612379723
775.4 612379723 616394691 620196114 623843422 626447830 629931831 632684059 633250732 633893623 635725784
784.1 635725784 638490906 640988998 644027557 647058334 648939056 649616394 650504532 651095352 651393280
792.7 651393280 653908005 655042267 655058289 656610107 658421860 660676117 662557983 663949356 665411072
801.4 665411072 666437912 667127304 668807449 669511490 668553391 669303589 671528168 672623978 672821655
$$ packed form
739.7F20022163j647377j302337L15246R60427Q98590N22423L8528q67004m71917k15492
749.3F18253250j423759k612343l941345k942009J67732M66919m11911P54814j839485
758F06471863m430695j971931j260262j670990r93728r87511q42972J257591K033463
766.7E97604828R84535Q52661J93672J141968J874962J953163L056374K012558K705002
775.4F12379723M014968L801423L647308K604408L484001K752228N66673O42891J832161
784.1F35725784K765122K498092L038559L030777J880722O77338Q88138N90820K97928
792.7F51393280K514725J134262J6022J551818J811753K254257J881866J391373J461716
801.4F65411072J026840O89392J680145P04041r58099P50198K224579J095810J97677
$$ plain form
810.1 672821655 673993988 673884201 672663956 671900482 671438293 671480484 670801926 671319504 672710190
818.8 672710190 674315567 675846176 675727692 675197372 674185715 673036804 671981888 671605453 671027985
827.5 671027985 670570374 671098938 670801239 670880051 669854813 667529984 665701447 663418198 660950394
836.1 660950394 658831100 657003632 655453720 655329819 655786285 655223083 653807526 652258148 650949402
844.8 650949402 648965759 646657486 644978638 643948288 643155594 643436890 643854065 643405991 642731552
853.5 642731552 640452652 637873611 635360107 632082977 629512978 627796593 626622086 626336823 627752228
862.2 627752228 629969292 632082062 634930344 637822609 640507202 643068466 645002975 647440491
869.9 647440491 651734085 656682663 662126160 667123871 669178391 670489502 671663055 672396393 672575073
$$ packed form
810.1F72821655J172333j09787j220245p63474m62189M2191o78558N17578J390686
818.8F72710190J605377J530609j18484n30320j011657j148911j054916l76435n77468
827.5F71027985m57611N28564k97699P8812j025238k324829j828537k283249k467804
836.1F60950394k119294j827468j549912j23901M56466n63202j415557j549378j308746
844.8F50949402j983643k308273j678848j030350p92694K81296M17175m48074o74439
853.5F42731552k278900k579041k513504l277130k569999j716385j174507k85263J415405
862.2F27752228K217064K112770K848282K892265K684593K561264J934509K437516
869.9F47440491M293594M948578N443497M997711K054520J311111J173553P33338J78680
$$ plain form
878.6 672575073 672182083 671597595 670638123 670804138 671258011 671330338 670112305 667897644 666087723
887.3 666087723 663723221 660279007 656626053 654348679 652729263 651390457 650347824 649997101 649660568
895.9 649660568 648146057 646477051 644265442 642332840 640533524 639067612 638107071 636401520 635334663
904.6 635334663 634357224 633023109 631225624 628506165 624756279 620358200 616544304 612560196 609384842
913.3 609384842 607070618 604393005 601673431 598099861 594589233 591837883 588388748 585038109
921 585038109 582569923 580394859 578774033 578464622 578782845 578362503 577509117 576744385 577146568 577728920
930.7 577728920 577608871 577516937 576877403 577277870 578721085 580341339 582227936 583389778 585115166
939.3 585115166 587205276 588185577 589175224 590235291 591058884 591728020 591332512 590595436 589659538
$$ packed form
878.6F72575073l92990n84488r59472J66015M53873P2327j218033k214661j809921
887.3F66087723k364502l444214l652954k277374j619416j338806j042633l50723l36533
895.9F49660568j514511j669006k211609j932602j799316j465912r60541j705551j066857
904.6F35334663r77439j334115j797485k719459l749886m398079l813896l984108l175354
913.3F09384842k314224k677613k719574l573570l510628k751350l449135l350639
921E85038109k468186k175064j620826l09411L18223m20342q53386p64732M02183N82352
930.7E77728920j20049r1934o39534M00467J443215J620254J886597J161842J725388
939.3E85115166K090110R80301R89647J060067Q23593O69136l95508p37076r35898
$$ plain form
948 589659538 587583580 585076485 581312866 576330566 571465416 565666924 560091553 555159378 549977837
956.7 549977837 544790077 539678574 534223862 527964745 522449455 516666374 509296341 501750488
964.4 501750488 495258255 488516693 481341057 474633942 467503662 460777512 453431168 446317635
972.1 446317635 438453789 429652023 422014542 413744621 406079750 398300819 391183662 384541626
979.8 384541626 378336906 372684746 366432838 361436272 356318855 352739525 349067345 346153221
987.6 346153221 344306984 341623535 340387001 338849983 338371239 337996864 338059769 337390327 336280861
996.2 336280861 336503830 336418266 337311325 336642914 337277184 337888870 337848434 338392563 338112869 339013977
1005.9 339013977 337924728 337806473 336531715 334405937 334430046 334089851 334122810 332649345 332491417
$$ packed form
948E89659538k075958k507095l763619m982300m865150n798492n575371m932175n181541
956.7E49977837n187760n111503n454712o259117n515290n783081p370033p545853
964.4E01750488o492233o741562p175636o707115p130280o726150p346344p113533
972.1D46317635p863846q801766p637481q269921p664871p778931p117157o642036
979.8C84541626o204720n652160o251908m996566n117417l579330l672180k914124
987.6C46153221j846237k683449j236534j537018m78744l74375O2905o69442j109466
996.2C36280861K22969q5564Q93059o68411O34270O11686m0436N44129k79694R01108
1005.9C39013977j089249j18255j274758k125778K4109l40195L2959j473465j57928
$$ plain form
1014.6 332491417 331989670 331937561 331663513 330385017 330758133 329875946 330856094 331878624 333793793
1023.2 333793793 334682999 334777031 337153473 338025970 339340401 339361916 341050491 342567978 343806229
1031.9 343806229 345958023 345952225 348231506 349146461 350017204 350797272 350634766 350602837 350415459 351499825
1041.6 351499825 351038284 352315407 352636604 352531204 353313255 354358139 355874939 354778519 355598030
1050.2 355598030 356471100 358370018 360001907 361199837 364389381 367190056 370746002 372310104
1058 372310104 375839462 379318352 382502327 387041016 389865265 393664436 397095375 401352959 404399071
1066.6 404399071 407188263 408781395 407631226 405765953 401499672 398025856 392055130 386047630
1074.4 386047630 381879349 378417511 377180557 375395851 375405121 374473877 375302048 376603508 376624794
$$ packed form
1014.6C32491417n01747n2109k74048j278496L73116q82187R80148J022530J915169
1023.2C33793793Q89206R4032K376442Q72497J314431K1515J688575J517487J238251
1031.9C43806229K151794n798K279281R14955Q70743P80068j62506l1929j87378J084366
1041.6C51499825m61541J277123L21197j05400P82051J044884J516800j096420Q19511
1050.2C55598030Q73070J898918J631889J197930L189544K800675L555946J564102
1058C72310104L529358L478890L183975M538689K824249L799171L430939M257584L046112
1066.6D04399071K789192J593132j150169j865273m266281l473816n970726o007500
1074.4C86047630m168281l461838j236954j784706R270r31244Q28171J301460K1286
$$ plain form
1083 376624794 377812996 379430504 381912193 382473145 385697479 389239998 391895180 394339027 395661392
1091.7 395661392 398515205 401145096 404075127 404882278 406957741 409391174 410631218 412587585
1099.4 412587585 413161507 414448242 414481239 415829277 415634918 414056664 415053482 415355949 416292267
1108.1 416292267 417176628 420379448 422385025 423673096 426358490 427771530 430085411 431687927
1115.8 431687927 434475174 436297264 437762413 440027466 440952034 441933784 442172813 443881569 445418053
1124.5 445418053 446870041 447781029 448576660 450668335 452219772 455382614 457730103 459759064 461885529
1133.2 461885529 464110832 466462212 466738396 466379776 465092087 463850021 461583366 459281807 457024994
1141.9 457024994 453843956 451029625 447054672 444542160 441564331 438573723 435940475 433017197
$$ packed form
1083C76624794J188202J617508K481689N60952L224334L542519K655182K443847J322365
1091.7C95661392K853813K629891K930031Q07151K075463K433433J240044J956367
1099.4D12587585N73922J286735L2997J348038j94359j578254R96818L02467R36318
1108.1D16292267Q84361L202820K005577J288071K685394J413040K313881J602516
1115.8D31687927K787247J822090J465149K265053R24568R81750K39029J708756J536484
1124.5D45418053J451988R10988P95631K091675J551437L162842K347489K028961K126465
1133.2D61885529K225303K351380K76184l58620j287689j242066k266655k301559k256813
1141.9D57024994l181038k814331l974953k512512k977829k990608k633248k923278
$$ plain form
1149.6 433017197 431530647 428911133 427126503 425378532 424634361 423723068 422387772 422627258 422826729
1158.3 422826729 424020081 424313278 425683670 426634064 428003311 430553207 432138557 435874786 439446220
1166.9 439446220 443470764 447513466 451860962 457028542 462227898 467796783 472300797 477919006
1174.6 477919006 483642540 489081039 494338531 499541702 505038490 509862442 515026970 519849777
1182.4 519849777 524829292 529878159 534570274 538673630 541950302 545403786 548569908 551360435
1190.1 551360435 553800278 555588417 557132912 558587799 559631500 560757637 561444397 561345940 561678352
1198.8 561678352 561909866 562190857 562329445 562523460 563776360 564349670 564758072 565947952 567133789
1207.4 567133789 568037796 568986435 570303879 571326561 572011833 572816162 574182167 575736694 577258148
$$ packed form
1149.6D33017197j486550k619514j784630j747971p44171r11293j335296K39486J99471
1158.3D22826729J193352K93197J370392R50394J369247K549896J585350L736229L571434
1166.9D39446220M024544M042702M347496N167580N199356N568885M504014N618209
1174.6D77919006N723534N438499N257492N203171N496788M823952N164528M822807
1182.4E19849777M979515N048867M692115M103356L276672L453484L166122K790527
1190.1E51360435K439843J788139J544495J454887J043701J126137O86760r8457L32412
1198.8E61678352K31514K80991J38588J94015J252900N73310M08402J189880J185837
1207.4E67133789R04007R48639J317444J022682O85272Q04329J366005J554527J521454
$$ plain form
1216.1 577258148 579060783 580987625 582534752 583221054 583476143 583568573 583644867 583598938 583194046 582794609
1225.8 582794609 582229309 581710854 581835213 581467819 580084305 579324150 579117088 578017616 576612549
1234.4 576612549 575710793 575275803 574662590 573679733 573473129 573610382 573081093 572478294 572644997 573023796
1244.1 573023796 572940865 572801552 572786522 572844925 573581047 574830399 575553207 576471176 577343979 577784233
1253.7 577784233 578427620 578845787 579272079 579633675 579867554 580211754 580383606 580733757 581492233 582189255
1263.4 582189255 582494850 582855911 583514900 584253883 584802017 585463524 586367950 587083893 587787323 588794441
1273 588794441 590112686 591217117 591725426 591748276 591910744 591917992 591780472 592044144 591751785 591406746
1282.7 591406746 591539574 591444206 591457787 591915359 592143631 591869087 591755753 591446114 590726242 590318146
$$ packed form
1216.1E77258148J802635J926842J547127O86302K55089R2430P6294m5929m04892l99437
1225.8E82794609n65300n18455J24359l67394j383514p60155k07062j099472j405067
1234.4E76612549r01756m34990o13213r82857k06604J37253n29289o02799J66703L78799
1244.1E73023796q2931j39313j5030N8403P36122J249352P22808R17969Q72803M40254
1253.7E77784233O43387M18167M26292L61596K33879L44200J71852L50151P58476O97022
1263.4E82189255L05595L61061O58989P38983N48134O61507R04426P15943P03430J007118
1273E88794441J318245J104431N08309K2850J62468P248j37520K63672k92359l45039
1282.7E91406746J32828r5368J3581M57572K28272k74544j13334l09639p19872m08096
$$ plain form
1292.3 590318146 590182953 589744148 589516220 589304047 588477707 588044930 587794724 587189369 586316986 585352859
1301.9 585352859 584612160 583955154 583379059 582465515 581313667 580616074 580316010 579602547 578819084
1310.6 578819084 578599739 577723770 576501694 575706520 574991150 574784164 574498482 574013252 573559952
1319.3 573559952 573293076 573518906 573322678 572456207 571106377 569701614 568466568 566968117 565244331
1328 565244331 563411484 562054176 560856552 559467735 558129005 556515312 555113335 553881683 552625809
1336.7 552625809 551273117 550370636 549906883 549429626 549659882 550184708 550793152 550827103 551269951 551832657
1346.3 551832657 551932220 551893158 551248512 550707855 550260086 550591354 551039886 551013565 550804024 550115738
1355.9 550115738 549723434 548707123 547642441 546953125 545978470 545339394 544860077 544014320 543776665
$$ packed form
1292.3E90318146j35193m38805k27928k12173q26340m32777k50206o05355q72383r64127
1301.9E85352859p40699o57006n76095r13544j151848o97593l00064p13463p83463
1310.6E78819084k19345q75969j222076p95174p15370k06986k85682m85230m53300
1319.3E73559952k66876K25830j96228q66471j349830j404763j235046j498451j723786
1328E65244331j832847j357308j197624j388817j338730j613693j401977j231652j255874
1336.7E52625809j352692r02481m63753m77257K30256N24826O08444L3951M42848N62706
1346.3E51832657R9563l9062o44646n40657m47769L31268M48532k6321k09541o88286
1355.9E50115738l92304j016311j064682o89316r74655o39076m79317q45757k37655
$$ plain form
1364.6 543776665 544254189 543778915 543516502 542753830 541084900 540779839 540378075 540832787 541321411
1373.3 541321411 541286087 541293755 542207375 544086037 544903946 545290184 545289879 545799751 546174126 546488686
1382.9 546488686 547666931 548738403 550648117 552327499 554400101 556471405 558380394 559991302
1390.7 559991302 560811043 561320267 561407089 560849075 559987831 561368294 562213097 562232246 561500740 561167145
1400.3 561167145 562013817 561409492 560776711 559899673 557769203 557079468 557330360 557224884 556095886
1409 556095886 555648880 555167427 554531555 553677940 552680016 551978378 550985336 550076637 548957367 549104500
1418.6 549104500 546522789 547058563 549289551 549482269 549436455 547849617 548762321 549560242 548745613
1427.3 548745613 549232559 549137840 549825249 550516930 551822739 552825317 553220062 554510727 555044212
$$ packed form
1364.6E43776665M77524m75274k62413p62672j668930l05061m01764M54712M88624
1373.3E41321411l5324P668R13620J878662Q17909L86238l05N09872L74375L14560
1382.9E46488686J178245J071472J909714J679382K072602K071304J908989J610908
1390.7E59991302Q19741N09224Q6822n58014q61244J380463Q44803J9149p31506l33595
1400.3E61167145Q46672o04325o32781q77038k130470o89735K50892j05476j128998
1409E56095886m47006m81453o35872q53615r97924p01638r93042r08699j119270J47133
1418.6E49104500k581711N35774K230988J92718m5814j586838R12704P97921q14629
1427.3E48745613M86946r4719O87409O91681J305809J002578L94745J290665N33485
$$ plain form
1436 555044212 553341064 552320366 554541588 555956726 557030830 558240547 558401566 559360313 559442635
1444.7 559442635 560381279 561084251 560313454 558730392 558776550 559389801 558594170 558495407 557495232 557627182
1454.3 557627182 557597923 556392250 553144722 549746323 553984146 554808884 556976814 557440948 558090630
1463 558090630 560205688 558670158 560889435 562876244 566288719 568404922 570907288 575315437 578930168
1471.7 578930168 583789940 584319420 589761963 593676949 597145767 601194649 605101700 609042091
1479.4 609042091 611585464 615136375 617574387 621164589 623663979 625629425 628206787 628535500
1487.1 628535500 631221924 633194809 633990669 634016418 638020287 642002335 643557739 645426331 645569534
1495.8 645569534 644538040 646767273 648040619 647407837 649485474 651683655 652043457 653688049 654917297
$$ packed form
1436E55044212j703148j020698K221222J415138J074104J209717J61019R58747Q2322
1444.7E59442635R38644P02972p70797j583062M6158O13251p95631r8763j000175J31950
1454.3E57627182k9259j205673l247528l398399M237823Q24738K167930M64134O49682
1463E58090630K115058j535530K219277J986809L412475K116203K502366M408149L614731
1471.7E78930168M859772N29480N442543L914986L468818M048882L907051L940391
1479.4F09042091K543373L550911K438012L590202K499390J965446K577362L28713
1487.1F28535500K686424J972885P95860K5749M003869L982048J555404J868592J43203
1495.8F45569534j031494K229233J273346o32782K077637K198181L59802J644592J229248
$$ plain form
1504.5 654917297 657012100 653608170 644614792 649546509 652568054 655286636 657004013 658485336
1512.2 658485336 658258362 660199432 661711502 661703491 661780853 658843994 663716049 667024002 665235367
1520.8 665235367 662861099 662954788 666839676 668230209 668189163 669246063 671077194 670784607 671413498
1529.5 671413498 673490067 673351135 674165192 672400665 669366455 672296600 674436111 676751404 678818817
1538.2 678818817 675457611 665926895 671565170 671496201 670912704 674362793 673984375 673553085 676130981
1546.9 676130981 678531570 679925842 678683624 676763535 678548737 680081558 680392685 676974182
1554.6 676974182 675788116 679181290 681041641 672621994 664578018 669994583 676904144 679184036
1562.3 679184036 679731903 679510574 676865845 675980453 676691742 677515030 676380081 670225677 672922745
$$ packed form
1504.5F54917297K094803l403930q993378M931717L021545K718582J717377J481323
1512.2F58485336k26974J941070J512070q011P7362k936859M872055L307953j788635
1520.8F65235367k374268R3689L884888J390533m1046J056900J831131k92587O28891
1529.5F71413498K076569j38932Q14057j764527l034210K930145K139511K315293K067413
1538.2F78818817l361206r530716N638275o8969n83497L450089l78418m31290K577896
1546.9F76130981K400589J394272j242218j920089J785202J532821L11127l418503
1554.6F76974182j186066L393174J860351q419647q043976N416565O909561K279892
1562.3F79184036N47867k21329k644729q85392P11289Q23288j134949o154404K697068
$$ plain form
1571 672922745 675196381 674742203 673809509 673271790 671489487 663304749 664576035 665860138 665561676
1579.7 665561676 665236588 664314423 663359985 661750107 660228729 657976990 655773621 653716431 651218796
1588.4 651218796 649943085 648150406 646903992 645331345 644214172 642920456 640143204 637821617
1596.1 637821617 635040703 632944260 630020294 627680740 625395927 623630600 622436562 620006981
1603.8 620006981 618642998 616397896 614349136 611130905 608861847 606342545 603206596 602757034
1611.5 602757034 600911598 599888763 597808685 597243195 596756516 588193855 589221077 588971024 588254089
1620.2 588254089 586269073 585951080 584800415 580484505 581348343 581589508 582406502 580092468 578502197
1628.9 578502197 578315926 577391396 576860657 575856667 576564445 576532402 571692047 570854836 573902435
$$ packed form
1571F72922745K273636m54178r32694n37719j782303q184738J271286J284103k98462
1579.7F65561676l25088r22165r54438j609878j521378k251739k203369k057190k497635
1588.4F51218796j275711j792679j246414j572647j117173j293716k777252k321587
1596.1F37821617k780914k096443k923966k339554k284813j765327j194038k429581
1603.8F20006981j363983k245102k048760l218231k269058k519302l135949m49562
1611.5F02757034j845436j022835k080078n65490m86679q562661J027222k50053p16935
1620.2E88254089j985016l17993j150665m315910Q63838K41165Q16994k314034j590271
1628.9E78502197j86271r24530n30739j003990P07778l2043m840355q37211L047599
$$ plain form
1637.5 573902435 575272102 576421242 577451324 576628952 577748451 577790413 579214668 580916405 579798470
1646.2 579798470 580884781 580302277 583430176 585548935 588040848 590390396 583896751 579538498
1653.9 579538498 586283150 591942787 595401573 598205490 600165291 602526398 604287643 606304474
1661.6 606304474 608002472 607580147 610735970 613557663 615960388 618456535 620945740 620855255 621923637
1670.3 621923637 625653954 627598114 630486298 633358116 633913422 634469681 638300705 641713791 643817215
1679 643817215 645619125 646740341 650187912 654044952 654323425 647191467 651977463 657962875 661202087
1687.7 661202087 662434921 664285812 666136780 668312683 670123596 671435852 674116058 675610504
1695.4 675610504 670356216 673241959 676911774 681130142 682070312 674659958 678854675 682102585
$$ packed form
1637.5E73902435J369667J149140J030082q22372J119499M1962J424255J701737j117935
1646.2E79798470J086311n82504L127899K118759K491913K349548o493645m358253
1653.9E79538498O744652N659637L458786K803917J959801K361107J761245K016831
1661.6F06304474J697998m22325L155823K821693K402725K496147K489205r0485J068382
1670.3F21923637L730317J944160K888184K871818N55306N56259L831024L413086K103424
1679F43817215J801910J121216L447571L857040K78473p131958M785996N985412L239212
1687.7F61202087J232834J850891J850968K175903J810913J312256K680206J494446
1695.4F75610504n254288K885743L669815M218368R40170p410354M194717L247910
$$ plain form
1703.1 682102585 682865524 681840057 681822510 680626526 681944199 684199753 684510117 684108505 684998474
1711.8 684998474 686284637 686920471 685006027 683064575 685598907 685211487 678466568 683156586 686526260
1720.5 686526260 688041992 688966827 689335556 689225616 689494019 689706116 689499588 689943466 690654449
1729.1 690654449 688945541 688229828 690964813 693279495 689447861 684440842 688594513 691765671
1736.9 691765671 692658463 694159775 693287582 691234512 694517899 696388245 695832672 697212677 700347595
1745.5 700347595 702346725 702504730 702842484 703231812 706520004 707852783 708524475 712864914 715928955
1754.2 715928955 718540192 721006546 721456909 722815475 724601669 726288605 728036728 726270370
1761.9 726270370 727442017 731740036 733915634 735273666 737203522 738391953 736626434 737879639
$$ packed form
1703.1F82102585P62939j025467j7547j195984J317673K255554L10364m01612Q89969
1711.8F84998474J286163O35834j914444j941452K534332l87420o744919M690018L369674
1720.5F86526260J515732R24835L68729j09940K68403K12097k06528M43878P10983
1729.1F90654449j708908p15713K734985K314682l831634n007019M153671L171158
1736.9F91765671Q92792J501312q72193k053070L283387J870346n55573J380005L134918
1745.5G00347595J999130J58005L37754L89328L288192J332779O71692M340439L064041
1754.2G15928955K611237K466354M50363J358566J786194J686936J748123j766358
1761.9G26270370J171647M298019K175598J358032J929856J188431j765519J253205
$$ plain form
1769.7 737879639 740468063 739611893 737175446 737063675 741237411 743523178 743213196 745675659 746963425
1778.3 746963425 747795563 747578049 746065598 746701813 747743530 748827057 748525543 749101791 750977173
1787 750977173 752536316 753741455 754734116 754408569 753072968 750167236 750201874 753577042 754319153
1795.7 754319153 753767395 755784683 758275909 758985519 757558212 758556137 758364258 758137436 759009781
1804.4 759009781 758902969 759296112 759920654 760786591 762200317 763441086 762410431 762488708 763556290
1813 763556290 763393860 763337936 762852097 763272324 763476181 764171143 765466919 765743637 766438599 766151047
1822.7 766151047 766852036 767527008 764568481 764404068 766054687 767304840 766222610 763857346 766367340
1831.4 766367340 768828354 769108124 769105072 769019775 768779068 767833710 766786880 767649994 768306961 769397736
$$ packed form
1769.7G37879639K588424q56170k436447j11771M173736K285767l09982K462463J287766
1778.3G46963425Q32138k17514j512451O36215J041717J083527l01514N76248J875382
1787G50977173J559143J205139R92661l25547j335601k905732L4638L375168P42111
1795.7G54319153n51758K017288K491226P09610j427307R97925j91879k26822Q72345
1804.4G59009781j06812L93143O24542Q65937J413726J240769j030655P8277J067582
1813G63556290j62430n5924m85839M20227K03857O94962J295776K76718O94962k87552
1822.7G66151047P00989O74972k958527j64413J650619J250153j082230k365264K509994
1831.4G66367340K461014K79770l052q5297k40707r45358j046830Q63114O56967J090775
$$ plain form
1841 769397736 770164719 771158447 771158981 765846100 767551117 769256897 768500595 768124008 768891602 769746628
1850.7 769746628 769714737 770531845 771032181 771487732 771612320 771357956 771264267 770274200 770000305 769918213
1860.3 769918213 770288086 770595322 771117401 771901321 772052383 772181778 771061401 770775528 769336624
1869 769336624 767754669 769233856 770639572 771646500 771974564 772449341 772567368 772622604 772740784
1877.7 772740784 772749634 772550888 771743011 772050095 772364120 772858810 773066864 773076477 773812027 773739471
1887.3 773739471 774224777 773749008 771745987 772129517 773138046 773275223 773477325 773521500 772898483
1896 772898483 773616562 774188004 774415131 774456863 774058533 773732529 773262100 773565826 773553467 773912430
1905.6 773912430 774729080 775020523 775251389 775044327 774117355 773420792 774085159 773851852 773560867 773771744
$$ packed form
1841G69397736P66983R93728N34n312881J705017J705780p56302l76587P67594Q55026
1850.7G69746628l1891Q17108N00336M55551J24588k54364r3689r90067k73895q2092
1860.3G69918213L69873L07236N22079P83920J51062J29395j120377k85873j438904
1869G69336624j581955J479187J405716J006928L28064M74777J18027N5236J18180
1877.7G72740784Q850j98746q07877L07084L14025M94690K08054R613P35550p2556
1887.3G73739471M85306m75769k003021L83530J008529J37177K02102M4175o23017
1896G72898483P18079N71442K27127M1732l98330l26004m70429L03726j2359L58963
1905.6G73912430Q16650K91443K30866k07062r26972o96563O64367k33307k90985K10877
$$ plain form
1915.3 773771744 774155197 775593491 774154205 773115616 773855591 774091110 774240112 772714157 772189484
1923.9 772189484 773191986 773825684 774308090 774986801 775014267 775213623 775431061 774796448 774481049 773545685
1933.6 773545685 773322754 773841858 774153366 774321747 774117813 774614868 774639664 775193329 774833374 772611389
1943.2 772611389 772858429 773199844 773276062 773571625 774321213 774904251 774766083 774967422 775185318 774878998
1952.9 774878998 774165573 773801117 773455811 773297958 773586578 774044189 774671249 774809494 774764175 774791794
1962.5 774791794 775056839 774789047 774123917 773811569 772986221 772633591 773306274 774215851 774837570 775388107
1972.2 775388107 775627975 775466843 775068207 774200211 773750610 773834991 774199219 774307404 774438629 774994431
1981.8 774994431 775307846 775598679 775524292 774996948 774335709 773967361 773389511 772899246 773635254 774075012
$$ packed form
1915.3G73771744L83453J438294j439286j038589P39975K35519J49002j525955n24673
1923.9G72189484J002502O33698M82406O78711K7466J99356K17438o34613l15399r35364
1933.6G73545685k22931N19104L11508J68381k03934M97055K4796N53665l59955k221985
1943.2G72611389K47040L41415P6218K95563P49588N83038j38168K01339K17896l06320
1952.9G74878998p13425l64456l45306j57853K88620M57611O27060J38245m5319K7619
1962.5G74791794K65045k67792o65130l12348q25348l52630O72683R09577O21719N50537
1972.2G75388107K39868j61132l98636q67996m49601Q4381L64228J08185J31225N55802
1981.8G74994431L13415K90833p4387n27344o61239l68348n77850m90265P36008M39758
$$ plain form
1991.5 774075012 773787384 774483490 775626526 775326691 774545364 774256592 773721390 773665848 773539200 773443756
2001.1 773443756 773445969 773591614 774283218 774623413 774677734 774416733 774070129 773494797 772979736 772797012
2010.7 772797012 772520142 772492752 772550659 772965088 773426514 773485413 773317108 773145981 772552795 771688919
2020.4 771688919 771351852 771006012 770819244 770888214 771608429 772279205 772270813 772487106 772004013 771200562
2030 771200562 770462112 769989319 769779510 769475708 769696579 769975586 770118179 770024185 770124283 770183487
2039.7 770183487 769968643 769356995 768819275 769184494 768654175 768439102 768787766 768706360 769065475 769120865
2049.3 769120865 769051132 768807755 768884048 768825073 768400650 768223038 767835083 767959900 768043594 768385239
2059 768385239 768789215 768673172 768738403 768759460 768811340 768316040 767918625 768235092 768378525 768147278
$$ packed form
1991.5G74075012k87628O96106J143036k99835p81327k88772n35202n5542j26648r5444
2001.1G73443756K213J45645O91604L40195N4321k61001l46604n75332n15061j82724
2010.7G72797012k76870k7390N7907M14429M61426N8899j68305j71127n93186q63876
2020.4G71688919l37067l45840j86768O8970P20215O70776q392K16293m83093q03451
2030G71200562p38450m72793k09809l03802K20871K79007J42593r3994J00098N9204
2039.7G70183487k14844o11648n37720L65219n30319k15073L48664q1406L59115N5390
2049.3G69120865o9733k43377P6293n8975m24423j77612l87955J24817Q3694L41645
2059G68385239M03976j16043O5231K1057N1880m95300l97415L16467J43433k31247
$$ plain form
2068.6 768147278 768311462 768655167 768444366 768506317 768554306 768617706 768441315 767985992 768242416 768492737
2078.2 768492737 768276062 768162537 768649979 768772507 768717651 768911057 768712692 768593521 768420105 768295975
2087.9 768295975 768409348 768653259 768553467 768416672 768592072 768753662 768875809 768581467 768949738 769115372
2097.5 769115372 768659668 768768311 768845978 769239044 769446640 769142609 768919525 769041290 769181519 769377823
2107.2 769377823 769498062 769135361 769218750 768917923 768892822 769434967 769223099 768840485 768586197 768868484
2116.8 768868484 769169006 769414673 769533615 769627304 769537964 769000854 769297867 769435196 769259949 768988113
2126.5 768988113 768795853 769119949 769124222 768887177 768643341 768989868 769199905 769355240 769183884 768678589
2136.1 768678589 769218445 769261398 768916931 768710632 768800964 769017792 769054337 769409561 769272156 769260559
$$ packed form
2068.6G68147278J64184L43705k10801O1951M7989O3400j76391m55323K56424K50321
2078.2G68492737k16675j13525M87442J22528n4856J93406j98365j19171j73416j24130
2087.9G68295975J13373K43911r9792j36795J75400J61590J22147k94342L68271J65634
2097.5G69115372m55704J08643P7667L93066K07596l04031k23084J21765J40229J96304
2107.2G69377823J20239l62701Q3389l00827k5101N42145k11868l82614k54288K82287
2116.8G68868484L00522K45667J18942R3689q9340n37110K97013J37329j75247k71836
2126.5G68988113j92260L24096M273k37045k43836L46527K10037J55335j71356n05295
2136.1G68678589N39856M2953l44467k06299R0332K16828L6545L55224j37405j1597
$$ plain form
2145.8 769260559 769188538 768950806 768761063 768523788 768728180 769129028 769702148 769655762 769545975 769490280
2155.4 769490280 769274673 769345398 769419708 769487152 769170685 769102402 768917007 769079132 769767761 769974976
2165 769974976 770156860 770083313 770290527 770350037 770374451 770368500 770036163 770411377 770650101 770978012 771383209
2175.6 771383209 771323242 771168365 771366196 771463242 771068649 771214981 771375961 771464844 771372910 771581116
2185.3 771581116 772297134 772587128 772905045 772808075 772682953 772479324 772250137 772369308 772331085 772477493
2194.9 772477493 772666397 773005142 773275528 773754044 773953247 773822632 773895493 773414307 773283081 773187180
2204.6 773187180 773296661 773934097 774350586 774566422 774412766 774462814 774501495 774632111 774655075 774559708
2214.2 774559708 774623489 774480133 774689331 774745407 774691086 774938431 775318909 775477066 775429077 775451050
$$ packed form
2145.8G69260559p2021k37732j89743k37275K04392M00848N73120m6386j09787n5695
2155.4G69490280k15607P0725P4310O7444l16467o8283j85395J62125O88629K07215
2165G69974976J81884p3547K07214N9510K4414n951l32337L75214K38724L27911M05197
2175.6G71383209n9967j54877J97831R7046l94593J46332J60980Q8883r1934K08206
2185.3G71581116P16018K89994L17917r6970j25122k03629k29187J19171l8223J46408
2194.9G72477493J88904L38745K70386M78516J99203j30615P2861m81186j31226r5901
2204.6G73187180J09481O37436M16489K15836j53656N0048L8681J30616K2964r5367
2214.2G74559708O3781j43356K09198N6076n4321K47345L80478J58157m7989K1973
$$ plain form
2223.9 775451050 775221024 775155487 775097275 775112000 775338516 775755157 776232681 776521683 776432037 775768814
2233.5 775768814 775709381 775841064 775862808 775608368 775163727 775473862 775597916 775758286 775951157 776143265
2243.2 776143265 776292801 776187515 776064682 775879974 776268234 776191711 775826263 775804596 776241531 776607742
2252.8 776607742 776213913 776513977 776734924 776484222 775988541 775672760 775783463 775818405 776340027 776360626
2262.4 776360626 776443100 776878128 776970291 776741486 776444855 776543121 776327515 776091232 776034088 776690140
2272.1 776690140 776893768 776273499 776473541 776940536 777202606 776764069 776891251 777005692 776591415 776558533
2281.7 776558533 776423569 776867523 776789398 777071381 777506866 777315445 777405319 776769943 776428909 776109009
2291.4 776109009 776200256 776466751 776506577 777018127 776747208 776568451 776389771 776457291 776548996 776189194
$$ packed form
2223.9G75451050k30026o5537n8212J4725K26516M16641M77524K89002q9646o63223
2233.5G75768814n9433J31683K1744k54440m44641L10135J24054J60370J92871J92108
2243.2G76143265J49536j05286j22833j84708L88260p6523l65448k1667M36935L66211
2252.8G76607742l93829L00064K20947k50702m95681l15781J10703L4942N21622K0599
2262.4G76360626Q2474M35028R2163k28805k96631R8266k15606k36283n7144O56052
2272.1G76690140K03628o20269K00042M66995K62070m38537J27182J14441m14277l2882
2281.7G76558533j34964M43954p8125K81983M35485j91421Q9874o35376l41034l19900
2291.4G76109009R1247K66495L9826N11550k70919j78757j78680O7520R1705l59802
$$ plain form
2301 776189194 776083069 775850372 776121674 776381149 776614914 776496277 776439209 776307220 775588074 775873947
2310.7 775873947 775402679 774883804 774849319 774690857 775377808 776024017 776328812 776010513 776074142 775594482
2320.3 775594482 774748306 775237350 774909210 774231949 774352036 774594040 774136734 773905640 774189606 773912277
2329.9 773912277 773673325 774038849 774083023 772674255 772181396 773076477 773298492 772976685 773358383 774006424
2339.6 774006424 773813782 773869705 773899994 773284378 772540970 771436539 770258408 770269241 771446991 773042679
2349.2 773042679 774121094 773735046 773568802 773229065 773042526 772092972 770704498 771733551 770391617
2357.9 770391617 770327530 772110748 771532974 770857544 770550842 770955887 769970932 769209137 769468155 771025467
2367.6 771025467 771835861 770315628 769872360 770314407 770908508 770750961 770801239 770412598 769445419 769622498
$$ packed form
2301G76189194j06125k32697K71302K59475K33765j18637n7068j31989p19146K85873
2310.7G75873947m71268n18875l4485j58462O86951O46209L04795l18299O3629m79660
2320.3G75594482q46176M89044l28140o77261J20087K42004m57306k31094K83966k77329
2329.9G73912277k38952L65524M4174j408768m92859Q95081K22015l21807L81698O48041
2339.6G74006424j92642N5923L0289o15616p43408j104431j178131J0833J177750J595688
2349.2G73042679J078415l86048j66244l39737j86539r49554j388474J029053j341934
2357.9G70391617o4087J783218n77774o75430l06702M05045r84955p61795K59018J557312
2367.6G71025467Q10394j520233m43268M42047N94101j57547N0278l88641r67179J77079
$$ plain form
2377.2 769622498 769700775 769926758 770135956 770379181 770752258 770746918 770770645 770773697 770577011 770122299 770013199
2387.8 770013199 769781342 769593887 769820557 769649963 769415512 769589310 770186005 770182190 769874115 769568787
2397.4 769568787 769001160 768619003 768361282 768552475 768380966 768165817 768368301 768619614 768888321 768778534
2407.1 768778534 768335190 767314987 766987839 767307281 767440262 767315903 767134399 767645950 767498550
2415.8 767498550 766889114 766568909 766654358 766489868 765789490 765723724 765348740 764920197 764867554 765150375
2425.4 765150375 765219727 764687119 764543610 764521103 764697495 764270706 763551865 763094254 762898331 763036346
2435.1 763036346 762618027 762659149 762484207 762007751 762034683 761909027 761621170 761122589 760769730 760468292
2444.7 760468292 760608444 760574951 760384827 760421982 759974976 759596634 759009399 758842621 758540802 757915955
$$ packed form
2377.2G69622498P8277K25983K09198K43225L73077n340K3727L052j96686m54712j09100
2387.8G70013199k31857j87455K26670j70594k34451J73798N96695l815l08075l05328
2397.4G69568787n67627l82157k57721J91193j71509k15149K02484K51313K68707j09787
2407.1G68778534m43344j020203l27148L19442J32981j24359j81504N11551j47400
2415.8G67498550o09436l20205Q5449j64490p00378o5766l74984m28543n2643K82821
2425.4G65150375O9352n32608j43509k2507J76392m26789p18841m57611j95923J38015
2435.1G63036346m18319M1122j74942m76456K6932j25656k87857m98581l52859l01438
2444.7G60468292J40152l3493j90124L7155m47006l78342n87235j66778l01819o24847
$$ plain form
2454.3 757915955 757996140 757824402 757743454 757811203 757823792 757605362 757251434 757044525 756737823 756610413
2464 756610413 756395493 756099548 755798187 755850830 755976868 755860062 755795441 755560913 755130997 754556274
2473.6 754556274 754517441 754398956 754202957 754230499 753792953 753716202 754070206 754041519 753202057 752827377
2483.3 752827377 752839737 752393875 752170334 751593781 751266556 751762619 752412033 752287750 751719055 751416931
2492.9 751416931 750915451 750707397 750473328 750270309 750129318 749937592 750080338 750402222 750491562 749679642
2502.6 749679642 749346466 749231033 748805618 748765869 748625183 748759003 748733063 748756104 748907318 748751907
2512.2 748751907 748534470 748213806 748090515 748016968 747930832 747414398 746902390 747005920 747297287 747341080
2521.9 747341080 747037506 746781158 746266251 745885086 745573273 745333481 745294571 744811172 744399948 744325027
$$ packed form
2454.3G57915955Q0185j71738q0948O7749J2589k18430l53928k06909l06702j27410
2464G56610413k14920k95945l01361N2643J26038j16806o4621k34528m29916n74723
2473.6G54556274l8833j18485j95999K7542m37546p6751L54004k8687q39462l74680
2483.3G52827377J2360m45862k23541n76553l27225M96063O49414j24283n68695l02124
2492.9G51416931n01480k08054k34069k03019j40991j91726J42746L21884Q9340q11920
2502.6G49679642l33176j15433m25415l9749j40686J33820k5940K3041J51214j55411
2512.2G48751907k17437l20664j23291p3547q6136n16434n12008J03530K91367M3793
2521.9G47341080l03574k56348n14907l81165l11813k39792l8910m83399m11224p4921
$$ plain form
2531.5 744325027 744607849 744660721 744714737 744783554 744457397 744165268 743304749 742734375 742369919 742087936
2541.1 742087936 742628784 742907410 742719955 742470093 742541046 742318420 741798248 741475677 740860825 740423203
2550.8 740423203 740218582 740175400 740356064 740284042 739898300 739829254 739885635 739326630 738672943 738597641
2560.4 738597641 738632584 738194656 738168030 738296280 737970047 737760544 737470779 737196579 736732788 735968628
2570.1 735968628 735348206 735238342 735364532 735319366 735371170 735271912 735115128 734940491 734883041 734757843
2579.7 734757843 734227524 733861694 733719940 733347092 732685013 732741470 732927780 732758713 732659149 732335434
2589.4 732335434 732497559 732477722 731764374 731015167 730891418 731039886 730893936 731059799 730714417 730341873
2599 730341873 730453491 730587616 730614777 729972687 729338531 729112015 729079132 728730545 728791275 729105759
$$ packed form
2531.5G44325027K82822N2872N4016O8817l26157k92129q60519n70374l64456k81983
2541.1G42087936N40848K78626j87455k49862P0953k22626n20172l22571o14852m37622
2550.8G40423203k04621m3182J80664p2022l85742o9046N6381n59005o53687p5302
2560.4G38597641L4943m37928k6626J28250l26233k09503k89765k74200m63791p64160
2570.1G35968628o20422j09864J26190m5166N1804r9258j56784j74637n7450j25198
2579.7G34757843n30319l65830j41754l72848o62079N6457J86310j69067r9564l23715
2589.4G32335434J62125j9837p13348p49207j23749J48468j45950J65863l45382l72544
2599G30341873J11618J34125K7161o42090o34156k26516l2883l48587O0730L14484
$$ plain form
2608.6 729105759 728663788 728357086 727798386 727331543 727350082 727160950 726667099 725941010 725389481 725256348
2618.3 725256348 725469666 725358200 725144424 724684372 723970795 723605957 723326645 723043442 722546158 722547226
2627.9 722547226 722509384 722003555 721736603 721539764 721360245 720682755 720143509 719645081 719128952 718762894
2637.6 718762894 718042603 717961349 717925568 717533112 717094421 716726456 716565475 716108551 715429993 714555588
2647.2 714555588 714204407 714127808 713738251 713547592 713343811 712599792 711777115 711653519 711324463 710715256
2656.9 710715256 710341492 709889832 709282761 708814926 709087982 709360657 709053879 708718567 708676224 708157578
2666.5 708157578 707130280 706579742 706140213 705560150 705151291 705460052 705853958 705666656 705296860
2675.2 705296860 704896393 704890823 704542542 703777771 703003616 702444534 702435684 702171783 701763535 701597214
$$ packed form
2608.6G29105759m41971l06702n58700m66843J8539j89132m93851p26089n51529j33133
2618.3G25256348K13318j11466k13776m60052p13577l64838k79312k83203m97284J068
2627.9G22547226l7842n05829k66952j96839j79519o77490n39246m98428n16129l66058
2637.6G18762894p20291q1254l5781l92456m38691l67965j60981m56924o78558q74405
2647.2G14555588l51181p6599l89557j90659k03781p44019q22677j23596l29056o09207
2656.9G10715256l73764m51660o07071m67835K73056K72675l06778l35312m2343n18646
2666.5G08157578j027298n50538m39529n80063m08859L08761L93906j87302l69796
2675.2G05296860m00467n570l48281p64771p74155n59082q850k63901m08248j66321
$$ plain form
2684.8 701597214 701762924 701693039 701214676 700779343 700091171 699579239 699367676 699136581 698677444 698518219
2694.5 698518219 698792419 698591919 697939377 697065430 696424789 696214905 696139984 695749283 695198517 695009003
2704.1 695009003 694961548 694976654 694540787 693799667 693415298 693163376 692653885 691998749 691531754 691230392
2713.8 691230392 691222305 691123276 690989609 690963058 690596924 690141983 689615250 688881531 688279266 688121338
2723.4 688121338 688014221 688031540 688064423 687621613 687013016 686433487 686341171 686317520 685890884 685303345
2733 685303345 685000916 684988022 684705887 684530945 684257355 684279633 684139252 683573914 683582153 683183441 682882996
2743.7 682882996 682667923 682416382 682572098 682022095 681659088 681916504 681851807 681255264 680698624 680377960
2753.3 680377960 679972076 679444809 678813248 678835983 678972778 678679581 678733063 678699341 678283615 678256683
$$ packed form
2684.8G01597214J65710o9885m78363m35333o88172n11932k11563k31095m59137j59225
2694.5F98518219K74200k00500o52542q73947o40641k09884p4921l90701n50766j89514
2704.1F95009003m7455J5106m35867p41120l84369k51922n09491o55136m66995l01362
2713.8F91230392q087r9029j33667k6551l66134m54941n26733p33719o02265j57928
2723.4F88121338j07117J7319L2883m42810o08597n79529r2316k3651m26636n87539
2733F85303345l02429j2894k82135j74942k73590K2278j40381n65338Q239l98712l00445
2743.7F82882996k15073k51541J55716n50003l63007K57416o4697n96543n56640l20664
2753.3F80377960m05884n27267o31561K2735J36795k93197N3482l3722m15726k6932
$$ plain form
2762.9 678256683 677984467 677103195 677078629 677368393 677168808 676760635 676412582 676517258 676453171 676183853
2772.6 676183853 676010742 675704956 675025177 674407654 673735504 672979965 672980270 673047714 672913818 672475739
2782.2 672475739 672325211 672443619 671639328 670818634 670249100 670404587 670631256 669867401 669141312 668564606
2791.9 668564606 668137131 667461624 666713181 666464157 666626434 666435318 665315323 664394989 663818588
2800.5 663818588 663447495 663017578 662335129 661758194 661122894 660679855 659984436 659151077 658509216 657475052
2810.2 657475052 656623383 656148529 655262375 654627609 654313812 653219757 652235870 651630020 650717850
2818.9 650717850 649660950 648737793 648113022 647352371 646746368 646331177 645623856 644338379 642654266
2827.6 642654266 641737518 641143951 639949188 638888283 637952461 636615562 635843658 635004120 633058929
$$ packed form
2762.9F78256683k72216q81272k4566K89764j99585m08173l48053J04676o4087k69318
2772.6F76183853j73111l05786o79779o17523o72150p55539L05O7444j33896m38079
2782.2F72475739j50528J18408q04291q20694n69534J55487K26669p63855p26089n76706
2791.9F68564606m27475o75507p48443k49024J62277j91116j119995r20334n76401
2800.5F63818588l71093m29917o82449n76935o35300m43039o95419q33359o41861j034164
2810.2F57475052q51669m74854q86154o34766l13797j094055r83887o05850r12170
2818.9F50717850j056900r23157o24771p60651o06003m15191p07321j285477j684113
2827.6F42654266r16748n93567j194763j060905r35822j336899p71904q39538j945191
$$ plain form
2836.2 633058929 631460075 630473137 629476624 627794991 625402336 623364296 621692162 619975014 617761078
2844.9 617761078 615148697 612618179 610107040 607396011 604717026 602553215 600931358 599526634
2852.6 599526634 598458176 598236008 597929764 597305374 597156715 597020531 596622086 596468010 596753540
2861.3 596753540 596232529 595475349 595175362 594138756 592834320 591431313 590008850 588466873 586882782
2870 586882782 585859146 584587021 582907104 581159554 579472466 577755241 576374435 575113602 573277512
2878.7 573277512 571465721 569678612 568255386 567143860 566020851 565308838 564460106 563279228 562117081
2887.3 562117081 561287727 560610008 560085182 559834175 559212608 558285408 557826691 557783890 557290649 556561546
2897 556561546 555836525 555266838 555069313 554596405 553835182 552890396 551966171 551084595 550351906 549690590
$$ packed form
2836.2F33058929j598854r86938r96513j681633k392655k038040j672134j717148k213936
2844.9F17761078k612381k530518k511139k711029k678985k163811j621857j404724
2852.6E99526634j068458k22168l06244o24390j48659j36184l98445j54076K85530
2861.3E96753540n21011p57180k99987j036606j304436j403007j422463j541977j584091
2870E86882782j023636j272125j679917j747550j687088j717225j380806j260833j836090
2878.7E73277512j811791j787109j423226j111526j123009p12013q48732j180878j162147
2887.3E62117081q29354o77719n24826k51007o21567r27200m58717m2801m93241p29103
2897E56561546p25021n69687j97525m72908p61223r44786r24225q81576p32689o61316
$$ plain form
2906.6 549690590 548631287 547801857 546833839 545257072 543713951 542137794 539705772 536675072 534227943
2915.3 534227943 532100449 529791298 527504349 525269966 523129768 521662979 520693321 519758339 519351196
2924 519351196 518878441 518286896 517938309 517723389 517853546 518042603 518307304 518806801 519886131 521253967
2933.6 521253967 522656898 524222717 525685616 527090569 528586273 530829659 533448982 535816727
2941.3 535816727 538273544 541103706 543266182 544797668 547464905 549717331 551275482 553467560
2949.1 553467560 555843086 558075142 559935989 561786156 563264427 564946480 566576958 567955666
2956.8 567955666 570051422 572074242 574131775 575749168 577616386 580094795 582094498 584168777
2964.5 584168777 585573578 586901627 588911133 590497627 591871147 593762894 595672798 596756134
$$ packed form
2906.6E49690590j059303q29430r68018j576767j543121j576157k432022l030700k447129
2915.3E34227943k127494k309151k286949k234383k140198j466789r69658r34982m07143
2924E19351196m72755n91545l48587k14920J30157J89057K64701M99497J079330J367836
2933.6E21253967J402931J565819J462899J404953J495704K243386K619323K367745
2941.3E35816727K456817K830162K162476J531486K667237K252426J558151K192078
2949.1E53467560K375526K232056J860847J850167J478271J682053J630478J378708
2956.8E67955666K095756K022820K057533J617393J867218K478409J999703K074279
2964.5E84168777J404801J328049K009506J586494J373520J891747J909904J083336
$$ plain form
2972.2 596756134 597974014 599985275 601473389 602632294 604672241 606468124 607605057 608700180
2979.9 608700180 609594345 610500908 611551819 612888718 613972244 614866524 615807266 616832237 618014755
2988.6 618014755 618631020 619011383 619306641 620069427 620708771 620631523 621260910 621964569 622513275 622721214
2998.2 622721214 622504158 622565460 622314491 622108116 622279129 622313881 622145576 622094803 622013359 622117424
3007.9 622117424 622397995 621949577 621409607 621057205 620648308 620551910 620115051 619423027 619185219 618972855
3017.5 618972855 618542175 617771492 617091522 616812897 615910759 615084457 614730911 614166985 613498726 612818260
3027.2 612818260 612359390 611487808 610729866 610222816 609123268 608079681 607265358 606693459 606176109
3035.9 606176109 605483856 604248657 603216667 602619438 601689720 601241608 600237808 598703766 597844887
$$ packed form
2972.2E96756134J217880K011261J488114J158905K039947J795883J136933J095123
2979.9F08700180Q94165R06563J050911J336899J083526Q94280R40742J024971J182518
2988.6F18014755O16265L80363K95258P62786O39344p7248O29387P03659N48706K07939
2998.2F22721214k17056O1302k50969k06375J71013L4752j68305n0773q1444J04065
3007.9F22117424K80571m48418n39970l52402m08897r6398m36859o92024k37808k12364
3017.5F18972855m30680p70683o79970k78625r02138q26302l53546n63926o68259o80466
3027.2F12818260m58870q71582p57942n07050j099548j043587q14323n71899n17350
3035.9F06176109o92253j235199j031990n97229r29718m48112j003800j534042q58879
$$ plain form
3044.5 597844887 597017136 596091080 595079079 593979568 593084412 592728996 592063866 590892448 589552040
3053.2 589552040 588089333 587258797 586632195 585529442 584147720 583309174 582477608 581406631 580572701
3061.9 580572701 579709702 579143562 578096581 577204208 576242027 574880257 574142914 572814217 571633415
3070.6 571633415 570861549 570338783 569797020 568250923 567007866 566348953 565705299 564606133 563317680
3079.2 563317680 562209663 561312332 560579491 559484634 558237991 557279472 556836472 555484428 553996048
3087.9 553996048 553401031 552547340 551813431 550631638 549367867 548366966 547460518 546610184 545454750
3096.6 545454750 544654083 543708305 542752266 541555328 540559616 540099869 539268303 538517609 537498589
3105.3 537498589 536299858 534681740 533411751 532695541 531577911 530783195 529610023 528593941 527989044
$$ packed form
3044.5E97844887q27751r26056j012001j099511q95156l55416o65130j171418j340408
3053.2E89552040j462707q30536o26602j102753j381722q38546q31566j070977q33930
3061.9E80572701q62999n66140j046981q92373r62181j361770p37343j328697j180802
3070.6E71633415p71866n22766n41763j546097j243057o58913o43654j099166j288453
3079.2E63317680j108017q97331p32841j094857j246643r58519m43000j352044j488380
3087.9E53996048n95017q53691p33909j181793j263771j000901r06448q50334j155434
3096.6E45454750q00667r45778r56039j196938r95712m59747q31566p50694j019020
3105.3E37498589j198731j618118j269989p16210j117630p94716j173172j016082o04897
$$ plain form
3114 527989044 527215919 526292076 524910011 523846169 522967415 522122726 521306839 520325470 518854370
3122.6 518854370 518022804 517929344 516493721 515265541 514582367 513270607 512304153 511419601 510309334
3131.3 510309334 509566460 508838577 507605133 506703300 505768280 504885941 504401970 503441391 502576294
3140 502576294 501720734 500473022 499039993 497820892 497122574 496556168 495834198 494808731 493823814
3148.7 493823814 492822571 491807365 490995369 490323296 489379768 488177605 487202988 486135941 485343742
3157.4 485343742 484646950 483938255 483021545 481449127 480407944 479592552 478759804 478070831 477113152
3166 477113152 476242142 475560303 474966316 474050293 473140564 472540169 471535263 470108109 469156418 468342476
3175.7 468342476 467296371 466895943 466382294 465464325 464922409 464459190 463660927 462740440 462025681
$$ packed form
3114E27989044p73125r23843j382065j063842q78754q44689q15887r81369j471100
3122.6E18854370q31566r3460j435623j228180o83174j311760r66454q84552j110267
3131.3E10309334p42874p27883j233444r01833r35020q82339m83971r60579q65097
3140E02576294q55560j247712j433029j219101o98318n66406p21970j025467r84917
3148.7D93823814j001243j015206q11996o72073r43528j202163r74617j067047p92199
3157.4D85343742o96792p08695r16710j572418j041183q15392q32748o88973r57679
3166D77113152q71010o81839n93987r16023r09729o00395j004906j427154r51691q13942
3175.7D68342476j046105m00428n13649r17969n41916m63219p98263r20487p14759
$$ plain form
3184.4 462025681 461018524 459575195 458244247 457766151 457554817 456926994 456198044 455137291 454132576
3193 454132576 453478966 453040886 452000198 450677071 449825096 448778534 448226013 447843819 447392197
3201.7 447392197 447004890 445985489 445266800 445094452 444456978 443254738 442358246 441505508 440493050
3210.4 440493050 439977112 439619751 439179382 438428726 437212143 436269379 435864944 434833488 433680611
3219.1 433680611 433342705 433206902 433287773 432752647 431777115 431184769 430674515 429734077 428699265 428390388
3228.7 428390388 427561302 426348915 425805588 425693283 425691948 425471268 424809494 423466606 422304497
3237.4 422304497 421586723 421071358 420253105 419526787 419533501 419387016 419315605 418486023 417502251 417408409
3247 417408409 416847725 415762138 414658966 414319344 414075584 413539848 413043175 412132149 411331177 410825539
$$ packed form
3184.4D62025681j007157j443329j330948m78096k11334o27823p28950j060753j004715
3193D54132576o53610m38080j040688j323127q51975j046562n52521l82194m51622
3201.7D47392197l87307j019401p18689j72348o37474j202240q96492q52738j012458
3210.4D40493050n15938l57361m40369p50656j216583r42764m04435j031456j152877
3219.1D33680611l37906j35803Q0871n35126r75532n92346n10254r40438j034812l08877
3228.7D28390388q29086j212387n43327j12305j335k20680o61774j342888j162109
3237.4D22304497p17774n15365q18253p26318O714j46485p1411q29582r83772r3842
3247D17408409n60684j085587j103172l39622k43760n35736m96673r11026q00972n05638
$$ plain form
3256.7 410825539 410682716 410650024 410096016 409211502 409001045 408656731 407763786 407452126 407043762 406465759
3266.3 406465759 406012115 405823631 405116768 403998871 403553810 403334961 403424759 402525444 401657600 401428070
3276 401428070 400831490 400809135 400149040 399454269 399354591 399494324 399650574 399012032 398292770 397538910
3285.6 397538910 396861725 396299744 396330032 396350174 395993195 395946274 395132446 394497070 394503784 394458618 393698692
3296.2 393698692 392561035 392198792 392170410 392410278 391791000 391054153 391102142 390646858 389885368 389229431
3305.9 389229431 389033127 388600998 387902489 387449379 387098389 386915207 386482735 386098824 385709000 385009232
3315.5 385009232 384066925 383370934 383013878 382483940 382057228 381786766 381583443 381390610 380878448 379912872
3325.2 379912872 379536972 379479408 378618050 377912216 377553596 377154160 376450005 375679321 375063934 374407158
$$ packed form
3256.7D10825539j42823l2692n54008q84514k10457l44314q92945l11660m08364n78003
3266.3D06465759m53644j88484p06863j117897m45061k18849Q9798q99315q67844k29530
3276D01428070n96580k2355o60095o94771r9678J39733J56250o38542p19262p53860
3285.6C97538910o77185n61981L0288K0142l56979m6921q13828o35376O714m5166p59926
3296.2C93698692j137657l62243k8382K39868o19278p36847M7989m55284p61490o55937
3305.9C89229431j96304m32129o98509m53110l50990j83182m32472l83911l89824o99768
3315.5C85009232r42307o95991l57056n29938m26712k70462k03323j92833n12162r65576
3325.2C79912872l75900n7564q61358p05834l58620l99436p04155p70684o15387o56776
$$ plain form
3334.8 374407158 374020615 373533325 373181114 372727127 371754417 370855789 370368385 370218353 370064888 369861794
3344.4 369861794 369422455 369010429 368394661 367727737 367569618 366978073 366039696 365362740 364841118 364308128
3354.1 364308128 363911285 363537788 363015823 362376823 361649323 361539688 361201439 360068283 359212608
3362.8 359212608 358811226 358479805 357874489 357133446 356785583 356532898 355657310 355120506 354802666 354132156
3372.4 354132156 353590202 352996216 352842216 352312851 351504478 351035805 350500374 350050507 349151192 348859863
3382.1 348859863 349057732 348980598 348492584 347444534 347207031 347154274 346677742 346205788 346082306 346190834
3391.7 346190834 345799522 344982834 344231682 344223900 344664574 344716682 344084206 343750954 343733635 343373756
3401.3 343373756 343164215 342636375 342049866 341463051 341075211 341265831 341450272 341524849 341029968 340595627
$$ packed form
3334.8C74407158l86543m87290l52211m53987r72710q98628m87404j50032j53465k03094
3344.4C69861794m39339m12026o15768o66924j58119n91545r38377o76956n21622n32990
3354.1C64308128l96843l73497n21965o39000p27500j09635l38249j133156q55675
3362.8C59212608m01382l31421o05316p41043l47863k52685q75588n36804l17840o70510
3372.4C54132156n41954n93986j54000n29365q08373m68673n35431m49867q99315k91329
3382.1C48859863J97869p7134m88014j048050k37503n2757m76532m71954j23482J08528
3391.7C46190834l91312q16688p51152p782M40674N2108o32476l33252j7319l59879
3401.3C43373756k09541n27840n86509n86815l87840J90620J84441P4577m94881m34341
$$ plain form
3411 340595627 340512161 340488968 340295372 340309982 340967484 340952988 340397568 339902573 339859123 339950676 339792442
3421.6 339792442 339742813 339663696 340163689 340340309 340110855 340026817 339606667 339519272 339639091 339708672
3431.2 339708672 339902306 339665947 339480591 340001945 339995155 340077972 340530777 340407066 340636826 341099129
3440.9 341099129 341571083 341194649 341260071 342288322 342726784 343361855 343009949 343276672 343989677 343581085
3450.5 343581085 343918190 344502335 345023346 345315704 345580330 345584030 345395050 346049995 346807823 347509613
3460.2 347509613 347615471 347768135 348268738 348836555 349874802 350654793 350864258 350856247 351234016 350932732
3469.8 350932732 351141815 352867393 354010811 354734726 355183754 354910316 354885445 355853386 356353607
3478.5 356353607 356779289 357887001 358304253 358556290 358768158 359696465 360487022 360572433 361078415 361435852
$$ packed form
3411C40595627q3466k3193j93596J4610O57502j4496n55420m94995m3450R1553j58234
3421.6C39792442m9629p9117M99993J76620k29454q4038m20150q7395J19819O9581
3431.2C39708672J93634k36359j85356N21354o790Q2817M52805j23711K29760M62303
3440.9C41099129M71954l76434O5422J028251M38462O35071l51906K66723P13005m08592
3450.5C43581085L37105N84145N21011K92358K64626L700j88980O54945P57828P01790
3460.2C47509613J05858J52664N00603N67817J038247P79991K09465q011L77769l01284
3469.8C50932732K09083J725578J143418P23915M49028k73438k4871R67941N00221
3478.5C56353607M25682J107712M17252K52037K11868R28307P90557Q5411N05982L57437
$$ plain form
3488.1 361435852 362269707 363202515 363575172 363643913 364481277 365542641 366218834 367388496 367786674
3496.8 367786674 368199692 368919449 369372444 369856949 370734215 371333618 370283928 370986252 372894478
3505.5 372894478 373683853 374256172 375328903 376012535 376328773 377530060 377885017 378406944 379297066
3514.2 379297066 380027657 381212006 381687393 382237930 382702293 383408623 384640274 385911980 386282883
3522.9 386282883 385344620 386242065 387859344 388747444 389212990 389527283 389915161 391297569 392586327
3531.5 392586327 393159294 394459038 395360374 397357635 398294601 397601852 398721733 399393311 400534172
3540.2 400534172 401163406 402168388 403708954 404658546 405729904 404990273 405634995 406291618 407810326
3548.9 407810326 409799767 411355591 413194923 412298737 413967438 415706749 416000824 416861229 417489433
$$ packed form
3488.1C61435852Q33855R32808L72657O8741Q37364J061364O76193J169662L98178
3496.8C67786674M13018P19757M52995M84505Q77266N99403j049690P02324J908226
3505.5C72894478P89375N72319J072731O83632L16238J201287L54957N21927Q90122
3514.2C79297066P30591J184349M75387N50537M64363P06330J231651J271706L70903
3522.9C86282883r38263Q97445J617279Q88100M65546L14293L87878J382408J288758
3531.5C92586327N72967J299744R01336J997261R36966o92749J119881O71578J140861
3540.2D00534172O29234J004982J540566R49592J071358p39631O44722O56623J518708
3548.9D07810326J989441J555824J839332q96186J668701J739311K94075Q60405O28204
$$ plain form
3557.6 417489433 419493828 420638428 421638794 422505684 424588165 425748940 425794220 429765930 430125618
3566.2 430125618 430136642 430794716 430376472 433290367 434758453 436971741 439176407 441018410 442320557
3574.9 442320557 443485718 445395355 445573235 447728958 449453125 450398941 452447243 453925400 455286026
3583.6 455286026 456435966 460660400 462665787 460770187 461631699 461180611 464833145 468231506 471005249
3592.3 471005249 472566757 473291321 476705933 476016808 478235626 481530495 481960373 485052490 485994644
3601 485994644 487357292 490161781 491692162 493674049 496563797 498744316 497954865 501712151 500909157
3609.6 500909157 500559616 508996353 510013313 507463379 511113853 510120811 514405327 519072952 519485283
3618.3 519485283 521239624 520011787 521072464 524776001 527773094 530005722 532733612 534643745
$$ packed form
3557.6D17489433K004395J144600J000366Q66890K082481J160775M5280L971710L59688
3566.2D30125618J1024O58074m18244K913895J468086K213288K204666J842003J302147
3574.9D42320557J165161J909637J77880K155723J724167R45816K048302J478157J360626
3583.6D55286026J149940M224434K005387j895600Q61512m51088L652534L398361K773743
3592.3D71005249J561508P24564L414612o89125K218818L294869M29878L092117R42154
3601D85994644J362648K804489J530381J981887K889748K180519p89451L757286q02994
3609.6E00909157l49541Q436737J016960k549934L650474r93042M284516M667625M12331
3618.3E19485283J754341j227837J060677L703537K997093K232628K727890J910133
$$ plain form
3626 534643745 536599007 543974457 543163452 530589142 536009827 542250557 548193474 548802986 546486778
3634.7 546486778 548881874 552634697 555460548 555652428 557513351 560279045 562038612 562636681 563727798
3643.4 563727798 566517754 569593201 575112915 573309402 569092712 575027390 573761673 569418716
3651.1 569418716 570220413 577478523 582223244 585633583 589735527 581054039 583498077 589293404
3658.8 589293404 590852432 592224808 592541504 594575958 595518875 597217026 599576225 600322609 604231110
3667.5 604231110 605614052 604489136 604997940 597679787 601543541 610895271 619223061 616015320
3675.2 616015320 597108994 602370186 611015434 615187607 612616768 613825722 617653046 619535332
3682.9 619535332 621244659 621675987 621746979 626471329 632349091 620762520 618716431 626819878 619264259
$$ packed form
3626E34643745J955262P375450q11005j2574310N420685O240730N942917O09512k316208
3634.7E46486778K395096L752823K825851J91880J860923K765694J759567N98069J091117
3643.4E63727798K789956L075447N519714j803513m216690N934678j265717m342957
3651.1E69418716Q01697P258110M744721L410339M101944q681488K444038N795327
3658.8E89293404J559028J372376L16696K034454R42917J698151K359199P46384L908501
3667.5F04231110J382942j124916N08804p318153L863754R351730Q327790l207741
3675.2F16015320j8906326N261192Q645248M172173k570839J208954L827324J882286
3682.9F19535332J709327M31328P0992M724350N877762j1586571k046089Q103447p555619
$$ plain form
3691.6 619264259 620779991 626949043 627878609 630544777 631137733 630592117 632533836 633321762 635524521
3700.3 635524521 637939453 632279205 630600357 635806427 637697449 637987785 638812904 641831970 645117264
3709 645117264 637238655 640684128 643332291 630600548 636140060 641262894 642550507 643752441
3716.7 643752441 645781784 646345291 642911606 644524155 650767365 646893158 642154465 647908554
3724.4 647908554 648704300 647877731 645424423 645961609 650600204 652298813 657638550 653140869 646432114
3733.1 646432114 656657791 655385208 645141449 648707733 651460876 649755249 652109299 655923233
3740.8 655923233 652130356 656277847 669148026 653786469 634917641 648486481 657424011 664972000
3748.5 664972000 661066437 648863449 659110794 652471008 647276382 655083084 660887451 664072723
$$ packed form
3691.6F19264259J515732O169052R29566K666168N92956n45616J941719P87926K202759
3700.3F35524521K414932n660248j678848N206070J891022K90336Q25119L019066L285294
3709F45117264p878609L445473K648163j2731743N539512N122834J287613J201934
3716.7F43752441K029343N63507l433685J612549O243210l874207m738693N754089
3724.4F47908554P95746q26569k453308N37186M638595J698609N339737m497681o708755
3733.1F46432114J0225677j272583j0243759L566284K753143j705627K354050L813934
3740.8F55923233l792877M147491J2870179j5361557j8868828J3568840Q937530P547989
3748.5F64972000l905563j2202988J0247345o639786n194626P806702N804367L185272
$$ plain form
3756.2 664072723 657844543 659833984 664970398 656541290 655516205 660232315 662178879 663155823
3763.9 663155823 666025620 662017517 657652969 662178268 668214340 668266068 658745499 660880661 664276810
3772.6 664276810 664627457 665514603 665276184 665821991 665959930 668485641 667965851 660916061 663990631
3781.3 663990631 666212921 667860336 670733948 666775818 665199203 667002106 668120804 668789749
3789 668789749 668518753 669255524 669620285 669685211 669513931 671334991 674546356 669173660 665044250
3797.7 665044250 668487778 673719788 679709625 671570435 662169800 667179489 670694351 675490036
3805.4 675490036 679812012 667985535 664716339 670463104 672278900 672485657 673032074 673386917 675533524
3814.1 675533524 681317444 677824097 663160934 669230118 675877762 681173401 681030655 661656418
$$ packed form
3756.2F64072723o228180J989441N136414q429108j025085M716110J946564R76944
3763.9F63155823K869797m008103m364548M525299O036072N1728r520569K135162L396149
3772.6F64276810L50647Q87146k38419N45807J37939K525711n19790p049790L074570
3781.3F63990631K222290J647415K873612l958130j576615J802903J118698O68945
3789F68789749k70996P36771L64761O4926j71280J821060L211365n372696m129410
3797.7F65044250L443528N232010N989837q139190r400635N009689L514862M795685
3805.4F75490036M321976j1826477l269196N746765J815796K06757N46417L54843K146607
3814.1F75533524N783920l493347j4663163O069184O647644N295639j42746j9374237
$$ plain form
3821.8 661656418 665779800 672607040 675924530 678791885 677777481 673094940 673658142 675793381
3829.5 675793381 679275436 681011887 672626648 675517044 682435379 675963898 675604630 683670120
3837.2 683670120 673265533 669213409 677464294 671168900 672487564 680060959 676810303 673037186
3844.9 673037186 676397781 678878708 679534149 681484375 680489578 682260437 687906952 679444809 676488419
3853.6 676488419 660675201 666513596 678490677 676928711 675833817 679396973 682921448 686362381
3861.3 686362381 679602814 679088058 686319656 677545853 671440887 676943207 683420639 690176468
3869.1 690176468 680187149 671411285 676458588 683041077 686144714 675305252 676880188 681276703
3876.8 681276703 681433640 684332428 689010315 681912155 674638138 681426544 682659225 684300003
$$ packed form
3821.8F61656418M123382O827240L317490K867355j014404m682541N63202K135239
3829.5F75793381L482055J736451q385239K890396O918335o471481l59268Q065490
3837.2F83670120j0404587m052124Q250885o295394J318664P573395l250656l773117
3844.9F73037186L360595K480927O55441J950226r94797J770859N646515q462143k956390
3853.6F76488419j5813218N838395J1977081j561966j094894L563156L524475L440933
3861.3F86362381o759567n14756P231598q773803o104966N502320O477432O755829
3869.1F90176468r989319q775864N047303O582489L103637j0839462J574936M396515
3876.8F81276703J56937K898788M677887p098160p274017O788406J232681J640778
$$ plain form
3884.5 684300003 688571091 675231552 677239914 681970062 683451004 688281097 687228241 676567230
3892.2 676567230 677826767 682282181 681861954 683475266 684842300 688056183 689660645 678611908
3899.9 678611908 683515701 684822464 679049454 683515854 679832230 678595428 679869461 680878830
3907.6 680878830 682812576 683255615 684393692 684248657 683775787 683414001 683216629 685410461 687744370
3916.3 687744370 683321457 679920654 684937057 684564896 680688019 683301392 684771957 685899734
3924 685899734 683599777 680639420 683063736 684693680 685961990 685858307 686215820 687808914 683706207
3932.7 683706207 681781998 683775864 684582443 684990387 685024033 685107574 685138931 684203262 685319595 686568527
3942.3 686568527 682871552 682918625 684691238 685717850 686874390 683773575 683881683 684507828 683302612
$$ packed form
3884.5F84300003M271088j3339539K008362M730148J480942M830093j052856j0661011
3892.2F76567230J259537M455414m20227J613312J367034L213883J604462j1048737
3899.9F78611908M903793J306763n773010M466400l683624j236802J274033J009369
3907.6F80878830J933746M43039J138077j45035m72870l61786j97372K193832K333909
3916.3F87744370m422913l400803N016403l72161l876877K613373J470565J127777
3924F85899734k299957k960357K424316J629944J268310j03683L57513J593094m102707
3932.7F83706207j924209J993866Q06579M07944L3646Q3541L1357r35669J116333J248932
3942.3F86568527l696975M7073J772613J026612J156540l100815J08108O26145j205216
$$ plain form
3951 683302612 685974884 686068268 685048370 685497665 685515823 685540695 685310516 685581894 685446243 686758423
3960.7 686758423 687422943 685272598 685293121 686065598 685852356 686008224 686087036 685629272 684755020 685036087
3970.3 685036087 686640472 686401367 685334930 685394745 685639877 686254578 685980606 686212997 686597443
3979 686597443 685780258 686022034 686473312 686326904 686140213 686048584 686046066 686164093 685957184 685935974 686638107
3989.6 686638107 686260757 685892181 685914841 686230621 686585312 685570755 685251160 686088943 686866150 686596375
3999.2 686596375 686582336
4000.2 686582336
$$ packed form
3951F83302612K672272R3384j019898M49295J8158K4872k30179K71378j35651J312180
3960.7F86758423O64520k150345K0523P72477k13242J55868P8812m57764q74252K81067
3970.3F85036087J604385k39105j066437N9815K45132O14701k73972K32391L84446
3979F86597443q17185K41776M51278j46408j86691r1629k518J18027k06909k1210P02133
3989.6F86638107l77350l68576K2660L15780L54691j014557l19595Q37783P77207k69775
3999.2F86596375j4039
4000.2F86582336
##END=$$ End of the data block
