##TITLE=$$ Begin of the data block
##JCAMP-DX=5.00 $$ ACD/SpecManager v 10.08
##SPECTROMETER/DATA SYSTEM=Varian
##DATE=20 Nov 2012 15:53:12
##DATA TYPE=INFRARED SPECTRUM
##DATA CLASS=XYDATA
##ORIGIN=
##OWNER=
##NPOINTS=3735
##FIRSTX=399.26403809
##LASTX=4000.35498047
##MAXX=4000.35498047
##MINX=399.26403809
##MAXY=77.93534851
##MINY=32.92706680
##XFACTOR=1.0000000000
##YFACTOR=0.000000100000000
##FIRSTY=61.85819244
##DELTAX=0.96440572
##XUNITS=1/CM
##YUNITS=TRANSMITTANCE
##XYDATA=(X++(Y..Y))
399.3F18581924l7400360j5223121J4122162R017715j564674l881760N01976l013649
$$ 618581924 581181564 565958443 580080605 589098320 587533646 583651886 584153862 581140213
407E81140213o508598r496956r39369R555702M078331l884964L565903M533271l918113
$$ 581140213 574631615 565134659 564195290 573750992 577829323 573944359 577510262 582043533 578125420
415.7E78125420K511482j700478p458305J0770912k370720l828697r348335r74846
$$ 578125420 580636902 578936424 571478119 582249031 579878311 576049614 566701279 565726433
423.4E65726433M188843j430664l510j071968k857933m629173K81143r57146j470146
$$ 565726433 569915276 568484612 568481102 567409134 564551201 559922028 560203171 559246025 557775879
432.1E57775879o49147k922096M378738L690567J976662M320373o54144l294678O54984
$$ 557775879 557126732 554204636 558583374 562273941 564250603 568570976 567916832 564622154 565277138
440.7E65277138K341308j797218k652702J175270N306015L048820J608124K990952
$$ 565277138 567618446 565821228 563168526 564343796 569649811 572698631 574306755 577297707
448.4E77297707K428932R13543n276107k407265l93410n715828J343155L871575M07447
$$ 577297707 579726639 580640182 575364075 572956810 572563400 566847572 568190727 572062302 572469749
457.1E72469749M478226K84729n282402m575615j006050j917114K16636K439194j181030
$$ 572469749 576947975 577232704 571950302 567374687 566368637 564451523 564668159 567107353 565926323
465.8E65926323J054115O323471L16201l049279k160415k955361l621292n754509n69076
$$ 565926323 566980438 573303909 573620110 570570831 568410416 565455055 561833763 556079254 555510178
474.5E55510178K278442k905884m971466L04527M587594O303405M215660q60023o857109
$$ 555510178 557788620 554882736 549911270 550215797 554803391 561106796 565322456 564462433 557605324
483.2E57605324j0039520r95102K752571O09817J729775J932220Q75511J929627K970085
$$ 557605324 547565804 546570702 549323273 549933090 551662865 553595085 554470596 556400223 559370308
491.8E59370308k170181k619477n334320n875396J355819j500549k321968J183700
$$ 559370308 557200127 554580650 549246330 543370934 544726753 543226204 540904236 542087936
499.6E42087936M544411N685387p79686l590813l713264n095444n046463k08397K326050
$$ 542087936 546632347 552317734 551538048 547947235 544233971 539138527 534092064 533883667 536209717
508.2E36209717o42891j337433l50876K751732j117020k791710j306343j590042j287155
$$ 536209717 535566826 534229393 533878517 536630249 535513229 532721519 531415176 529825134 528537979
516.9E28537979n951958n170784j155433K470131J310730n31922p72896k02522R92851
$$ 528537979 522586021 517415237 516259804 518729935 520040665 519508743 518735847 518533325 519526176
525.6E19526176j729011j035614k970123j897049P74154J381493M556236J080628Q31031
$$ 519526176 517797165 516761551 513791428 511894379 512668533 514050026 518606262 519686890 520517921
534.3E20517921R17855j410599j482735p62367K350655L270530M275628J834182J560288
$$ 520517921 521435776 520025177 518542442 517780075 520130730 523401260 527676888 529511070 531071358
543E31071358L515167J123505n5924r89342j255226j598205q33092L74832L83415R39942
$$ 531071358 534586525 535710030 535654106 534664764 533409538 531811333 530978241 531353073 531736488 532676430
552.6E32676430N89103q68187k844047n77889p63511l395691l325119k580376M53797
$$ 532676430 533265533 532397346 529553299 528975410 528211899 524816208 521491089 518910713 519364510
561.3E19364510q19283k088852j606521j329537j6937j272507l644028l104057j029549
$$ 519364510 518545227 516456375 514849854 513520317 513503380 512230873 508586845 505482788 504453239
570E04453239l678932l242836k518081j873627K744865K472802J123428o20346L4523
$$ 504453239 500774307 497531471 495013390 493139763 495884628 498357430 499480858 498860512 498895035
578.6D98895035O55937J656532K548371J725464L479309K066192L179245L052178J773567
$$ 498895035 499550972 501207504 503755875 505481339 508960648 511026840 514206085 517258263 519031830
587.3E19031830K551040J053086M65431n09377O24924J267319J477585K120132L92609
$$ 519031830 521582870 522635956 523101387 522592010 523216934 524484253 525961838 528081970 528474579
596E28474579j06850p72667j53618K56386j515541j327209J106071P79190n94253L88221
$$ 528474579 528367729 527595062 527441444 527697830 526182289 524855080 525961151 526740341 526146088 526534309
605.6E26534309O09360J291542J4839l87611m24576j505585J47591P81822J866570
$$ 526534309 527143669 528435211 528450050 528062439 527637863 526132278 526279869 527061691 528928261
614.3E28928261J770210J139374O03065N41687K157479J263504J78528O7024K012176
$$ 528928261 530698471 531837845 532440910 532982597 535140076 536403580 536582108 536649132 538661308
623E38661308K606888J424065J638908K061119J876450Q0871M14849J30691M22745
$$ 538661308 541268196 542692261 544331169 546392288 548268738 548349609 548764458 548895149 549317894
631.7E49317894J737862N08384O8779K4987L043441M055138Q94775l45840q1711n8441
$$ 549317894 551055756 551564140 551632919 551657906 554701347 558756485 559651260 559305420 559223709 559165268
641.3E59165268n78117o58722p05529J554490K569427P76100J633949R29223Q31070
$$ 559165268 558587151 557928429 557222900 558777390 561346817 562122917 563756866 564686089 565517159
650E65517159K340660p28264k487793o55670o74210N5923J445466J995277K705917
$$ 565517159 567857819 567129555 564641762 563986092 563311882 563367805 564813271 566808548 569514465
658.7E69514465J564484J380234L92227j270676j124649j696815j032257J381569J751861
$$ 569514465 571078949 572459183 572851410 571580734 570456085 568759270 567727013 569108582 570860443
667.4E70860443k998733K983627L489380K114715J837120J00670r92355j977577j521225
$$ 570860443 567861710 570845337 574334717 576449432 578286552 578387222 577394867 575417290 573896065
676.1E73896065K61421J400223K373161K120895K728043J417503P34330O93855j103287
$$ 573896065 574157486 575557709 577930870 580051765 582779808 584197311 584931641 585625496 584522209
684.7E84522209j620178j694756j77574P77741J727867K112694Q26950N8975l66860
$$ 584522209 582902031 581207275 581029701 581807442 583535309 585648003 586474953 586533928 586167068
693.4E86167068M59672j077195k106666j409416j914711j121827j71508M32815m43077
$$ 586167068 586626740 585549545 583442879 582033463 580118752 578996925 578825417 579258232 578815155
702.1E78815155n80940K36587o47316j277389j165886j307755j748275l55645Q39196
$$ 578815155 578234215 578470802 577823486 576546097 575380211 574072456 572324181 571968536 572807732
710.8E72807732J358070K268028K296410J193848O68754J802559M06837o5193O89392
$$ 572807732 574165802 576433830 578730240 579924088 580592842 582395401 582802238 582737045 583426437
719.5E83426437J146126L971596L524628J901207J877632K742614L760033K658348
$$ 583426437 584572563 588544159 592068787 593969994 595847626 598590240 602350273 605008621
727.2F05008621R30214M61502L62244P31087J631202J318016K149544K938843K427635
$$ 605008621 605938835 606400337 606762581 607493668 609124870 610442886 612592430 615531273 617958908
735.8F17958908K341652Q71162j74369o50292j39427P5874j043777N21622O10160m1160
$$ 617958908 620300560 621171722 620997353 620347061 620207634 620283508 619239731 619761353 620371513 620330353
745.5F20330353K101860J961365j530114l962402k866821k232399k803650j866722
$$ 620330353 622432213 624393578 622863464 618901062 616034241 613801842 610998192 609131470
753.2F09131470j368103p19109P80373r57260k082596R22889j190223m065170k382050
$$ 609131470 607763367 607044258 607824631 606867371 604784775 605707664 604517441 600452271 598070221
761.9E98070221j555595J53121P26777O84509J192474R47380R80301N67856J346588
$$ 598070221 596514626 596667747 597394524 598079033 599271507 600218887 601199188 601767044 603113632
770.6F03113632J507111J371269L016624K904892K251130K750892L694840M230423
$$ 603113632 604620743 605992012 609008636 611913528 614164658 616915550 620610390 624840813
778.3F24840813L237495L267861K109794K75765J966514L193741K489243K075500K049942
$$ 624840813 628078308 631346169 633455963 633731728 635698242 638891983 641381226 643456726 645506668
787F45506668K888794K465134L52783J057281P41654l17841J726456Q66928K98004
$$ 645506668 648395462 650860596 651213379 652270660 653012314 652694473 654420929 655287857 655585861
795.6F55585861J492996J522599K539215K362900J727981J714401M85077j87454J050034
$$ 655585861 657078857 658601456 661140671 663503571 665231552 666945953 667431030 667243576 668293610
804.3F68293610P23266K32849J664734J821518J214752Q74787N38940K8000l48282
$$ 668293610 669016876 669249725 670914459 672735977 673950729 674825516 675364456 675392456 675044174
813F75044174j680527j652145J06659N341R80224J596375J068954J110993J29242r62525
$$ 675044174 673363647 671711502 671818161 671823502 672803726 674400101 675469055 676580048 676709290 675746765
822.6F75746765j013031k77252k93045n60684j156845k10038P40738m70810n04989
$$ 675746765 674733734 674456482 674163437 673602753 672445908 672235870 672976608 672505798 672000809
831.3F72000809j072235j898041k220993k496567k315063j990433k124329j967315
$$ 672000809 670928574 669030533 666809540 664312973 661997910 660007477 657883148 655915833
839F55915833k03858j09177m01535k96478j707687k319412j919938j525421j332092
$$ 655915833 655711975 655602798 655201263 654904785 653197098 650877686 648957748 647432327 646100235
847.7F46100235j084061p99865j10245J41144o5766j044769k089005k091369l826523
$$ 646100235 645016174 644216309 644106064 644247208 644181442 643136673 641047668 638956299 635129776
856.4F35129776l939323k355042j266632k52953P0687J396141J077423J354027L550453
$$ 635129776 631190453 628835411 627568779 627315826 627386513 628782654 629860077 631214104 634764557
865.1F34764557L181877L209953K984238J860962K716141M373626M713898M687729
$$ 634764557 637946434 641156387 644140625 646001587 648717728 653091354 657805252 662492981
872.8F62492981M372864K380295J750412J647186J116714Q164k57721k58103j329727
$$ 662492981 666865845 669246140 670996552 672643738 673760452 673768616 673510895 673252792 671923065
881.5F71923065q40454o04477J85547o66580k176590j785889k522659l011017k951431
$$ 671923065 671082611 670478134 670663681 669997101 667820511 666034622 663511963 660500946 657549515
890.2F57549515k532654j950760q84247r34829o81153M86756j342392k886734k810898
$$ 657549515 655016861 653066101 652181854 651247025 650565872 651052628 649710236 646823502 644012604
898.8F44012604k011872k237663k232628q86879j605949r78890N9548j119766k000199
$$ 644012604 642000732 639763069 637530441 636643562 635037613 634058723 634118271 632998505 630998306
907.5F30998306k390098l254624m458618m411774l631973k675590k500458k998734
$$ 630998306 628608208 625353584 620894966 616483192 612851219 610175629 607675171 604676437
915.2F04676437l239898l683319k778702k659836m050941l288422k365990k095260
$$ 604676437 601436539 597753220 594974518 592314682 588263741 584975319 582609329 580514069
922.9E80514069j687661q19053j8463o96564l27683p2250l55453q0529M39301P30514
$$ 580514069 578826408 578007355 577988892 577292328 576964645 576892395 576536942 576456413 576895714 577626228
932.6E77626228p820M34914J552734J825791J317978J196060J728553J392403Q77495
$$ 577626228 577618408 578053322 579606056 581431847 582749825 583945885 585674438 587066841 587944336
941.3E87944336J284294J725655J140098K6207p68204k50892r22508k642327k825203
$$ 587944336 589228630 590954285 592094383 592120590 591352386 591101494 590178986 587536659 584711456
949.9E84711456m046707m953537m834556n278702n216637n407257n159378n308571
$$ 584711456 580664749 575711212 570876656 565597954 560381317 554974060 549814682 544506111
957.7E44506111m875259n038300o322136n972709o614914o890183p347717o972008
$$ 544506111 539630852 534592552 528270416 522297707 515682793 508792610 501444893 494472885
965.4D94472885n770874o158333p188987p830162o646653p666053p819291q032570
$$ 494472885 488702011 482543678 475354691 467524529 460877876 453211823 445392532 437359962
973.1D37359962q156776p567177q782768p015610p571907p558670o870499n986213
$$ 437359962 429203186 421636009 412853241 405837631 398265724 390707054 383836555 377850342
980.8C77850342m812889n892754m941826n426063l842659l640976l281555k034455
$$ 377850342 373037453 367144699 362202873 356776810 352934151 349293175 346011620 343977165
988.5C43977165k326050j053390j375465J44729j271095j225815j82037k33574Q19473
$$ 343977165 341651115 340597725 339222260 339366989 338095894 336870079 336688042 336454468 337273941
997.2C37273941m45785N87844l76167N28946P63092M40674P11288r50432M82903j006088
$$ 337273941 336828156 337416000 337039833 337568779 338331871 338772545 339483833 338533401 339016304 338010216
1006.8C38010216j77040o50750j479835m74930j270523N1498j272468j17874n35164
$$ 338010216 337833176 337182426 335702591 335227661 333957138 334008636 332736168 332618294 332083130
1015.5C32083130j028099q10166r74197J525612L64761K19040k75612J895676K133980
$$ 332083130 331055031 330244865 329270668 330796280 331161041 331380081 331104469 333000145 335134125
1024.2C35134125R60541J659317J62048J802482N76401R62677J160355J119575J715241
$$ 335134125 336094666 337753983 337916031 339718513 340294914 341257591 342417946 343537521 345252762
1032.9C45252762O86455K151107O33927J365967O85958O05393P15446n50346J64604
$$ 345252762 345939217 348090324 348724251 350090218 350776176 351381569 352097015 351546669 351711273
1041.6C51711273j032257J433411J33400M30717J274681j5907J006393L49923K390174
$$ 351711273 350679016 352112427 352245827 352676544 353951225 353935318 354941711 355291634 357681808
1050.2C57681808M75960Q21228J637955J645889K062989R05647M030876L092270L579712
$$ 357681808 358157768 358978996 360616951 362262840 364325829 365231476 369262352 372354622 375934334
1058.9C75934334L170090L331985M033470K915573M957619L202133L430329L057060
$$ 375934334 379104424 382436409 386469879 389385452 394343071 397545204 400975533 404032593
1066.6D04032593K804107J727143o86646j799698m384193l666077n696182n238037
$$ 404032593 406836700 408563843 407877197 406077499 401693306 398027229 392331047 387093010
1074.4C87093010m567184l595276j218834k310677M39682p95784P59583J044006j16882
$$ 387093010 382525826 378930550 377711716 375401039 375840721 375044937 375804520 376848526 376731644
1083C76731644J874618J579895K261505R78814L431510K789650K611123K965698J315651
$$ 376731644 378606262 380186157 382447662 383426476 386857986 389647636 392258759 395224457 396540108
1091.7C96540108L002853J217957K411270K104912J918945K077141J393242K112655
$$ 396540108 399542961 400760918 403172188 405277100 407196045 409273186 410666428 412779083
1099.4D12779083O74362K130166L41758m68559p47871m12407J585960J30425J201744
$$ 412779083 413453445 415583611 415925369 415456810 414708939 414296532 415882492 416012917 417214661
1108.1D17214661J056518K226029K210960J457291K041435K275429K620086P68700
$$ 417214661 418271179 420497208 422708168 424165459 426206894 428482323 431102409 431871109
1115.8D31871109K244377J763954J850968K196006R27239J419678N25894J720695R87587
$$ 431871109 434115486 435879440 437730408 439926414 440853653 442273331 442799225 444519920 445507507
1124.5D45507507J175995J695976J255875J519013J379737L054886K119789K786217
$$ 445507507 446683502 448379478 449635353 451154366 452534103 455588989 457708778 460494995
1132.2D60494995K407265J709785K156945L33595k76566j501465r07402j672782k584992
$$ 460494995 462902260 464612045 466768990 467102585 466826019 465324554 464417152 462744370 460159378
1140.9D60159378k630997l526916k959099l675804l036804l703575k882500k341156
$$ 460159378 457528381 454001465 451042366 447366562 444329758 440626183 437743683 435402527
1148.6D35402527k301178j193009k746467j474228k233772j598130n08728m20875L63655
$$ 435402527 433101349 431908340 429161873 427687645 425453873 423855743 423347015 422926140 423289795
1157.3D23289795k73171J016884o1149J234474J598244J305656K472611K193450L592301
$$ 423289795 423016624 424033508 423972359 425206833 426805077 428110733 430583344 432776794 436369095
1166D36369095L398857M363670M306717M304619M709549M820137N405579N247001O455498
$$ 436369095 439767952 444131622 448438339 452742958 457452507 462272644 467678223 472925224 479380722
1174.6D79380722N286789M915619N165596N533028N843620N050316N196876M484825
$$ 479380722 484667511 489583130 494748726 500281754 506125374 511175690 516372566 520857391
1182.4E20857391N127602M981575M283829L659248K818947L602180L309594K857208
$$ 520857391 525984993 530966568 535250397 538909645 541728592 545330772 548640366 551497574
1190.1E51497574K526893K054711J568832J394081J443520P02782M41322J80473L58544
$$ 551497574 554024467 556079178 557648010 559042091 560485611 561188393 561629715 561810188 562168732
1198.8E62168732N00793P7171K20261O18172P60803L81889P29714O30188M77829J110115
$$ 562168732 562669525 562746696 562966957 563585129 564345932 564727821 565457535 566087723 566565552 567675667
1208.4E67675667J446838J408997P58629R43412J335946J662559J720848J078797J516265
$$ 567675667 569122505 570531502 571290131 572233543 573569489 575232048 576952896 578031693 579547958
1217.1E79547958J953354J140137L90205L84331M53682J14288k91099m21601l77922
$$ 579547958 581501312 582641449 583031654 583415985 583869667 583983955 583692856 583271255 582893333
1225.8E82893333k90260l03001l14560n01251r36814o34346m70390j199455j228829
$$ 582893333 582603073 582300072 581985512 581484261 580547447 579913101 579442711 578243256 577014427
1234.4E77014427p92312m06533m58717p28874n80673l88070m8370k73170k74849k53411
$$ 577014427 576222115 575815582 575356865 574627991 574047318 573659248 573610878 573337708 573062859 572809448
1244.1E72809448l87153N3444K86979N99137P66830J037712J076698J193581R69048
$$ 572809448 572422295 572475739 572762718 573361855 574128685 575166397 576243095 577436676 578405724
1252.8E78405724k8496l2006L44697O14967P19108M61998K99187K37656L54957N01519
$$ 578405724 578377228 578345222 578689919 579304886 580023994 580485992 580785179 581022835 581377792 581879311
1262.4E81879311K33688J8997P90672J096001P32269M88549N51071J046676P60079
$$ 581879311 582112999 582131996 582922668 584018669 584750938 585239487 585790558 586837234 587597313
1271.1E87597313Q01201J204414R90486J072502N97992j04103L02048P6828j19362
$$ 587597313 588398514 589602928 590593414 591665916 592263908 592159805 592461853 592538681 592419319
1279.8E92419319J66207n69573m24461L65905M34075K0294k28119K95029J40343k13204
$$ 592419319 592585526 592015953 591591492 591957397 592391472 592411766 592183647 592478676 592619019 592405815
1289.4E92405815k82631p79724n28107n7678k66266j31073o0501o96068r83810p12128
$$ 592405815 592123184 591343460 590815353 590757675 590491409 590360336 590299835 589603767 588619957 587907829
1299E87907829m77295n85823p75184p14913p63130q74710r48334j174965n78193l3112
$$ 587907829 587430534 586844711 586069527 585354614 584591484 583716774 582768440 581593475 581015282 580982170
1308.7E80982170p30705q05435j89362m75883j644440j344452l13110k14692r7656
$$ 580982170 580251465 579446030 579256668 578780785 577136345 575791893 575478783 575264091 575166435
1317.4E75166435m25377m95529P4158j14594n49278o78978j002807j565857j495285
$$ 575166435 574741058 574245529 574319687 574205093 573655815 572976837 571974030 570408173 568912888
1326E68912888j387024j681519j772537j378327j384239j698951j435471j228523j026802
$$ 568912888 567525864 565844345 564071808 562693481 561309242 559610291 558174820 556946297 555919495
1334.7E55919495j516076j743507j222839q02002p25517o57120P32498Q29048N84107
$$ 555919495 554403419 552659912 551437073 550635071 549909554 549252434 549984932 550813980 551398087
1343.4E51398087M53987N00145K35748l26691n59730p26624j70784K2659L78190M42733
$$ 551398087 551852074 552352219 552587967 552261276 551701546 550974922 550804138 550826797 551204987 551647720
1353.1E51647720J25008j22566o90308m98848q50487r60579q91151j167870o04896
$$ 551647720 551772728 551650162 550959854 550461006 549610519 548649940 547758789 546590919 545986023
1361.7E45986023n99175q86955l4981L69378k47078K1133p45964j473274l21999n32989
$$ 545986023 545386848 544499893 544464912 544834290 544587212 544608345 543862381 542389107 542067108 541534119
1371.4E41534119K79274p0801m46625O90956J195221J536789N59044N98183L74565
$$ 541534119 541813393 541742592 541295967 541986923 543182144 544718933 545277977 545876160 546250725
1380.1E46250725K36892P4006K08549J055489J270179K216416J794090J629906K284927
$$ 546250725 546487617 546561623 546770172 547825661 549095840 551312256 553106346 554736252 557021179
1388.7E57021179K178803J311569Q91762P79915J26304n74913j038666J224556J127320
$$ 557021179 559199982 560511551 561403313 562183228 562309532 561734619 560695953 561920509 563047829
1397.4E63047829M55398q67843n24521N61752j140404p75108o49529k054824n19333
$$ 563047829 563503227 562635384 562110863 562672615 561532211 560757103 560107574 558052750 557533417
1406.1E57533417K47345k04125p19528m00619q25615p46308p55310p38334o19622r99565
$$ 557533417 557780762 557576637 556857109 556456490 555630875 554884567 554129257 553390923 552771301 551771736
1415.7E51771736r73625j161118m60891l025933J445313K183418J13754k5367j533356
$$ 551771736 550798111 549636993 549176102 546150169 547595482 549778900 549892654 549867287 548333931
1424.4E48333931J029243R47037m31213O95076P9155M3945J92108J638336R81675J31454
$$ 548333931 549363174 550310211 549878998 550574074 550653229 550697174 550889282 552527618 553509293 553640747
1434.1E53640747J125069K51922j776390p9231K534142J083564O85768J141549M98657
$$ 553640747 554765816 555017738 553241348 553162117 555696259 556779823 557465591 558607140 559105797
1442.7E59105797J151123Q0299O04515K48146o20956j597939L55912J307449r02939
$$ 559105797 560256920 560337219 560941734 561189880 560568924 558970985 559326897 560634346 559731407
1451.4E59731407o48537o23664O25763m12598j649246j986695k981300L315811J74599
$$ 559731407 559082870 558459206 559084969 558672371 557023125 555036430 552055130 555370941 555545540
1460.1E55545540J836052L10974R23653K254104j597328K421837J947822L165513J864547
$$ 555545540 557381592 557692566 558616219 560870323 559272995 561694832 563642654 566808167 568672714
1468.8E68672714K611275M944153L614235K999611J314163O385422L982544L679389
$$ 568672714 571283989 576228142 579842377 582841988 584156151 590541573 594524117 598203506
1476.5E98203506L892785M076728M211770K652244L345718J777001L545074K796135
$$ 598203506 602096291 606173019 610384789 613037033 616382751 618159752 621704826 624500961
1484.2F24500961J944542K483826O44340K715493J811981J014137k6131L854790L552857
$$ 624500961 626445503 628929329 629573669 632289162 634101143 635115280 635089149 638943939 642496796
1492.9F42496796J553726K481994N13459j225510J993713J348038q98132J712952K021636
$$ 642496796 644050522 646532516 647045975 645820465 647814178 649162216 648264084 649977036 651998672
1501.6F51998672M66767K013702J729965L417511j744537j0543289M816818K357407
$$ 651998672 652465439 654479141 656209106 659626617 657882080 647338791 652155609 654513016
1509.3F54513016J599045J007309J546173J78375K038269J714477K29J30005k165451
$$ 654513016 656112061 657119370 658665543 658843918 660882187 662596664 662596893 662726898 660561447
1518F60561447M738617K573395k970810l126450K85111M919281K186966Q4305J06048
$$ 660561447 665300064 667873459 664902649 661776199 662061310 666980591 669167557 669251862 669357910
1526.6F69357910J640625J041107Q94471J476593p61338j7929k219620j624755L466110
$$ 669357910 670998535 672039642 672934113 674410706 673649368 673631439 671411819 669787064 673253174
1535.3F73253174K219543J759873R25293k893677p813873M904098j75552n52597M458542
$$ 673253174 675472717 677232590 678157883 675264206 667450333 672354431 672178879 671626282 676084824
1544F76084824K09426j112747K268524J924744J154556o72760j440429J754760J147232
$$ 676084824 676294250 675181503 677450027 679374771 680529327 679856567 678416138 680170898 681318130
1552.7F81318130n84335l167572j68991L403473K986145k935715o825866j634140M942626
$$ 681318130 680733795 677566223 677397232 680800705 683786850 680851135 674025269 672391129 677333755
1561.4F77333755K592164R53826m82711k481690o72378N15594N97229m07333n011215
$$ 677333755 679925919 680879745 680397034 677915344 677242966 677758560 678355789 677948456 672937241
1570F72937241J400451J547928o84204o49033P2556j845703r539948J573563J957169
$$ 672937241 674337692 675885620 675201416 674552383 674624939 672779236 663239288 664812851 666770020
1578.7F66770020J69906n53131j312485o25305j113586j595841k192535k229309k403717
$$ 666770020 666939926 666386795 665074310 664449005 663335419 661739578 659547043 657317734 654914017
1587.4F54914017k432404j471329k146911r64279j355286j143951j604081k741546
$$ 654914017 652481613 651010284 648863373 647899094 646543808 645399857 643795776 641054230
1595.1F41054230k058907l060722j981278k909622k425155j990853j770248j084557
$$ 641054230 638995323 635934601 633953323 631043701 628618546 626627693 624857445 623772888
1602.8F23772888k528953j677056k285003j834526k764855k442551l046798l201752
$$ 623772888 621243935 619566879 617281876 615447350 612682495 610239944 607193146 603991394
1610.5F03991394l14980j748352q85200j761360k77138o99959r030723J124687n12161
$$ 603991394 603676414 601928062 601042862 599281502 599004364 598304405 589273682 590398369 589886208
1619.2E89886208n63126j579514m56008j575318m422722J024437Q9798Q03070k317352
$$ 589886208 589323082 587743568 587287560 585712242 581289520 582313957 582403755 583206825 580889473
1627.9E80889473j682777J39770o67458n69572j265144O33735L54233l141518j059989
$$ 580889473 579206696 579346466 578679008 578109436 576844292 577478027 577832260 574690742 573630753
1636.6E73630753K334899J359635Q21800N63927m59023J635933j05705P82356J046715
$$ 573630753 575965652 577325287 578147087 578711014 578251991 579887924 579782219 580564575 581611290
1645.3E81611290j673660J511841k36207L396607K675667L189964K954826p915687
$$ 581611290 579937630 581449471 581213264 584609871 587285538 590475502 593430328 585514641
1653E85514641m338455P455062N579453L316917K743721J853829K021293J934700J791802
$$ 585514641 581176186 588631248 594210701 597527618 600271339 602125168 604146461 606081161 607872963
1661.6F07872963P93304K46239L769074K781257J982384K419434K208824j47209K026977
$$ 607872963 608666267 608912506 612681580 615462837 617445221 619864655 622073479 621926270 623953247
1670.3F23953247L709488J931534K822761L122712J029090j11618L508301L199768
$$ 623953247 627662735 629594269 632417030 635539742 636568832 636457214 639965515 643165283
1678F43165283K195358J724396J250305L781128L929444J326751o941833L404617N632630
$$ 643165283 645360641 647085037 648335342 652116470 656045914 657372665 650430832 653835449 659468079
1686.7F59468079L522949J445846J368866J631852K451858K111054J139068K189942
$$ 659468079 662991028 664436874 665805740 667437592 669889450 672000504 673139572 675329514
1694.4F75329514q2932o373138M395675M201889M439698l00522n914307M898453L069763
$$ 675329514 675246582 668873444 673269119 677471008 681910706 681610184 675695877 680594330 683664093
1703.1F83664093M27170r45282J139908r27735M59671J887436K69318k33154P96890
$$ 683664093 684091263 683145981 684285889 683358154 683817825 685705261 685974579 685741425 686538315
1711.8F86538315J082916L25241j895447j010742K518006l04871o319351L730469L119888
$$ 686538315 687621231 687946472 686051025 685040283 687558289 687253418 680934067 684664536 687784424
1720.5F87784424J539154J112900O58493n87082j12000L97110J8158N96619Q44269
$$ 687784424 689323578 690436478 691094971 690507889 690395889 690792999 690811157 691407776 692252045
1729.1F92252045j368409p64923K342835J970062l355713m126434L512039K641754
$$ 692252045 690883636 690118713 692461548 694431610 691075897 686949463 690461502 693103256
1736.9F93103256N84336J441497r76104k021790L657150K020874p14874J650696K830353
$$ 693103256 693687592 695129089 694152985 692131195 695788345 697809219 697094345 698745041 701575394
1745.5G01575394J335373M81567Q64487L99475L082733J158600J056976M252701K810364
$$ 701575394 702910767 703392334 704256821 704656296 707739029 708897629 709954605 714207306 717017670
1754.2G17017670K675857K455292O1035J625366K315903J608734J615677j345596R37805
$$ 717017670 719693527 722148819 722209854 723835220 726151123 727759857 729375534 728029938 728967743
1762.9G28967743L767929J791000J336136K501908J765899j888428J171647K317123
$$ 728967743 732735672 734526672 735862808 738364716 740130615 738242187 739413834 741730957
1770.6G41730957j252060k017059p1030M317017K438888k67105K491379R76868N34744
$$ 741730957 740478897 738461838 738390808 742707825 745146713 744879608 747370987 748347855 748882599
1779.3G48882599J373j075821N40314Q36487R50622n76019P80029K255402J373825
$$ 748882599 748883972 747808151 748348465 749184952 750135574 749559555 750339584 752594986 753968811
1788G53968811R34448J146698m18396j475219k255478k08969K855224R38034N951J962433
$$ 753968811 754903259 756049957 755631561 754156342 751900864 751691895 754547119 755485153 755491104 757453537
1797.6G57453537K294922O62155j505356Q46100k91061j00327Q54111k64206M59747
$$ 757453537 759748459 760410614 758905258 759751358 759460297 759359970 760214081 759949875 760409622
1806.3G60409622P46079R52606J412506J147232o69022L85590Q63953m71802j66931
$$ 760409622 761155701 762108307 763520813 764668045 763999023 764384613 765248566 764776764 764609833
1815G64609833l73383J77002K3804J107406J509629K88849N34134l97950R48716R07821
$$ 764609833 764236450 764413452 764437256 765544662 767054291 767343140 767877274 767479324 768428040 769335861
1824.6G69335861l151474n25131J563339J139908r29108k059097K210312K496643M20456
$$ 769335861 766184387 765659256 767222595 768362503 767433395 765374298 767584610 770081253 770501709
1833.3G70501709j80740k68631l6698n76172j103439O52390L94439Q35724Q20847J251220
$$ 770501709 770320969 770052338 770015640 769439468 768336029 768988419 769382858 770218582 771039429 772290649
1842.9G72290649L65754n055008J620102J896362o98090p13043O57730P14874k7465
$$ 772290649 772656403 767601395 769221497 771117859 770419769 769706726 770364456 771079330 771051865
1851.6G71051865J096420O55823L52020k72522o03867o6757m28696j48468l25164O40411
$$ 771051865 772148285 772804108 773156128 772883606 772279739 772212982 771784286 771635818 771310654 771951065
1861.3G71951065L27072M94919N69916j10245N76401q85620m76990j716461j329727
$$ 771951065 772278137 772773056 773342972 773232727 773809128 772923508 772446518 770730057 769400330
1869.9G69400330J761016J188202Q63037J65253N58777M05121L204o7901k59858j78375
$$ 769400330 771161346 772349548 773212585 773377838 773936615 774341736 774344940 774277039 774017181 773838806
1879.6G73838806m02450L22494j52588K55814M04281J05362N72434J03149Q41065o46363
$$ 773838806 773436356 773758850 773606262 773862076 774266357 774371719 774944153 775047302 775888367 775242004
1889.2G75242004k323989L55224Q01773J7472L52096J45493j62278J219788J21231
$$ 775242004 772918015 773273239 774075012 774092484 774444580 774590073 774427795 775647583 775768814
1897.9G75768814l49502M2266k85568q240l69262J90200K3575K08435P53861L41644
$$ 775768814 775419312 775461578 775176010 775167770 774798508 774988708 775012283 775220718 775974579 776316223
1907.6G76316223K21787k03781j099625o76422O96792j74331N6991K86637K39029J193695
$$ 776316223 776538010 776334229 775234604 774558182 775254974 775080643 775137634 775424271 775663300 776856995
1917.2G76856995j332169n50613O88705J47019m807j475830k52762Q17642M86832O4774
$$ 776856995 775524826 774974213 775662918 775809937 775805130 774329300 774076538 774894180 775381012 775445786
1926.8G75445786L95355M54635K87781J06278n21317l73306q60748J8997L55072M8752
$$ 775445786 775841141 776295776 776583557 776689835 776168518 775795212 774934464 774953461 775308533 775357285
1936.5G75357285M01611l052M18091J93939N34668p21512k214737M38004O21261Q2169
$$ 775357285 775758896 775755844 776173935 776367874 776902542 776181030 773966293 774404297 775025558 775107727
1946.1G75107727K3499N76477L74679J2741M42658K04010l01895n65796k12784m90875
$$ 775107727 775131226 775707703 776082382 776095123 776537781 776741791 776439896 775874100 775661316 775170441
1955.8G75170441j72425K59018J48850O10046N26047K89078j02234J6403l37448p37763
$$ 775170441 774998016 775257034 775405884 776015930 776541977 776831055 776728821 776745224 776407776 775670013
1965.4G75670013o15768q50143K98614Q17871O75430N68772M36325K18048j37939k76261
$$ 775670013 775054245 774204102 774502716 775320587 775996017 776564789 777001114 777219162 777081223 776804962
1975.1G76804962o66504p23190m25110L18222M21829J24054M05808N31921N61524K47116
$$ 776804962 776138458 775415268 774990158 775308380 775730209 775854263 776260071 776791992 777353516 777600632
1984.7G77600632l35999j035843o95114n31082l29437O76498K07138J5412P79266O74591
$$ 777600632 777264633 776228790 775533676 775002594 774673157 775349655 775556793 775572205 776351471 777026062
1994.3G77026062j70364l67203m69513q13065p0648j55792j31378J31912R4528L16010
$$ 777026062 776855698 776488495 776018982 775205917 775135269 774979477 774848099 774980011 775074539 775390549
2004G75390549L59420N53895k2126n52292n88989l92685n17730n29938K21786N83115
$$ 775390549 775749969 776303864 776281738 775729446 775140457 774747772 774230042 773700104 773921890 774505005
2013.6G74505005N62363K49252J35116m68750l57894m34494r86481j71509k45895j94321
$$ 774505005 775067368 775316620 775451736 774982986 774625092 774190598 773204117 773032608 772786713 772592392
2023.3G72592392o7749L03192P24945j38779j18331j55640l32260m82636l82614k96173
$$ 772592392 772524643 772827835 773552780 773414001 773295670 773140030 772807770 772325134 771942520 771646347
2032.9G71646347n43213j91498J15204O01120M03671n34l08303k02103j38168o40259
$$ 771646347 771103134 770911636 771026840 771627960 772031631 772031097 771722794 771520691 771382523 770742264
2042.6G70742264m29154m90112K65884L34626q2779J64490Q0718J60141l25317P858
$$ 770742264 770313110 769822998 770088882 770423508 770340729 770505219 770585937 770746078 770420761 770428619
2052.2G70428619j88217k03705L9215m31823K81524J46256K49405Q0185k50626J69754
$$ 770428619 770240402 770036697 770075912 769644089 769925613 770071869 770321274 770401459 770150833 770320587
2061.9G70320587J03989N34o89163k48642J95160J22299J54190L34549M95987k42996
$$ 770320587 770424576 770425110 769735947 769487305 769682465 769804764 769958954 770293503 770789490 770546494
2071.5G70546494k33841m25339R8648L22571l24784j2664j67389N3939K17362L27072
$$ 770546494 770312653 769887314 769985962 770308533 769983749 769971085 769803696 769857635 770074997 770402069
2081.1G70402069m0131l36303K77023P8278p2403r4605m5700j69906n5695J13220R0637
$$ 770402069 770361938 770025635 770302658 770380936 770308533 770213928 770168228 769998322 769942627 770055847 770146484
2091.7G70146484M93470K71835p5989j19324K20108l02734n89523J05819K36207N94100
$$ 770146484 770639954 770911789 770835800 770716476 770936584 770633850 770044327 770150146 770386353 770980453
2101.4G70980453J98517k46200q6746K9983l6011m9057r1552k30179K02255k47040
$$ 770980453 771178970 770932770 770846024 770876007 770839996 770790939 770699387 770469208 770671463 770424423
2111G70424423J08872L21731j61133K62604k21863o561L68652K90528O5918j22223
$$ 770424423 770533295 770855026 770693893 770956497 770734634 770728073 771096725 771387253 771453171 771330948
2120.7G71330948j55029l59116K39944J2284k59018m33960n6534N34287J2207N1803
$$ 771330948 771175919 770816803 771056747 771069031 770810013 770376053 770319519 770853806 770866013 770917816
2130.3G70917816j54877K37427L29895l9215j72577m41589J46332o638j76849k41394
$$ 770917816 770762939 771000366 771330261 771291046 771118469 770676880 770823212 770816574 770639725 770398331
2140G70398331N9280L69873J70593L22113j0986l3798l42713k14691n2185k20794J90963
$$ 770398331 770457611 770827484 770998077 771320190 771309204 771275406 770932693 770718002 770665817 770445023 770635986
2150.6G70635986J58387L69033K54059O5308k63825M1199L84140m35638m45481l35464
$$ 770635986 770794373 771163406 771417465 771482773 771218948 771260147 771644287 771208649 770763168 770427704
2160.2G70427704K12021L53622K81983M73632O7902L51410L65219M1504m17175l85132
$$ 770427704 770639725 770993347 771275330 771748962 771816864 772168274 772533493 772574997 772157822 771772690
2169.9G71772690l5248R9258J61667K07215Q79364K81677l63007K8687L89938K08359
$$ 771772690 771737442 771836700 771998367 772205582 773084946 773366623 773003616 773032303 773422241 773630600
2179.5G73630600l59268j19248P3624K09122J17416L29743L52630J05820K35443l7842
$$ 773630600 773271332 773152084 773225708 773434830 773552246 773881989 774234619 774340439 774575882 774538040
2189.1G74538040M5700k60467q4763k87552m73099L33329L48205Q05893N00260J45874
$$ 774538040 774583740 774323273 774238510 773950958 773477859 773811188 774159393 774965286 775465546 775611420
2198.8G75611420O9961l4714K1439n52978k46582k09351L78036P42035J62430L8300
$$ 775611420 775681381 775646667 775668106 775115128 774868546 774659195 775037231 775779266 775941696 775979996
2208.4G75979996P7209M46243l7002q6670l0365P0953O9046m47082K87247M55932L24936
$$ 775979996 776057205 776503448 776466446 776379776 776349411 776420364 776489410 776042328 776329575 776785507 777110443
2219G77110443K30026O562R0484L815j69373j49307J77918k85492k50931K36511L60718
$$ 777110443 777340469 777347031 777437515 777441330 777271957 777122650 777300568 777015076 776764145 777000656 777361374
2229.7G77361374L30276L91846R9411n33371R4528j15738k98004k22320j69754L44925
$$ 777361374 777691650 778083496 778182907 777649536 777744064 777628326 777330322 777108002 776938248 777283173
2239.3G77283173r3918M15191L75672J70517N3634k59933m6463m99497J54801K10266
$$ 777283173 777189255 777604446 777980118 778150635 778204269 777944336 777897873 777398376 777553177 777763443
2248.9G77763443J25809L11966K77252M32205k89612O8970j34659o28586k30179L3265
$$ 777763443 777889252 778201218 778478470 778910675 778621063 778690033 778555374 777926788 777696609 777729874
2258.6G77729874M4708J57013L60260r3537K53907K26822K30941J8845l68805j10016
$$ 777729874 777774582 777931595 778291855 778198318 778452225 778679047 778909988 778928833 778560028 778450012
2268.2G78450012m67071O9198m4708M20914L19595m73785M73327K95792J34354l54233
$$ 778450012 777982941 778052139 778007431 778428345 778747940 778274155 778747482 779043274 779177628 778823395
2277.9G78823395j70670n1956m98276O3858Q2474P16171L88489o790j86157k85187
$$ 778823395 778652725 778600769 778102493 778166351 778248825 778964996 779353485 779346695 779160538 778875351
2287.5G78875351P7820l24784P248n24673k15988L33404M30451O34460o3705M8752
$$ 778875351 778953171 778628387 778635635 778110962 777894974 778228378 778658829 779293289 779229584 779278336
2297.2G79278336l82996q0490k97241o41861Q2168n5008L5858k60314K43759N4779
$$ 779278336 778895340 778814850 778517609 777875748 777957916 777902908 777938766 777678452 777922211 777976990
2306.8G77976990M64325M40216r30863J37558k93197l94745q6441j25885J75552J78833
$$ 777976990 778441315 778881531 777950668 778088226 777795029 777400284 777313843 777187958 777363510 777542343
2316.4G77542343Q01926m55933j13525M9362p04117l42941q26111k10953m12597R460
$$ 777542343 778344269 777888336 777774811 777824173 777120056 776777115 775951004 775740051 775327454 775336914
2326.1G75336914L40881o1798k89306K6779R99298m044q35647j161499P9574P74613
$$ 775336914 775677795 775615997 775326691 775353470 776352768 776348724 775513077 774351578 774431152 775205765
2335.7G75205765l25318l94668O7596Q20847O26144M6845p84760q34579m01383q76388
$$ 775205765 774880447 774485779 774553375 775374222 776000366 776047211 775262451 774427872 774026489 773150101
2345.4G73150101o01349J66778P60498R07670N59234P2861M75311o34308m24576K07901
$$ 773150101 772548752 772715530 773476028 774383698 774942932 775015793 775491104 774856796 774432220 774640121
2355G74640121j678924L0670m24881j11389J570129n7907q61587r69773N29175o45904
$$ 774640121 772961197 772991867 772566986 772455597 774025726 773967819 773106232 772136459 772665634 772019730
2364.7G72019730j330414k83051P74765Q34809l33558L43247N6229M14352Q66470J99280
$$ 772019730 770689316 770406265 771181030 772015839 771682281 772025528 772081757 772496109 773362579 773561859
2374.3G73561859p06558p43790J97983p6523O8207J83716j58463l3951M08249K62375
$$ 773561859 772855301 772111511 772309494 772232971 772301178 772484894 772326431 772292480 772700729 772963104
2383.9G72963104l43551j31607r5902j85928m95301k32849L78266P9727J23901J34735
$$ 772963104 772619553 772487946 772392044 772206116 771710815 771477966 771856232 771935959 772059860 772194595
2393.6G72194595K13929M7378l49197n42832l60794J13144j99890k63672q6365L1662
$$ 772194595 772408524 772455902 772106705 771563873 771203079 771316223 771116333 770852661 770766296 770797958
2403.2G70797958o3018J34887O5232p58515m39453l67355k93961J40610Q621j36261
$$ 770797958 770734940 770869827 770935059 770176544 769737091 769369736 769075775 769216385 769225006 769088745
2412.9G69088745J18637K92893j87607j18332m56696k86026O7749m68063l95126n64652
$$ 769088745 769207382 769500275 769312668 769194336 768737640 768451614 768519363 768051300 767656174 767091522
2422.5G67091522p0190J12915r7046J13830o4315j66169m66537k86713k63519j94931
$$ 767091522 767021332 767134247 767037201 767151031 767086716 766920547 766454010 766167297 765903778 765708847
2432.2G65708847k92892m39225j754j44043k01035k23312O9961l69262o51246J72272
$$ 765708847 765415955 764976730 764974976 764830933 764629898 764406586 764476547 764107285 763456039 763628311
2441.8G63628311l7231l79639l52325M1809j08719p5379K42997l72239o06231o67954
$$ 763628311 763591080 763211441 762859116 762900925 762792206 762716827 762959824 762587585 761981354 761313400
2451.5G61313400l90396l65219j78223J43433J18179K31781l85132m02603l45764m87442
$$ 761313400 760923004 760557785 760379562 760522995 760641174 760872955 760487823 760085220 759739456 759252014
2461.1G59252014l99170k58331R2163j9531j13678l60337M7532J06201m46930j28784
$$ 759252014 758852844 758594513 758686676 758667145 758553467 758193130 758240662 758346863 757899933 757771149
2470.7G57771149m9973k51770m65698m32968k40402n9128l23334j01242N40085K26974
$$ 757771149 757721176 757469406 757003708 756570740 756330338 756271210 755947876 755846634 756386719 756613693
2480.4G56613693r9716o00815l00903m67758o59638J02082o13480l67050K98157J71508
$$ 756613693 756513977 755913162 755612259 755144501 754484863 754586945 753973465 753606415 753904572 754076080
2490G54076080n8136k86712J19171j05515m15802n06897j29852R6436l27683k82898
$$ 754076080 754017944 753731232 753850403 753744888 753329086 752822189 752692337 752788773 752461090 752178192
2499.7G52178192M9515K33536k04316k12097k11792o13098m49524j64413O1035J93253
$$ 752178192 752227707 752461243 752256927 752044830 751833038 751219940 750770416 750606003 750667038 750860291
2509.3G50860291J2588r4681L56446n8823n12848n9662p7667m53262o55289l29361
$$ 750860291 750872879 750778198 751134644 751075821 750562973 750503311 750425644 749972382 749317093 748987732
2519G48987732j73340M34342N69076j35574k44751n41153l12042k17133k71454k31628
$$ 748987732 748814392 749248734 749817810 749682236 749437485 748896332 748584290 748367157 748095703 747864075
2528.6G47864075l87039k89765k85721q4839j20697K72599p1183n32531k35062n47333
$$ 747864075 747477036 747187271 746901550 746816711 746696014 746968613 746897430 746364899 746129837 745582504
2538.2G45582504k98385l84446n1879J69448j49536R0943o1875J05133m73938p34863
$$ 745582504 745284119 744899673 744847794 745017242 744867706 744958649 744896774 745001907 744527969 743793106
2547.9G43793106k59781m19006m86527k79083J95923J09405j00326k95105j70746r0408
$$ 743793106 743533325 743114319 742627792 742348709 742544632 742654037 742553711 742258606 742087860 741997452
2557.5G41997452n54276m64020k40020j47171j82114k7924j50756J4419K27890l49884
$$ 741997452 741443176 740979156 740739136 740591965 740409851 740381927 740231171 740245590 740473480 740123596
2567.2G40123596n31845p02896l15781j71280n29632m75998N112N28183j57700m24347
$$ 740123596 739591751 738888855 738573074 738401794 737872162 737396164 737401276 737929459 737771759 737347412
2576.8G37347412j30234O8665k82517p95593m21219j48544o7139j87835J87454j05667
$$ 737347412 737217178 737285843 737003326 736207733 735786514 735637970 735570831 735382996 735570450 735464783
2586.5G35464783j89133k2964q42972r1248O2103l55224l73840l89786Q0261k50473
$$ 735464783 735275650 735252686 734409714 734318466 734380569 734025345 733651505 733261719 733341980 733091507
2596.1G33091507l60413k38800n4168o8970K16446P7286o40717k61536k51236J59836
$$ 733091507 732731094 732492294 732438126 732369156 732585602 732662888 732022171 731760635 731509399 731669235
2605.7G31669235q316k89383J08795l94134m51584m73862l20053l56750l10440j98441
$$ 731669235 731660919 731371536 731480331 731086197 730634613 730160751 729840698 729483948 729173508 728975067
2615.4G28975067k47803R16l26767p9575k56576l58887l13568p77664n96466o54679
$$ 728975067 728727264 728728180 728401413 728321838 728065262 727706375 727392807 726615143 726018677 725363998
2625G25363998o15310m21753L51181K94800m33960n76859p18765p5913m12597p46613
$$ 725363998 724748688 724326935 724678116 724972916 724538956 723962097 723243332 723167419 722754822 722008209
2634.7G22008209m24957k19498j55868n59616l06244n51529m41361j60980l62930l15933
$$ 722008209 721583252 721363754 721207886 720648270 720342026 719790497 719349136 719188156 718825226 718509293
2644.3G18509293m15955k99301p06482m44870j83716n57480l88489l17764j32446n31998
$$ 718509293 718093338 717794037 717087555 716642685 716458969 715901489 715513000 715195236 715062790 714530792
2654G14530792o31332j02463l00064o85959p17163k44064K1972q6059J21460j42060
$$ 714530792 713899460 713796997 713496933 712810974 712093811 711849747 711871719 711785660 711907120 711765060
2663.6G11765060p21054m51278k61307l73840o60248o33469m86679n22537N57709L41949
$$ 711765060 711044006 710592728 710331421 709957581 709297333 708663864 708177185 707654648 708212357 708554306
2673.3G08554306m75464n14526n99518l0441m73023n97458n63507p12204r0790k11181
$$ 708554306 708078842 707564316 706964798 706934357 706461334 705863876 705300369 704588165 704497375 704286194
2682.9G04286194J9073P7973k95563l06854k84500o35529q34961l86505l21274q9721
$$ 704286194 704305267 704383240 704087677 703780823 703496323 702860794 702025833 701639328 701318054 701228333
2692.5G01228333j46943m3258P6828k75116j25275n49164o59866m35104m20456m50440
$$ 701228333 701081390 701038132 701114960 700839844 700714569 700165405 699505539 699070435 698649979 698199539
2702.2F98199539l88183j6556k51923k49023l49579n94711l54386m79355p46002m68216
$$ 698199539 697811356 697794800 697542877 697293854 696944275 696349564 695995178 695515823 694769821 694301605
2711.8F94301605k31170m97513j70288J2588m7455J18180k64206n17731l81012m15573
$$ 694301605 694070435 693572922 693402634 693415222 693367767 693485947 693221741 692704010 692322998 691907425
2721.5F91907425n97992l59726l62473l12042J19782j40152o37589m76150n9281l52859
$$ 691907425 691309433 690949707 690587234 690275192 690394974 690254822 689617233 689141083 689081802 688728943
2731.1F88728943l17688l91007n87005l14942k38266J64872k38343k02179k8152l26920
$$ 688728943 688411255 688020248 687433243 687118301 686880035 687044907 686806564 686604385 686576233 686249313
2740.8F86249313q9187m81720j33744l44619n94940K14691J11465k22397n45425m48227
$$ 686249313 686160126 685678406 685544662 685200043 684605103 684819794 684931259 684708862 684163437 683715210
2750.4F83715210m28009l45535l61100o09359m32053l72009J13525J47171p553M3335
$$ 683715210 683287201 682941666 682580566 681971207 681539154 681167145 681280670 681427841 681420288 681463623
2760F81463623J0910k34146m12598j88293r39102p25556n5084N8975L19443q0643q3847
$$ 681463623 681474533 681240387 680827789 680639496 679700394 678974838 678919754 678978729 679298172 679217529 679133682
2770.7F79133682m44412l47595J70212m14963o62689o02799m91104j13602k06146o68259
$$ 679133682 678689270 678341675 678511887 678096924 677434235 676831436 676340332 676226730 676020584 675352325
2780.3F75352325r3460L25623k73895p94525q93631l01819j47858j64108j42823m38919
$$ 675352325 675258865 675584488 675310593 674516068 673622437 673320618 673172760 673008652 672865829 672426910
2789.9F72426910o30264n03006j62964n52444o03790l12958k68631n55573j261520
$$ 672426910 671796646 671293640 671130676 670578232 669974442 669661484 669392853 668837280 667575760
2798.6F67575760j136398m77601o4239m47922n05752l25394q13065n19714n52063j043472
$$ 667575760 666439362 665961761 665897522 665449600 664943848 664618454 663805389 663285675 662733612 661690140
2808.3F61690140o93283o41022p09534m03213j018296j205596m04740n88913q80203
$$ 661690140 660996857 660355835 659646301 659243088 658224792 657019196 656614456 656025543 655145340
2816.9F55145340r27887q49457p17544q40531o91681p03735q09402r01871r05380j040802
$$ 655145340 654217453 653367996 652650452 651809921 651118240 650414505 649605103 648703232 647797852 646757050
2826.6F46757050j125412r79157j034698j058350j265564j383972j074639m58641r19380
$$ 646757050 645631638 644652481 643617783 642559433 641293869 639909897 638835258 638376617 637457237
2835.3F37457237j719780j280937j128845j222954j578255j840820j927071k273445
$$ 637457237 635737457 634456520 633327675 632104721 630526466 628685646 626758575 624485130
2843F24485130k295875k272339k116013k584648k913093k716332k538261k122078j782799
$$ 624485130 622189255 619916916 617800903 615216255 612303162 609586830 607048569 604926491 603143692
2851.7F03143692j211357j137276p41730k89955m73442q3503L96766L44506n05562
$$ 603143692 601932335 600795059 600053329 599763374 599289932 599206429 599603195 599947701 599442139
2860.3E99442139p01981n66635n09415n64422j223526q84171j088295j612587j457329
$$ 599442139 598740158 598173523 597664108 597099686 595876160 594991989 593903694 592291107 590833778
2869E90833778j721115j574821j285477j276817j239777j499443k121544j753502j339988
$$ 590833778 589112663 587537842 586252365 584975548 583735771 582236328 580114784 578361282 577021294
2877.7E77021294j960183j804809j421776j438332j176071j051635j087342p50427
$$ 577021294 575061111 573256302 571834526 570396194 569220123 568168488 567081146 566330719
2885.4E66330719p36732q31299p16248q82721n15747o91795j052742p55654m37164
$$ 566330719 565593987 564762688 564046440 563163719 562647972 561956177 560903435 560147781 559710617
2894.1E59710617n3215l88870o20728p19299m35371R2353n06134j258430j109238n14793
$$ 559710617 559657402 559268532 558647804 557928505 557493134 557585487 557079353 555820923 554711685 554196892
2903.7E54196892n77507o07338j258125j356545l15323p89833j396065j915893k080002
$$ 554196892 553619385 553012047 551753922 550397377 550082054 549292221 547896156 545980263 543900261
2912.4E43900261k351112k682839k015648k444267k833672k456283j854363j807327
$$ 543900261 541549149 538866310 536850662 534406395 531572723 529116440 527262077 525454750
2920.1E25454750j860046j278344r25979j99890o01807p73659l49426j64146J93367
$$ 525454750 523594704 522316360 521390381 521190491 520588684 519815025 519465599 519301453 519494820
2928.8E19494820j02196N28068R08623J197510J165008Q86956J785202J689033J538086
$$ 519494820 519392624 519920692 520829315 522026825 523191833 524078789 525863991 527553024 529091110
2937.5E29091110J768875K313805K559319K204399K592888K429695J876335K030067
$$ 529091110 530859985 533173790 535733109 537937508 540530396 542960091 544836426 546866493
2945.2E46866493K521134K210235K005654K025222J986008K367592J912003J613426
$$ 546866493 549387627 551597862 553603516 555628738 557614746 559982338 561894341 563507767
2952.9E63507767J466942J779785K182312J648330J727982K048225K277947J912422
$$ 563507767 564974709 566754494 568936806 570585136 572313118 574361343 576639290 578551712
2960.6E78551712J834335K408371K023201J400872J222305J564636J887474J740456
$$ 578551712 580386047 582794418 584817619 586218491 587440796 589005432 590892906 592633362
2968.3E92633362J773987K009544J673927J415215J705665J655045J220284J489448
$$ 592633362 594407349 596416893 598090820 599506035 601211700 602866745 604087029 605576477
2976.1F05576477K086563J431122R09538Q35076J011505J226654R16900J396180J383857
$$ 605576477 607663040 609094162 610003700 610838776 611850281 613076935 613993835 615390015 616773872
2984.7F16773872J200943Q98018O58837J293487Q49571L26806M78591P13158J4114
$$ 616773872 617974815 618872833 619531670 620825157 621674728 622001534 622480125 623193283 623207397
2993.4F23207397J37749R87587M33540Q97789M25225n43328q4877r9563r9754o0578
$$ 623207397 623345146 624332733 624766273 625664062 626089287 625545959 625461082 625361519 625261765 625201187
3003.1F25201187j8310K55279L31421n10673l80097M19884j35117k81219l79448n18074
$$ 625201187 625182877 625438156 625769577 625258904 624878807 625298691 625163574 624882355 624502907 623984833
3012.7F23984833l76473m54445o21872m66880j80283o14166n03464k83737p47185j150970
$$ 623984833 623608360 623153915 622532043 622065163 621884880 621270714 620767250 620483513 619736328 618585358
3022.4F18585358o07605J31149n80292j370086r19838K0485q4496n64842r17092j061630
$$ 618585358 617977753 618108902 617528610 616158524 615238686 615259171 615174675 614609833 613692741 612631111
3032F12631111p46078j206513j090240m07715m72908r58595j049500j227264j160355
$$ 612631111 611885033 610678520 609588280 609180565 608707657 607749062 606699562 605472298 604311943
3040.7F04311943j17493n87082j307907j276092r60732m01611q18977j058503r97963
$$ 604311943 604194450 603607368 602299461 601023369 600062637 599661026 598842049 597783546 596785583
3049.4E96785583p44781r93881j096840q95882j418800j175003o55327o81419j561509
$$ 596785583 596040802 595046921 593950081 593054199 591635399 590460396 589805069 589123650 587562141
3058E87562141j128196m31404j246300q66738o56204o34269o21720j043510j236840
$$ 587562141 586433945 586002541 584756241 583889503 583233299 582599030 581977310 580933800 579696960
3066.7E79696960j071891p34558j412812j208992q94661p79419l36761r93576j420212
$$ 579696960 578625069 577890511 576477699 575268707 574374046 573594627 573257866 572264290 570844078
3075.4E70844078j198578p19452j013756j224555q23517j044770j203193r06639q00705
$$ 570844078 569645500 568926048 567912292 566687737 565864220 564819450 563616257 562709618 561908913
3084.1E61908913j185494r83696j436653j648292o31905m05083m15497q24775j335526
$$ 561908913 560723419 559739723 558303070 556654778 556022873 555617790 555202293 554377518 553041992
3092.7E53041992j607818r94759l34969r15107j150971j130409r11713j183204j135178
$$ 553041992 551434174 550439415 550104446 549189339 548038368 546907959 545996246 544813042 543677864
3101.4E43677864o79092q85239r04846j007195r84802j275024p05338m08935j259652
$$ 543677864 542998772 542113533 541208687 540201492 539216690 537941666 537236328 536827393 535567741
3110.1E35567741r70230j008644j399574j379356q12226o49299j118889r51653r97886
$$ 535567741 534597511 533588867 532189293 530809937 529997711 529348412 528229523 527277870 526279984
3118.8E26279984r65577q75549q81653j231041j195411p23153o54602o50482j493263
$$ 526279984 525314407 524438858 523557205 522326164 521130753 520407600 519752998 519102516 517609253
3127.5E17609253j484528r32808j010704p72132o35300q40264j129570p51419p81593
$$ 517609253 516124725 515191917 514181213 513409081 512773781 511933517 510803947 510052528 509270935
3136.1E09270935j055183j158982j445732j126480p32078p58667j379014j022071m02909
$$ 509270935 508215752 507056770 505611038 504484558 503752480 502993813 501614799 500592728 500189819
3144.8E00189819q24165p70226r96131j335869p94373n28717o61545m85687j329002
$$ 500189819 499365654 498595428 497599297 496263428 495469055 494940338 494278793 493793106 492464104
3153.5D92464104j548348o73141j226540j169815m39911l19443j241569j775971r18540
$$ 492464104 490915756 490242615 489016075 487846260 487406349 487086906 485845337 484069366 483150826
3162.2D83150826r83391p94716l92037n07125j083718j278839o07147q61778p96624
$$ 483150826 482167435 481372719 480980682 480473557 479389839 478111000 477503853 476642075 475845451
3170.9D75845451j078224j470833o73904j78261o68259j406021j023941o99196l40652
$$ 475845451 474767227 473296394 472622490 472444229 471775970 470369949 469346008 468646812 468306160
3179.5D68306160k65274q52127q00057j125412j341514j144409j163521p62253k64320
$$ 468306160 468040886 467188759 466388702 465263290 463921776 462777367 461613846 460851593 460587273
3188.2D60587273q68073j210289o79512o40678n13535o81686p38106q17947j055069
$$ 460587273 459719200 458508911 457829399 457188721 456675186 455993500 455255394 454437447 453382378
3196.9D53382378q52204q75473n91812p63245p93609l79906n61600q82530o88400n30891
$$ 453382378 452530174 451654701 451062889 450299644 449506035 449126129 448564529 447681999 446993599 446462708
3206.5D46462708r56841m03099p82623j388359m83666o15578p43255p15752p80525
$$ 446462708 445505867 445102768 444320145 442931786 442448120 441832542 441089287 440373535 439593010
3215.2D39593010o95152o06079o73829j041374q17909o72722m92477n72014n01366
$$ 439593010 438897858 438291779 437617950 436576576 435758667 435085945 434593468 434021454 433520088
3223.9D33520088k89535q17871p88498p75452p82433m20837o37054q58574l18947k19765
$$ 433520088 433230553 432412682 431624184 430848732 430066299 429645462 429008408 428149834 427830887 427611122
3233.5D27611122p79991q31451n47181l21312n70068o18248j018791j168823l81928
$$ 427611122 426831131 425999680 425452499 425131187 424561119 423942871 422924080 421755257 421373329
3242.2D21373329k22893l357n89065r29413n40504r94378p07511m90685n89828l19176
$$ 421373329 421150436 421147079 420558014 419628601 419088097 418093719 417386208 416895523 416305695 415986519
3251.9D15986519l37296p29751o13137l88488q70972o63910j55678k50015p84607p59849
$$ 415986519 415649223 414919472 414306335 413917847 413046875 412382965 412227287 411977272 411192665 410432816
3261.5D10432816l36647l59231n25932o66580k62795m95109o45027k65160l22952n34668
$$ 410432816 410096169 409736938 409211006 408544426 408281631 407786522 407141495 406876335 406553383 406018715
3271.2D06018715o24275O3324m85878r58977l79257o72455l94898l66554p05337m07830
$$ 406018715 405394440 405457764 404971886 404012909 403633652 402961197 402566299 402199745 401494408 401086578
3280.8D01086578j54571j08566k65999p35588p85790k32124o4392j89133m35867m11415
$$ 401086578 400932007 400823441 400557442 399821854 399036064 398803940 398739548 398550415 398114548 397703133
3290.4C97703133n10521m41017l39089o30760k69356l47977n46531q44193n27115J10321
$$ 397703133 397192612 396751595 396412506 395781746 395512390 395164413 394617882 393773689 393246574 393356895
3300.1C93356895m46968k90985j57394j62583m27284n60646m16183q42171l35503l70559
$$ 393356895 392909927 392618942 392461548 392298965 391871681 391311035 390894852 390052681 389717178 389346619
3309.7C89346619l27416l00064p16171m76875m62227n25666r98039m68712r2048m04282
$$ 389346619 389019203 388719139 388002968 387526093 387063866 386538200 385540161 385071449 384979401 384575119
3319.4C84575119n08118o22253j48354o32705m37355l42179n59311j36985q09555o64330
$$ 384575119 384067001 383444748 383296394 382663689 382226334 381884155 381324844 381187859 380378304 379713974
3329C79713974p24106j015930n69572k37847k65503o83021l83187m07257p90748p49665
$$ 379713974 378989868 377973938 377404366 377166519 376901016 376217995 375834808 375427551 374636803 373887138
3338.7C73887138n79605o78444m70047j19133k41699L662n87997r38721q09402p56302
$$ 373887138 373307533 372629089 372159042 372039909 371798210 371801872 371213875 370275154 369465752 368709450
3348.3C68709450l19672o28967n22118o32095o76079r6054l35846p14111p08351k21100
$$ 368709450 368389778 367760811 367238693 366606598 365930519 365834465 365498619 364784508 364076157 363855057
3357.9C63855057k83013j065521j183739n27801j25122o1226l70064j006546p51533
$$ 363855057 363572044 362506523 361322784 360794983 360669861 360608635 360238571 359232025 358480492
3366.6C58480492m61007o26411p32231m61846l14826o26679n37414m06037m67224o85654
$$ 358480492 358019485 357393074 356660843 356198997 355884171 355257492 354720078 354314041 353846817 353161163
3376.3C53161163l82042l99932p10030k21329k28004m75769o89164k74200k66533q52623
$$ 353161163 352779121 352379189 351669159 351447830 351219826 350744057 350054893 349780693 349514160 348661537
3385.9C48661537m38614k64778l44658n73959m8218J00632n73120j48201k88582n66292
$$ 348661537 348222923 347958145 347613487 347039528 346991310 347091942 346518822 346370621 346082039 345515747
3395.6C45515747j34811L00522k50779r47303p71904k87171M63905L4028o98777m28009
$$ 345515747 345380936 345681458 345430679 344483376 343711472 343424301 343888206 343922234 343223457 342795448
3405.2C42795448j38130j79863N9128K42767k26326m7111l37639q50678k50778l9825
$$ 342795448 342657318 342477455 342536583 342779350 342553024 342505913 342168274 341317596 341066818 341026993
3414.8C41026993l01781n0468K03972P5950L30315k5215k07024L08495k4071l65372
$$ 341026993 340725212 340674744 340878716 340954666 341284981 341259766 341052742 341361237 341337166 340971794
3424.5C40971794j59645K7199m17328j81809L08877K87933J40648J61781N19371o4812
$$ 340971794 340812149 340839348 340422020 340240211 340549088 340837021 340977669 341139450 341658821 341594009
3434.1C41594009N5924r041q8882L88679k11983q5830P9574M88358M98428N50766O49147
$$ 341594009 341649933 341640892 341552010 341940689 341728706 341642876 341722450 342210808 342709236 343260002 343909149
3444.7C43909149j34659J09482j052284k0752J567230M60549L98521R64432R17473
$$ 343909149 343774490 343883972 342831688 342810936 344378166 344838715 345237236 346201668 347119141
3453.4C47119141l26538k44561M26979n6762N34401Q63609N37071K62108L85971J9150
$$ 347119141 346792603 346548042 346975021 346918259 347452660 348316269 348853340 349115448 349501419 349520569
3463.1C49520569R7656Q75816O60668L21121K49405O76537M99572K19002M30718P25746
$$ 349520569 349618225 350494041 351154709 351475830 351725235 352401772 352901344 353120346 353551064 354276810
3472.7C54276810R57374L05214k3575M81682J154137P68967N44128O31065M24576L77960
$$ 354276810 355234184 355539398 355515823 355997505 357151642 357920609 358464737 359095802 359520378 359898338
3482.3C59898338l15475N68848Q55827O78177P54890K49252R21135O91948M99230Q3656
$$ 359898338 359582863 360151711 361007538 361685715 362440605 362689857 363610992 364302940 364802170 364885826
3492C64885826N6915J265221J487350P56798j19934Q43621R88121M83169P77168P46537
$$ 364885826 364942741 366207962 367695312 368452110 368332176 369175797 370163918 370647087 371424255 372170792
3501.6C72170792P31773M9896J20354M42429J012992J460343J029510k44331N0659
$$ 372170792 372902565 372952461 373072815 373515244 374528236 375988579 377018089 376773758 376824417
3510.3C76824417J991577R95751N81894P90367P42569Q27446K70080J019020L03421
$$ 376824417 378815994 379811745 380393639 381184006 381926575 382754021 383024101 384043121 384346542
3519C84346542L0136J235772J590919O19469o62079P23114J144257R50279Q81119J012878
$$ 384346542 384376678 385612450 387203369 387822838 387160759 387883873 389028130 389978409 390859528 391872406
3528.6C91872406R58366P61910P28798P54852J630554J038666J405373N25970o16073
$$ 391872406 392830772 393592682 394321480 395076332 396706886 397745552 399150925 399676895 399060822
3537.3C99060822J377639R88236P49817P32689J285209J247139J016808R36928l66898
$$ 399060822 400438461 401426697 402176514 402909203 404194412 405441551 406458359 407395287 407028389
3546D07028389J231461r9869R17129K326813J857071J600838r18084J569405J737022
$$ 407028389 408259850 408159981 409077110 411403923 413260994 414861832 413943748 415513153 417250175
3554.7D17250175J197930J388855L23181J703720P08389P24144J224556K433319J019402
$$ 417250175 418448105 419836960 420160141 421863861 422572250 423296394 424520950 426954269 427973671
3563.4D27973671j77498M437409J109275k54058l07999o89087L639221J634331J417274
$$ 427973671 427796173 432233582 433342857 433088799 432780800 432091713 435730934 437365265 438782539
3572D38782539J533242J950378J897926J243096K067451P71561K488937J735497L55110
$$ 438782539 440315781 442266159 444164085 445407181 447474632 448246193 450735130 452470627 452825737
3580.7D52825737J496658J437645J864701K047996M606362J327362k573128J395149
$$ 452825737 454322395 455760040 457624741 459672737 464279099 465606461 463033333 464428482
3588.4D64428482k52495L500061L759651L188668R66034M05578L938752r30520J609574
$$ 464428482 464175987 467676048 471435699 474624367 475590401 475995979 479934731 479004211 480613785
3597.1D80613785K887955Q41827M055481J589546O97479J877137J993408K507972K974587
$$ 480613785 483501740 484343567 488399048 489988594 490686073 492563210 494556618 497064590 500039177
3605.8E00039177K355385r39217L327599p23114J79214P915535P52525k134857K952996
$$ 500039177 502394562 501455345 504782944 504059830 504239044 512154579 512907104 510772247 513725243
3614.5E13725243p30095N165024M878196r08241R84192N8594J641998L408890K748947
$$ 513725243 512995148 518160172 523038368 522130127 523114319 523172913 524814911 528223801 530972748
3623.1E30972748K440681K816506J938400J809769O762199n52025j1788597N590515
$$ 530972748 533413429 536229935 538168335 539978104 546740303 546188278 534399681 539990196
3630.9E39990196N979424N308380K91443j758919K838707L323860K471008M26979J749802
$$ 539990196 545969620 551278000 551569443 549810524 552649231 555973091 558444099 558871078 560620880
3639.5E60620880K611008K099914O48919O95114K800674L453178O081429k353859m500542
$$ 560620880 563231888 565331802 565980721 566675835 569476509 572929687 579011116 576657257 572156715
3648.2E72156715P056160j262779l127060M80614N985145M713135M077187L732605
$$ 572156715 579212875 577950096 574823036 575303650 581288795 586001930 590079117 593811722
3655.9E93811722r434662L396225O128158J194115J094132R1591J898689J128044J731644
$$ 593811722 584377060 587773285 593901443 595095558 596189690 596281281 598179970 599308014 601039658
3664.6F01039658J577911P42645M696541J644707j434899p35473o520958M638405R057464
$$ 601039658 602617569 603360214 608056755 609701462 608266563 607531090 601010132 605648537 614706001
3673.3F14706001Q842278j903229k0219841M125290Q801079N672226j908226O2179
$$ 614706001 623548279 621645050 601425209 605550499 614351578 620023804 618115578 618177757
3681F18177757K940941J570778J791382J023636O25152M186211N732880j0458222l022690
$$ 618177757 621118698 622689476 624480858 625504494 626129646 630315857 636048737 625590515 622567825
3689.7F22567825Q208313p111664J217652O754799J208076K251511O77795m34761J247444
$$ 622567825 630776138 623664474 624882126 631636925 632845001 635096512 635774307 635339546 636586990
3698.4F36586990M81835K546348K574540n909386k143593N147438K048073M12292M85230
$$ 636586990 637068825 639615173 642189713 636280327 634136734 639284172 641332245 641744537 642229767
3707F42229767K911911L943939p900162L590699K678833j3276864N950737M871750
$$ 642229767 645141678 649085617 641185455 644776154 647454987 634178123 640128860 645000610
3714.8F45000610J054306J464005K647400J061783m028626R06067N433579m427948
$$ 645000610 646054916 647518921 650166321 651228104 647199478 648105545 653539124 649111176
3722.5F49111176l238297P054901Q57086j329345k650910K15759M372406Q62885M722137
$$ 649111176 645872879 652927780 653784866 652455521 649804611 650020370 654392776 655255661 659977798
3731.2F59977798m105911p302704R243775q02765q255386K928466K037125o60019L455353
$$ 659977798 655871887 648569183 657812958 657010193 648754807 651683273 653720398 653060379 656515732
3739.8F56515732M360733l724594K956466J1242981j3880539j6390609J2526397P257080
$$ 656515732 660876465 657151871 660108337 671351318 657470779 641080170 653606567 660863647
3747.5F60863647O276474l850555j1970673R903183n251846l902969O479187M959869
$$ 660863647 667140121 663289566 651318893 661222076 655970230 652067261 658546448 663506317
3755.3F63506317L507614n393066K733002M638290q727112k44522M942627J736908
$$ 663506317 667013931 661620865 664353867 668992157 660265045 660020523 664963150 666700058
3763F66700058L62396L181458m286042n094604M982376N561066n78614q227081K749863
$$ 666700058 667062454 670243912 665957870 660863266 665845642 671406708 670828094 662601013 665350876
3771.7F65350876L029480J14441Q52737p0648J245270L24096K802277q05435q522644
$$ 665350876 668380356 668494797 669347534 669276886 670522156 670846252 673648529 672843094 664320450
3780.3F64320450L443909K602310J456070K909240l437500j300506J587143Q04672
$$ 664320450 667764359 670366669 671822739 674731979 671294479 669993973 671581116 672385788
3788F72385788O99844K45438N19333k67792K61765n5008R76333K949601l723298l927612
$$ 672385788 673085632 673331070 673850403 673582611 673844376 673789368 674765701 677715302 673992004 670064392
3797.7F70064392K333069M358673O048737p344208j1296463M877548M506760N636825
$$ 670064392 672397461 676756134 682804871 675460663 664164200 669041748 673548508 679185333
3805.4F79185333N476914j1151581m407272N393905K064667K91901M83627O2790J707077
$$ 679185333 684662247 673510666 669103394 674497299 676561966 676853867 677337494 677400284 679107361
3814.1F79107361N370560l623124j4128952O301880O536942M809875J204376j9420242
$$ 679107361 684477921 680854797 666725845 673027725 679564667 684374542 685578918 666158676
3821.8F66158676K375107O631241K932815K899323m98352l712387Q16116J556549L295975
$$ 666158676 668533783 675165024 678097839 680997162 680498810 676786423 677602539 679159088 682455063
3830.5F82455063N84869q742294M366913P644958o387329j060943P328109r645309
$$ 682455063 683039932 674297638 678664551 686309509 679922180 678861237 686189346 676544037
3838.2F76544037l158112Q343125o302033P87888P933273k729111l994903L454742
$$ 676544037 673385925 681729050 675427017 676214905 684148178 681419067 677424164 680878906
3845.9F80878906J721115N06897K097473k107849J487427N439072p948761j563721
$$ 680878906 682600021 683106918 685204391 683096542 684583969 690023041 682074280 680510559
3853.6F80510559j5585327O056747J1952668q36869j245804K710877K944946K773209
$$ 680510559 664925232 670981979 682934647 682097778 680851974 683562851 686507797 689281006
3861.3F89281006o230850J28784O937866p935486n949249M960174O294861O512909
$$ 689281006 683050156 683178940 690116806 682181320 676232071 681192245 687487106 694000015
3869.1F94000015r391556r189834M307403O667786K872238j1015854K310715N046768
$$ 694000015 684608459 675418625 679726028 686393814 689266052 678250198 680560913 685607681
3876.8F85607681k33688K225952M888916p174377o971970P362213J170578J671143
$$ 685607681 685373993 687599945 692488861 685314484 678342514 685704727 686875305 688546448
3884.5F88546448M679184j3314133K038956M443893P25403M129639j575470r337998
$$ 688546448 693225632 679911499 681950455 686394348 687119751 691249390 689673920 680335922
3892.2F80335922J412888L668899r9334J897964J297302K942353J135406j1367416
$$ 680335922 681748810 685417709 685318375 687216339 688513641 691455994 692591400 681223984
3899.9F81223984N005569K370072n362549M096298l748474q78677R82894Q97675K615051
$$ 681223984 686229553 688599625 683237076 687333374 683584900 682706223 683689117 684586792 687201843
3908.6F87201843k0752P01828N7755k45438K43607k36664K374954K398758n195846
$$ 687201843 687181091 687882919 687940674 687695236 687938843 687702179 690077133 692475891 687280045
3917.3F87280045l367997N736924J11846m762344K615433J633148K52304k489014k352066
$$ 687280045 683912048 689648972 689760818 684998474 687613907 689247055 689499359 687010345 684658279
3926F84658279L128205J373825n8060j213531J91040K195129l980637j436309K700500
$$ 684658279 687786484 689160309 689102249 687888718 688079758 690274887 686294250 684857941 687558441
3934.6F87558441O39343P01752R8419q24814j56860J55182K293701J299362m234390
$$ 687558441 688197784 688899536 688997955 688173141 688016281 688171463 690465164 691764526 687530136
3943.3F87530136m08020J483078J138458R30100l253098K99378N25055j358109K859192
$$ 687530136 687122116 688605194 689743652 690673752 687420654 687720032 688245087 686886978 689746170
3952F89746170L09525j331940M93240O91300L03268m34723J52588n69916O23703Q81577
$$ 689746170 690055695 688723755 689216995 689908295 690211563 689776840 689929428 689359512 689983215 690864792
3961.6F90864792j287384J25580M02984p7209J62277P7515N55191p23496j235428R94263
$$ 690864792 689577408 689702988 690105972 690028763 690191040 690268555 690823746 690100250 688864822 689859085
3971.3F89859085O44608m47617K49786m425K83127L24402K44751L03497q87146n31768
$$ 689859085 690503693 690056076 690305862 690301437 690584564 690908966 691153717 691457214 690570068 690038300
3980.9F90038300N15899l57666p33795M15878J37253j08108M88281K75955J63193q30612
$$ 690038300 690554199 690196533 689462738 689878616 690015869 689907761 690396042 690671997 690835190 690004578
3990.6F90004578p97959K89459N50004L32489o29578j77078K73361L26309O06003J4419
$$ 690004578 689206619 689496078 690046082 690378571 689748993 689571915 689845276 690171585 690777588 690792007
4000.2F90792007
$$ 690792007
##END=$$ End of the data block
