##TITLE=$$ Begin of the data block
##JCAMP-DX=5.00 $$ ACD/SpecManager v 10.08
##SPECTROMETER/DATA SYSTEM=Varian
##DATE=20 Nov 2012 15:53:08
##DATA TYPE=INFRARED SPECTRUM
##DATA CLASS=XYDATA
##ORIGIN=
##OWNER=
##NPOINTS=3735
##FIRSTX=399.26403809
##LASTX=4000.35498047
##MAXX=4000.35498047
##MINX=399.26403809
##MAXY=78.13008118
##MINY=33.02423859
##XFACTOR=1.0000000000
##YFACTOR=0.000000100000000
##FIRSTY=56.78608322
##DELTAX=0.96440572
##XUNITS=1/CM
##YUNITS=TRANSMITTANCE
##XYDATA=(X++(Y..Y))
399.3E67860832j715240J157341O403694J339416q860206m550820J0141182R543648
407E81319847o56128j7704201r038124J4754601M375381o847801K475014N565796J188202
415.7E75432587l084412j593513J2710914J0311890n250282q281785j0478210k070923
423.4E67696266J334686J60141P34864m922791l126793N233650K591591o791725m241447
432.1E58668442l29056J38321L212166L496551n37605l075600k097015k288170M15688
440.7E57603722M547004J642342n856857k788201N495148Q912353N512467j283188
448.4E73784790J818733N54009l794365j169815n320664l756942L454856M404984L668861
457.1E73644447O414757q19702m703178l875123k350082j244659m627648k485885M062767
$$ y = [567860832, 566145592, 567302933, 573706627, 575046043, 566185837, 561635017, 571776199, 581319847, 580663719, 562959518, 553921394, 568675995, 573051376, 566203575, 568678589, 574244385, 575432587, 572348175, 570754662, 583465576, 593777466, 588527184, 580245399, 569767189, 567696266, 569030952, 569191093, 569925957, 565003166, 561876373, 567110023, 569701614, 562909889, 558668442, 558339386, 558477707, 561689873, 565186424, 564648819, 561573219, 559476204, 557188034, 557603722, 562150726, 563793068, 557936211, 555148010, 560643158, 569555511, 575067978, 573784790, 575603523, 576157532, 572363167, 571193352, 565872688, 562115746, 565570602, 569975586, 573644447, 580059204, 579239502, 574536324, 570661201, 568311119, 567066460, 562438812, 559952927, 564015694]
465.8E64015694J180343n7029k606698j725273J148873q45642k017022n703620m374009
474.5E49015617j623878m27475j27258K303276L573723K879409K248001N70603l445931
483.2E54966087n730896j13029k40173k322846j783333K868881N886994R95445K530823
491.8E57057953j635399k971535j725425n199204l159294l558655K859001O263848
499.6E47931290L155365K424087j056137k247047m884491n589600m397735j905785
507.3E33429947P36389j361542l18641J119690K003822j507530l143883k648392k083473
516E26226387j981659l564949o48575k647781j208611K888222M193153L26271l175621
524.6E20406837r69581k860451j101723l061866j923638K600174Q72841L025627J062508
$$ y = [564015694, 565196037, 565139008, 562532310, 560807037, 561955910, 561110268, 559093246, 553389626, 549015617, 547391739, 546964264, 546837006, 549140282, 552714005, 555593414, 557841415, 558412018, 554966087, 549235191, 549122162, 548881989, 546559143, 544775810, 547644691, 553531685, 554527130, 557057953, 555422554, 552451019, 550725594, 545526390, 542367096, 538808441, 541667442, 547931290, 551086655, 553510742, 552454605, 550207558, 545323067, 539733467, 535335732, 533429947, 534166336, 532804794, 532486153, 533605843, 535609665, 534102135, 530958252, 528309860, 526226387, 524244728, 520679779, 520031204, 517383423, 516174812, 519063034, 523256187, 523582458, 520406837, 519437256, 516576805, 515475082, 512413216, 510489578, 513089752, 513962593, 516988220, 518050728]
533.3E18050728O55670J920891K27394k15111J27106J409950j20125J314888L513298
542E26884689M053879L095818J439094M17481k438698j021042M79393j305084k450142
550.7E29155388q09212J788139K093125M66270k325859k106018j318054j078949l160477
559.4E22704353l591079l57056j518478k21329k50015j843911k591362l428611k184067
568E06718445l177834j404800j868935k404213k618065j530761J878700J058693J155166
576.7D97806396j128768J557617K559890Q90465L237191J891212K994461K369728K216759
585.4E14394951K612610K630806K955322j2169P7438J551972J927109K89421M83551
594.1E26911011P25j271477J313247J174889o2714j340370p8087J725426k89383q43735
$$ y = [518050728, 518706398, 520627289, 520854683, 520639572, 520766678, 522176628, 522056503, 523371391, 526884689, 530938568, 534034386, 535473480, 535890961, 533452263, 532431221, 532910614, 531605530, 529155388, 528346176, 530134315, 532227440, 532693710, 530367851, 528261833, 526943779, 525864830, 522704353, 519113274, 518756218, 517237740, 517016411, 516766396, 514922485, 512331123, 508902512, 506718445, 503540611, 502135811, 500266876, 497862663, 495244598, 493713837, 495592537, 496651230, 497806396, 496677628, 498235245, 500795135, 501685600, 504922791, 506814003, 509808464, 512178192, 514394951, 517007561, 519638367, 522593689, 522581520, 522658958, 524210930, 526138039, 526427460, 526911011, 526911736, 525640259, 526953506, 528128395, 528065681, 526725311, 526647224, 528372650, 528083267, 527239532]
603.7E27239532J98441J043510J79673J31149q02193j546287r32999j033745J432953
612.4E25910034K687836K300110L99132j60409J325493J416092J719361J98593o63262
621.1E35132980P12548K919540K642746Q57620J709862L393517L208122K02560l36990
629.8E50442505j35384M80080J276703p16629l37258J372910L962364K956085m40330
638.4E58861046N70450R83123k61459j379471j124229J21536R69162K082253J649208
647.1E62471619J137848J297035J698951J242829k89726l16735l16772j506729j404839
655.8E64013481R74121L005677J895599J031799J831284K3803j430015p82814o06575
664.5E69956360l29666Q79860J37405l121223N651016K528152O3134Q11157O27022
$$ y = [527239532, 527437973, 528481483, 528661156, 528792305, 527990112, 526443825, 525510826, 524477081, 525910034, 528597870, 530897980, 531297112, 531136703, 532462196, 533878288, 535597649, 535796242, 535132980, 535845528, 538765068, 541407814, 542265434, 543975296, 547368813, 550576935, 550779495, 550442505, 550307121, 550787201, 552063904, 551347275, 551010017, 552382927, 556345291, 559301376, 558861046, 559431496, 560414619, 560153160, 558773689, 557649460, 557770996, 558740158, 560822411, 562471619, 563609467, 564906502, 566605453, 567848282, 567558556, 567241821, 566925049, 565418320, 564013481, 564987602, 567993279, 569888878, 570920677, 572751961, 572775764, 571345749, 570562935, 569956360, 569626694, 570506554, 570643959, 567522736, 573173752, 575701904, 575765038, 576576195, 577203217]
673.2E77203217K92320j230965o08063J552010N73463O96755K160034L120651K152062
681.8E85911484J068191N72319j18713j173897k157516r11942m92821P82128K893257
690.5E86372490K041931Q0299o11076k39906j384468k324333k581711j744805q07418
699.2E78801003r74656O50902J404953J054688p21703j894340j378365j872673j364327
707.9E73705482j131324j2932N40810J058235L436470L309097J547089L27491J028748
716.6E83809166J5678r72595J470642K649002K921791K129174K138023L565979L950310
725.2F01677170L016166O16494R9258P33261K18926J025696K020034K032852L271180
733.9F14711037L471832P64084K41852J836815R17472o49414m16603j66168n79186
$$ y = [577203217, 577495537, 576264572, 575656509, 577208519, 577781982, 578478737, 580638771, 583759422, 585911484, 586979675, 587551994, 587433281, 586259384, 584101868, 583189926, 582697105, 583479233, 586372490, 588414421, 588494720, 587883644, 587643738, 586259270, 583934937, 581353226, 579608421, 578801003, 577826347, 578477249, 579882202, 580936890, 580215187, 578320847, 576942482, 575069809, 573705482, 572574158, 572561226, 573102036, 574160271, 577596741, 580905838, 582452927, 582780418, 583809166, 583824844, 582852249, 584322891, 586971893, 589893684, 592022858, 594160881, 597726860, 601677170, 604693336, 605309830, 605409088, 606142349, 606361275, 607386971, 609407005, 611439857, 614711037, 618182869, 618946953, 619188805, 621025620, 621943092, 621293678, 620877075, 620710907, 620131721]
742.6F20131721M57345J003761O74133J346169N76706r78508l354950l623200k059479
751.3F14173698l727455j603470J153412j138611r71107O95381P74574j189384m157333
760F04009705l478165j380577p17850n60760m47045N42374J075172J637535J726227
768.6F02406616Q48541J298295J710891J838761K232628J855049K459335L796997M385147
777.3F22832260L919869K411422K232590J908150R18655J759606L060569K420731J676559
786F43140411K702485L028030J786804M96292J763993J897048L18299M17862r4223
794.7F55457001J681747K791290J071015J055298K444381K448960N58166O38428Q08563
803.4F68954849N13382L44696M88205J615219J788636J553726O92444O55822m54788
$$ y = [620131721, 620589066, 621592827, 622266960, 623613129, 624189835, 623211327, 619856377, 616233177, 614173698, 610446243, 608842773, 609996185, 608857574, 607886467, 608581848, 609356422, 608167038, 604009705, 600531540, 599150963, 598433113, 597872353, 597425308, 597967682, 599042854, 600680389, 602406616, 603255157, 604553452, 606264343, 608103104, 610335732, 612190781, 614650116, 618447113, 622832260, 626752129, 629163551, 631396141, 633304291, 634222946, 635982552, 639043121, 641463852, 643140411, 645842896, 648870926, 650657730, 651154022, 652918015, 654815063, 655133362, 655551224, 655457001, 657138748, 659930038, 661001053, 662056351, 664500732, 666949692, 667507858, 668146286, 668954849, 669468231, 669812927, 670301132, 671916351, 673704987, 675258713, 675951157, 676606979, 676152191]
812F76152191q65021l06625j068649p8278m41589P9880J528854J362152Q49152j84098
821.7F77027969n17501p21665M6997r73511j814117m15955K22702M43268j7013l59574
831.3F72921600j832657k180786k117309l006821k309723k132644j449967r65576p62177
840F56163940N57785M91486j024475k391968k155685j708069k202149k121276j324387
848.7F44285202r77325n53360j2131Q6441m58527j709823k115097k475052l061791
857.4F33008537k804718k073135j315270o6490J712914K365494L000526L537712K315559
866F39681129J758156J797257K186355L196259M223328M739151M949646M747772K728882
874.7F70007935J382370N52139N41839O35148J88980m66843j332092O4392N37643k55813
$$ y = [676152191, 675287170, 674980545, 673911896, 673833618, 673392029, 673471909, 675000763, 676362915, 677212067, 677027969, 676510468, 675788803, 675835800, 674862289, 673048172, 672632217, 672854919, 673298187, 673281174, 672921600, 671088943, 668908157, 666790848, 663784027, 661474304, 659341660, 657891693, 656926117, 656163940, 656721725, 657213211, 656188736, 653796768, 651641083, 649933014, 647730865, 645609589, 644285202, 643307877, 642754517, 642742386, 642828827, 642370300, 640660477, 638545380, 636070328, 633008537, 630203819, 628130684, 626815414, 626748924, 628461838, 630827332, 633827858, 637365570, 639681129, 641439285, 643236542, 645422897, 648619156, 652842484, 657581635, 662531281, 667279053, 670007935, 671390305, 671942444, 672484283, 673119431, 673308411, 672841568, 671509476, 671573868, 672111511, 671855698]
884.4F71855698j214600k122116k461548k740555k950058l361435k329254j480865
892.1F53195267j164170j145706m82483k60238j871338j724396k222366k450638k167359
900.8F39706573k141723p64656j274643r34868n30968j757583j622086k290459l797645
909.4F24591942m391480m018440l611679l033218k524567l260956l403168l060989
917.2E97287445k668190k593384l873787l346519k414322k313919j297150n84678m61731
925.8E77733765q71964m56428K99034K83355k77748k46772K81906M96864Q91304J150131
935.5E79283447J922570J517181J118774J746025J792031J561699J95388K93274J522637
944.2E90953026Q69446l32337l71170r75799l385506l827057l373566m212036n015449
$$ y = [671855698, 670641098, 668518982, 666057434, 663316879, 660366821, 657005386, 654676132, 653195267, 652031097, 650885391, 650402908, 650142670, 648271332, 646546936, 644324570, 641873932, 639706573, 637564850, 636800194, 635525551, 634590683, 634059715, 632302132, 630680046, 628389587, 624591942, 620200462, 616182022, 612570343, 609537125, 607012558, 603751602, 600348434, 597287445, 594619255, 592025871, 588152084, 584805565, 582391243, 580077324, 578780174, 578195496, 577733765, 576861801, 576405373, 576704407, 576987762, 576710014, 576463242, 576745148, 577242012, 578133316, 579283447, 581206017, 582723198, 583841972, 585587997, 587380028, 588941727, 589137115, 589430389, 590953026, 591822472, 591490135, 591118965, 590143166, 586757660, 582930603, 579557037, 575345001, 570329552]
952.8E70329552n668793n179100n166664n227242n177078m968452m903336o023560
960.6E28015327o422462o519852o377830p273102o886673o383743o860962o653900
968.3D74636803p670174p139549p548027p500344p797279q034134p269783q512154
976D13165359p444152p887612p224960o565781o152382n219650o462402n307770n074005
984.7C55826645l206596l449059l924294k499618j698914j95732r90944p6370j606522
993.3C38178596j294898l27912j85318J020966l48053P16400l65944O77147P23305
1002C38794289J15242Q09288j088600O1264r09691j80512j133232j186676L77617j314507
1011.7C34344482M8333j035042m76036r55887r77554K75802k80990J09443q10165Q82339
$$ y = [570329552, 564660759, 559481659, 554314995, 549087753, 543910675, 538942223, 534038887, 528015327, 521592865, 515073013, 508695183, 501422081, 494535408, 488151665, 481290703, 474636803, 466966629, 459827080, 452279053, 444778709, 436981430, 428947296, 421677513, 413165359, 405721207, 397833595, 390608635, 384042854, 377890472, 372670822, 366208420, 360900650, 355826645, 352620049, 349170990, 345246696, 342747078, 341048164, 340852432, 339861488, 339785118, 338178596, 336883698, 336555786, 336370468, 337391434, 337043381, 337759781, 337393837, 338070984, 338794289, 338909531, 339718819, 338630219, 338691483, 337781792, 337601280, 336468048, 335281372, 335658989, 334344482, 334392815, 333357773, 332881737, 331925850, 330948296, 331224098, 330943108, 331052551, 330242386, 331124725]
1021.3C31124725J5335J626549K118530Q75016K255363K12784R54819P24106J810646
1030C41717873J303825P80983K148361O26450J499099P14455J594582M96444l32756
1038.7C50549316K01188m80767M11835q13713J741829J350822L23334L68805N59425
1047.4C54212074K000733L6125P65457J84479J421432J436730J385536K993050K406654
1056C66842270L654365K169114L497619K538605K725792M717674L324394M349671L438186
1064.7C97257690M066544K994270K599907J442261j523857j925545l741722l897667
1072.4C97271881n727577m522934l822861l987007j926765j391907J432724l84102
1080.1C76941452O332J45455N31998J972122J279297K379188j52626K219277L460769
$$ y = [331124725, 331140060, 332766609, 334885139, 335760155, 338015518, 338228302, 339183121, 339907227, 341717873, 343021698, 343802681, 345951042, 346577492, 348076591, 348791046, 350385628, 350882072, 350549316, 350750504, 350269737, 350681572, 349867859, 351609688, 352960510, 353283844, 353652649, 354212074, 356212807, 356248932, 357014389, 357198868, 358620300, 360057030, 361442566, 364435616, 366842270, 370496635, 372665749, 376163368, 378701973, 381427765, 386145439, 389469833, 393819504, 397257690, 401324234, 404318504, 406918411, 408360672, 406836815, 404911270, 401169548, 397271881, 391544304, 387021370, 383198509, 379211502, 377284737, 375892830, 377325554, 376941452, 376947784, 377093239, 377625237, 379597359, 380876656, 383255844, 383103218, 385322495, 388783264]
1088.8C88783264K997780L289261J764641K174110K060509L654709J631317J210480
1096.5D07566071J774520J692276J826363K30904J953010L55873n41877j40915J085319
1105.2D15801544Q57582l70369J342812J14479K612381K264099J524124K220688J214943
1113.9D27582283K977486J760368K396393K025375J724930J406746Q15468J654014
1121.6D42343063L04528K142143J184959P55959J359978R43374K061806K003250L330956
1130.3D56430016J802520J465454K267456K394104J959153q9073m98543j487656o27289
1139D63616142j421013k336998k212257l488998l042183l493500k789688l130226k826691
1147.6D38874588k639160k806511j836548k716598j769333k013436r02328l93524l02964
$$ y = [388783264, 391781044, 395070305, 396834946, 399009056, 401069565, 404724274, 406355591, 407566071, 409340591, 411032867, 412859230, 413090134, 415043144, 415399017, 414857140, 414716225, 415801544, 416659126, 416288757, 417631569, 417746048, 420358429, 422622528, 424146652, 426367340, 427582283, 430559769, 432320137, 434716530, 436741905, 438466835, 439873581, 440689049, 442343063, 442647591, 444789734, 445974693, 446730652, 448090630, 449034004, 451095810, 453099060, 456430016, 458232536, 459697990, 461965446, 464359550, 466318703, 466229630, 465731087, 464243431, 463616142, 462195129, 459858131, 457645874, 454156876, 451114693, 447621193, 444831505, 441701279, 438874588, 436235428, 433428917, 431592369, 428875771, 427106438, 425093002, 424190674, 423797150, 423494186]
1156.3D23494186j70097m60052J543426K55585R77287P98264J175117K424584K601394
1165D32639694M628144L291740L685989M100151M865876N105438N019569N899544M383011
1173.7D73619156N306396N592499N645256N025330M374580N689621N730591N004578
1181.4E15988007M274330N369148N088997M378853M217376L321000L633422L084679
1189.1E49355812K341652K475128K149201J370201J283149J327858R84879P19757J38664
1197.8E62146301j4000r5062L65830Q95156O59256M59443N8708N69915J038933J005745
1207.4E67090225J023483J187439J379433J163750J112137J021652J620483J673012
1215.1E77271614J195679J312217J292916J270752R56192N91392Q5526P3662L53851
$$ y = [423494186, 423324089, 422864037, 424407463, 424663048, 425640335, 426438599, 427613716, 430038300, 432639694, 437267838, 440559578, 444245567, 448345718, 453211594, 458317032, 463336601, 469236145, 473619156, 478925552, 484518051, 490163307, 495188637, 499563217, 505252838, 510983429, 515988007, 520262337, 525631485, 530720482, 535099335, 539316711, 542637711, 546271133, 549355812, 551697464, 554172592, 556321793, 557691994, 558975143, 560303001, 561287880, 562007637, 562146301, 562132301, 562037239, 562403069, 563298225, 563957481, 564416924, 564475632, 565045547, 566084480, 567090225, 568113708, 569301147, 570680580, 571844330, 572956467, 573978119, 575598602, 577271614, 578467293, 579779510, 581072426, 582343178, 583299370, 583890762, 583976288, 584049950, 584403801]
1223.8E84403801l40309q43277p80716l35274J25160l18184q76579j044845p90863
1232.5E79198914l58200q57354j444282q72994q31680q84933O4849K91405k15149n15785
1242.2E73574791k19688k61574j42975K24075n7297L52402J081925J184616Q71048
1250.8E76607323J049957P08313L09105N43709J66206M64592N83191L42369M26979
1259.5E81201744r270K39487Q08334O30494M07104N98297L09143K6551N17234J101647
1269.2E85830765J350097R93386O04973Q55598J541786J204376J99051J88523L79219
1277.8E93147774n6191n8479m8142m28810l08761p0153J95160O7292M5662M82826K25181
1288.4E93193359j76506m48990o66656n27382l07960l91541l8300j04675q78296m39682
$$ y = [584403801, 584063492, 583220215, 582439499, 582104225, 582229385, 581911201, 581034622, 579989777, 579198914, 578840714, 577983360, 576539078, 575666084, 574834404, 573949471, 574014320, 574305725, 574090576, 573574791, 573355103, 573093529, 572950554, 573174629, 573117332, 573469734, 574551659, 575736275, 576607323, 577657280, 578365593, 578674698, 579218407, 579384613, 579849205, 580432396, 580774765, 581201744, 581192474, 581431961, 582240295, 582870789, 583277893, 583876190, 584185333, 584211884, 584729118, 585830765, 587180862, 588174248, 588779221, 589634819, 591176605, 592380981, 592580032, 592768555, 593147774, 593091583, 593033104, 592984962, 592556152, 592247391, 592177238, 592372398, 592439690, 592485352, 592968178, 593193359, 593016853, 592567863, 591901207, 591373825, 591065865, 590674324, 590636024, 590531349, 589653053, 589213371]
1298.1E89213371l78875o39649o05965j052970r80454q11996p41959p63855q91113
1306.8E82346535n98374l43246n66254r88998p38449l71056p19414r84039p91359n04150
1316.4E75741196l92838j79977l90015k32124L70025m13398r66950j017647j307296
1325.1E71210976j595612k030830j483994j331291j679382j518135j397400j175003
1332.8E58999329j345635j364288j508484j768532j510544n87959k45399o02303M12598
1341.5E50478783O83021O12526K38381K17475K13509K13051p2937q06618k76604O8245
1351.1E51568832L73841K16675q6976k05917m00505k73399j063576q28285o38390j312675
1360.8E47349625j122475n19943m44832m07105Q3390n89218j30234p05567j383781
$$ y = [589213371, 588834496, 588194847, 587588882, 586535912, 585555458, 584743462, 584001503, 583237648, 582346535, 581748161, 581404915, 580838661, 579849663, 579111214, 578740158, 578020744, 577036705, 576245346, 575741196, 575348358, 575168381, 574778366, 574546242, 574916267, 574502869, 573535919, 572518272, 571210976, 569615364, 567584534, 566100540, 564769249, 563089867, 561571732, 560174332, 558999329, 557653694, 556289406, 554780922, 553012390, 551501846, 550913887, 550668488, 550066185, 550478783, 551161804, 551774330, 552012711, 552230186, 552443695, 552656746, 552583809, 551777191, 551500587, 551568832, 551942673, 552159348, 552072372, 551866455, 551465950, 551192551, 550128975, 549300690, 548662300, 547349625, 546227150, 545707207, 545262375, 544855270, 544938660, 544349442, 544219208, 543513641, 542129860]
1369.4E42129860L12843j60103J25962j67504n17578O06919J387481J488152K73781
1378.1E45479813O45599L88374M34952L23067K26936R48258J033210K282448K099495
1386.8E53862152J848946J837005J900635J555634Q95233Q42628J75972j329002j276894
1395.5E60312309J913452J204453o0616j182060m36020R55544q00781r92585p20291
1404.2E60193405j355438m50173k81181m44221q21190l27187l77960l81088r88083
1412.8E54766884j000977o10428j019516n16700j000977n29671k820625Q85697K430725
1421.5E50584412M30565P0075k022857N51987J269836l26119N58053j29891n4207J93024
1431.2E51124878J318321J143418M25643J343995P78045j512222n46951K287750J202049
$$ y = [542129860, 542442703, 542282600, 542408562, 542241058, 541723480, 542330399, 543717880, 545206032, 545479813, 546125412, 546513786, 546948738, 547271805, 547498741, 548446999, 549480209, 551762657, 553862152, 555711098, 557548103, 559448738, 561004372, 561899605, 562742233, 562918205, 561589203, 560312309, 562225761, 563430214, 563369598, 562187538, 561751518, 562707062, 561906281, 560913696, 560193405, 558837967, 558387794, 558106613, 557662392, 556841202, 556514015, 556136055, 555754967, 554766884, 553765907, 553155479, 552135963, 551619263, 550618286, 550088615, 547267990, 548153687, 550584412, 551014977, 551085052, 549062195, 549614182, 550884018, 550557899, 551115952, 550986061, 550931854, 551124878, 552443199, 553586617, 554012260, 555356255, 556134300, 554622078, 554075127, 556362877, 557564926]
1439.8E57564926O44188Q02345L04108J181946M57458Q96874K43606o44912j743393
1448.5E59707146r690J065483o64100n42450r82819P14112L09295j078529k888107
1457.2E55630341l061791L442459k09236K103920N89829N82122K032051j399421K832565
1465.9E62542839K074699L035202J975136K580757M251900L770142N349045O13632
1473.6E86193352N601501L961716L353043L390655L770065M320946K672958L570061
1481.3F16834297K142945L111572K466087K278633L002548N48287K512016J841660
1489F34738045P11326L17040L847618L596497J380996K095108N79682j175537J922149
1497.7F48012924J169815l51562K177505J922684J37253J759109J994858L287735j817627
$$ y = [557564926, 558209114, 559011459, 559315567, 560497513, 560954971, 561851845, 562095451, 561450539, 559707146, 559697456, 560762939, 560098839, 559556389, 558573570, 559287682, 559596977, 558518448, 555630341, 552568550, 556011009, 555801773, 557905693, 558495522, 559077644, 561109695, 559710274, 562542839, 564617538, 567652740, 569627876, 572208633, 576460533, 580230675, 585579720, 586193352, 591794853, 595756569, 599109612, 602500267, 606270332, 610591278, 613264236, 616834297, 618977242, 622088814, 624554901, 626833534, 629836082, 630384369, 632896385, 634738045, 635449371, 635766411, 639614029, 643210526, 644591522, 646686630, 647266312, 646090775, 648012924, 649182739, 648831177, 651008682, 652931366, 653068619, 654827728, 656822586, 660110321, 658292694]
1506.4F58292694o886215J108246J301880L377914J972427J170502o26984J947480
1514.1F61657944K020340P65915K22854l972397M433976K514724l091507j835098R87015
1522.8F63703766M495087J952209m25949K72446J941223L98864Q93937J887054j56250
1531.5F74962387O41708j877365j840667K796402J655960J798935J570663k132568
1539.2F77575455p701340M351044j101456r96780L749160M15345j71433K145920J849213
1547.9F80115128J183395o0501j509628J086578J127472n68237l578186j374L564987
1556.5F81359634J305771q186569j961288J294708M947357K325134P67060q74863l056488
1565.2F77920456j81274R59548M78287q40149m857712J526871J988068q4381q41294
$$ y = [658292694, 651406479, 652514725, 653816605, 657194519, 659166946, 660337448, 659710464, 661657944, 663678284, 664444199, 664667053, 660694656, 665128632, 667643356, 664551849, 662716751, 663703766, 668198853, 670151062, 669725113, 669997559, 671938782, 672337646, 673231583, 675118637, 674962387, 675604095, 673726730, 671886063, 674682465, 676338425, 678137360, 679708023, 677575455, 669874115, 674225159, 673123703, 672126923, 675876083, 676291428, 676119995, 678265915, 680115128, 681298523, 681238022, 679728394, 680814972, 681942444, 681374207, 677796021, 677794647, 681359634, 682665405, 674478836, 672517548, 673812256, 678759613, 681084747, 681851807, 680976944, 677920456, 677739182, 678698730, 679177017, 678336868, 673479156, 675006027, 676994095, 676909714, 676068420]
1573.9F76068420j66854j765137r166794J113205J412201K61078k57874j132278q20770
1582.6F65545197j416016j435013k165146k187271k141952k453232j425858j893158
1590.3F50427551j121978j829224j428681j457672k410431k119751l307609j917763
1598F34834442k629051k608185k506256j904297p74879k033997j525917k339973k002488
1606.7F16509399l137588k358170k230415k860718r46998k292786q86459j625519l78304
1615.4E99792442r74273q808022J166611l42941n42946j656685j94969j410027m316978
1624E82712212R96818L5210P34443k639999j508064L62015r54400p63282q88062J138230
1633.7E79225121O51626m079208k086640K057228J706849J361351J177711m66843P90062
$$ y = [676068420, 675901566, 674136429, 664969635, 666082840, 667495041, 667756119, 667498245, 666365967, 665545197, 664129181, 662694168, 660529022, 658341751, 656199799, 653746567, 652320709, 650427551, 649305573, 647476349, 646047668, 644589996, 642179565, 640059814, 636752205, 634834442, 632205391, 629597206, 627090950, 625186653, 624411774, 622377777, 620851860, 618511887, 616509399, 613371811, 611013641, 608783226, 605922508, 604975510, 602682724, 601796265, 600170746, 599792442, 598818169, 590010147, 591176758, 590833817, 590290871, 588634186, 588439217, 587029190, 582712212, 583709030, 583744240, 584478683, 581838684, 580330620, 580692635, 579738235, 578974953, 578086891, 579225121, 579876747, 575797539, 573710899, 575768127, 577474976, 578836327, 580014038, 579547195, 580337257]
1642.4E80337257l74374J223221J906090m89540J059608n28221K737427K515983L415985
1651E91803436L691674j365471r027825M955178N383491L314018K829819K078247K180634
1659.7F05843201J897735K152214Q66585k23160L404694K770424K494888K463112K652817
1668.4F24322510p5188J150322L866653J988183L194084L073692K00157m07829L730965
1677.1F41043549L870544K676392J431503M15192L777923M327316P70493o541138M312287
1685.8F56084061N527572K834626R07974J848373J764298K218628K123184J467590
1693.5F74776306K813645R11789p351609L796463M633408M980774L54309q651734M909897
1702.1F81173248L807679J318054j106339l63159j474228J260376K275009O43692r0027
$$ y = [580337257, 579962883, 581186104, 583092194, 582602654, 583662262, 583134041, 585871468, 588387451, 591803436, 595495110, 594129639, 585101814, 590056992, 595440483, 598754501, 601584320, 603662567, 605843201, 607740936, 609893150, 610759735, 610536575, 613941269, 616711693, 619206581, 621669693, 624322510, 624247322, 625397644, 629264297, 631252480, 634446564, 637520256, 637720413, 637312584, 641043549, 644914093, 647590485, 649021988, 649437180, 653215103, 657542419, 658312912, 651771774, 656084061, 661611633, 664446259, 665354233, 667202606, 668966904, 671185532, 673308716, 674776306, 677589951, 678501740, 671150131, 674946594, 679580002, 684560776, 684915085, 676263351, 681173248, 684980927, 686298981, 685192642, 684829483, 683355255, 684615631, 686890640, 687534332, 687444305]
1710.8F87444305L81089Q44879L90472j680603q48007K671814k70157p195434M022216
1719.5F85760574L481598J760407J025467J38397m36936M38462L01132m99954L26233
1728.2F92295380R68246j128387q15583K363434K613526k126084n500946L053894K960205
1736.9F94683685O53153J107864n53970k062302K889633K149964J75705J410751K625961
1745.5G03080444J583710K00272K56118K26059L105240J013108R75723M528351L015442
1754.2G17984467K683181K447510q6822J568756K462921J769943J547546j372299J142807
1762.9G30148010L814087K092896J427536K125396J820069j939545O70242K136536
1770.6G42295227j397476j769486N12696M201736K027435l96423K566681Q83713P12738
$$ y = [687444305, 687825394, 688670273, 689060745, 687380142, 686532135, 689203949, 688933792, 681738358, 685760574, 689242172, 691002579, 692028046, 692166443, 691729507, 692167969, 692469101, 691969147, 692295380, 693263626, 692135239, 691319656, 693683090, 696296616, 694170532, 688669586, 691723480, 694683685, 695336838, 696444702, 695890732, 693828430, 696718063, 698868027, 699043732, 700454483, 703080444, 704664154, 704864426, 705120544, 705346603, 708451843, 709464951, 710440674, 714969025, 717984467, 720667648, 723115158, 723028336, 724597092, 727060013, 728829956, 730377502, 729005203, 730148010, 733962097, 736054993, 737482529, 739607925, 741427994, 739488449, 740158691, 742295227, 740897751, 739128265, 739640961, 743842697, 745870132, 745473709, 748040390, 748924103, 749636841]
1779.3G49636841K87933q89587P78503O49185P33109l29056Q05206K023774J361770
1788G55057678R70154R75266j61133j130600k641144j23673L082428Q97370k36206
1796.7G56690140K101059K361984K83127j106720J296234m51126l16239O09971j29853
1805.3G61338577P03583N00259O40259J403122J468887o86798j2817P33719k71149
1814G65817642K24838l36608K46353j6785O26984J294250M26560J109771k22625N05447
1823.7G69675827O37741l227997j82800J772003J234741r00268k210388K220001K482910
1832.3G71501770M33273q1710L2272o0883q01925r11332P37534K95486O78788O93588
1842G72516861R46426R1324m835663J408692J974563k03552n79452K62069N19181K39944
$$ y = [749636841, 749924774, 749035187, 749813690, 750462875, 751195984, 750866928, 751672134, 753695908, 755057678, 756027832, 757003098, 756841965, 755711365, 753070221, 752946548, 756028976, 756926346, 756690140, 758791199, 761153183, 761436310, 760329590, 761625824, 761174698, 760858459, 761468430, 761338577, 762042160, 762542419, 763182678, 764585800, 766054687, 765367889, 765355072, 766088791, 765817642, 766042480, 765705872, 765952225, 765935440, 766562424, 767856674, 768283234, 769393005, 769170380, 769675827, 770313568, 767085571, 766902771, 768674774, 769909515, 769009247, 766798859, 769018860, 771501770, 771935043, 771853333, 771885605, 771824722, 771022797, 770111465, 770848999, 771144485, 771823273, 772516861, 773463287, 773554611, 768718948, 770127640, 772102203, 771898651, 771319199, 771581268, 772100449, 772340393]
1851.6G72340393R17740L20740N18341K899k51465J59683o65817o2866k94495J08032
1861.3G73093185M90418P53250L89099k60391N20935o65741p21512j765060j309052
1869.9G70525131J416779J494140J156006K91443N69306J84936j83792j50299K5635
1878.6G75329285r8725p25403K02866J49155N93261K65580O1874Q24966J02463O49262
1888.3G77354584n35507k055665J39618P24488J21765L39203J11999n13229J105194
1896.9G76792450N73730j10015j34812n10101l0670j41220J99966k58560J32904Q84933
1906.6G77398605N39475J28631o61239j099472n61829N15518j37252n6000n8899M99420
1916.2G76506958J688232j565704m91562J126251q0947k74353j286240m730J074981
$$ y = [772340393, 773258133, 773578873, 774097214, 774100113, 773848648, 774008331, 773342514, 773279648, 772985153, 773093185, 773583603, 774336853, 774725952, 774465561, 774986496, 774320755, 773599243, 771834183, 770525131, 771941910, 773436050, 774592056, 774883499, 775452805, 775637741, 775453949, 775303650, 775329285, 775230560, 774505157, 774708023, 774857178, 775450439, 775716019, 775777893, 776602859, 776705322, 777354584, 776819077, 774763412, 774903030, 775627518, 775749283, 776088486, 776200485, 775687256, 776792450, 777366180, 777256165, 777121353, 776611252, 776580582, 776439362, 776639328, 776380768, 776513672, 777398605, 777938080, 778066711, 777405472, 776306000, 775744171, 776259689, 776122437, 776066437, 776007538, 776506958, 778195190, 776629486, 776137924, 777264175, 777183228, 776908875, 775622635, 775617905, 776692886]
1924.9G76692886M83704r8572M39606M46091k4109j87302l87497J30692p87201n38788
1934.6G76169510K00500K29645L33634J61743P93838J21231L77121p11746k586746
1943.2G75088730K55508O06919J02768J75628O53916N67474K99759N27115M577l34091
1952.9G77948303n08041m77753m72030J4190L94898K97241L78113J64718J94931k4872
1962.5G77909698j6860l56141n24520l77503j030960O6681R70840N83039M25644M45404
1972.2G78095322K04467R9488k26822p84607m84772j67541L4561J5259K73285N80215
1981.8G77638855M97665N72815K13929j35956p96433p66220n28259l84750M43573J03378
1991.5G76858597k20566Q29391J304017J6861q39158o12869p04498j73569j93329j34887
$$ y = [776692886, 777176590, 777078018, 777517624, 777963715, 777939606, 777752304, 777364807, 777495499, 776708298, 776169510, 776370010, 776599655, 776933289, 777095032, 777888870, 778010101, 778387222, 777675476, 775088730, 775344238, 775951157, 776053925, 776229553, 776883469, 777450943, 777750702, 778277817, 778282394, 777948303, 777440262, 776962509, 776490479, 776504669, 776899567, 777196808, 777574921, 777739639, 777934570, 777909698, 777892838, 777536697, 777012177, 776634674, 775603714, 775670395, 776641235, 777224274, 777649918, 778095322, 778299789, 778399277, 778172455, 777387848, 776903076, 776735535, 776770096, 776785355, 777058640, 777638855, 778136520, 778709335, 778923264, 778787308, 777990875, 777224655, 776696396, 776311646, 776755219, 776858597, 776638031, 777467422, 778771439, 778788300, 777949142, 777336273, 776631775, 776458206, 776264877, 776129990]
2001.1G76129990K42843M37775M97208K99835K87933k48947m10996m40902m57459m85763
2010.7G75851517m17710N7526L47443P28836M07486K670m09851k81143m23279j013947
2020.4G74849548n00412l79791J1292K48413M21905M61273Q6136K36969l93982m35333
2030G74606018o05392o91834m18320o64596K8457N90287O78482K16598k53143m44107
2039.7G73042450k46201k73285n89065q6899l46603j34354J03531L11813O57959L3341
2049.3G72472687k06681m28085j04599j44729r6131j52359m47159K16675J99509P86590
2059G72095718L72467l04336k0905k88925J13373k96249l81470K35061J99128p4845
2068.6G71649017P3243L60641N7983m9896o01196q3084K57110o30493j18789O43310
$$ y = [776129990, 776372833, 776810608, 777307816, 777607651, 777895584, 777646637, 777235641, 776794739, 776337280, 775851517, 775433807, 775491333, 775838776, 776567612, 776975098, 776977768, 776567917, 776286774, 775863495, 774849548, 774349136, 773969345, 773980637, 774229050, 774650955, 775112228, 775198364, 775435333, 775041351, 774606018, 774000626, 773308792, 772890472, 772225876, 772254333, 772844620, 773523102, 773739700, 773486557, 773042450, 772796249, 772522964, 771933899, 771847000, 771500397, 771366043, 771469574, 771781387, 772439346, 772472687, 772266006, 771837921, 771733322, 771588593, 771492462, 771340103, 770892944, 771109619, 771309128, 772095718, 772468185, 772163849, 772142944, 771854019, 771967392, 771671143, 771289673, 771524734, 771723862, 771649017, 771722260, 772082901, 772140884, 772090988, 771489792, 771406708, 771663818, 771033325, 770914536, 771557846]
2078.2G71557846L76434j9760K01645p5912M6081K10343l68424k34985l5706Q1330
2087.9G71738892o9504j0452m0970K38113O38657K21252o5384m96063k00806j30844
2097.5G71822891J60446M41056j31760L06702J72653m31442n67856K23617N45655L7079
2107.2G72579041j21537j45645L15476k92893K4796K37121j29776K24228m90875n9357
2116.8G72140579J80359L24555M33197J2970q3695m58755L64303J32599m70047l70712
2126.5G72205353J1368M23355q7281Q3313p7819M577J56632K69012J6174n92880J78147
2137.1G72589951k37580m68063J9455J15509L81546K84271K00119L3875L7307l17916
2146.7G72638474k52305j06735l26996k3651N36194N69916j76163J10321P9346p172
$$ y = [771557846, 771934280, 771914520, 772116165, 772040253, 772086334, 772296677, 771928253, 771693268, 771657562, 771738892, 771669388, 771658936, 771617966, 771856079, 772494736, 772715988, 772650604, 772154541, 771953735, 771822891, 771983337, 772424393, 772292633, 772599335, 772771988, 772340546, 771772690, 771996307, 772541962, 772579041, 772457504, 772311859, 772627335, 772334442, 772359238, 772596359, 772466583, 772690811, 772199936, 772140579, 772320938, 772645493, 773078690, 773091660, 773007965, 772549210, 772913513, 773046112, 772576065, 772205353, 772216721, 772640076, 772552795, 772636108, 772558289, 772562866, 772719498, 772988510, 773004684, 772411804, 772589951, 772352371, 771884308, 771903763, 772019272, 772400818, 772685089, 772885208, 772919083, 772956390, 772638474, 772386169, 772279434, 771952438, 771928787, 772464981, 773034897, 772858734, 772969055, 773048401, 773041229]
2156.4G73041229J04676k81220j28479j56631K97393N4016J08872L36304j8006L07999
2166G73666153k7695n188k41012K289L25622j50680J79672L80859O79474J22147k68021
2176.6G74663620J07422L98941L94974k70691k74582k54440l7995J1063K45895O31867
2186.3G75616074N35354M74625j28250k26746l97491j05439j19934o03714K66648P11288
2195.9G76022415O13556K14386J54953J38779J65710J2970l31344J21536k03171l2120
2205.5G76877670K67029M60816L89480r6817L13568J8463q5754j47934R0866M0054
2215.2G78127441j53122M32282J2283K30866K09427K13775L41873Q9417l6545n77774
2224.8G78889923m043o5537k1439L75672M64325N17730p8430j78909m99573J0681O9275
$$ y = [773041229, 773145905, 772864685, 772736206, 772579575, 772876968, 772930984, 773039856, 773376160, 773358154, 773666153, 773638458, 773633270, 773392258, 773394547, 773720169, 773569489, 773749161, 774130020, 774809494, 774931641, 774663620, 774771042, 775169983, 775564957, 775294266, 775019684, 774765244, 774727249, 774738312, 774984207, 775616074, 776151428, 776626053, 776497803, 776271057, 775873566, 775768127, 775648193, 775044479, 775311127, 776022415, 776635971, 776850357, 777005310, 777144089, 777309799, 777322769, 776991425, 777112961, 776909790, 776877670, 777144699, 777605515, 777994995, 777898178, 778211746, 778230209, 778144455, 777996521, 778087387, 778127441, 777974319, 778406601, 778418884, 778649750, 778859177, 779072952, 779414825, 779504242, 779467697, 778889923, 778885880, 778820343, 778798904, 779174576, 779638901, 780156631, 780078201, 779899292, 779399719, 779410400, 779479675]
2235.4G79479675j50680n0888l03803L31803R002K04315M70047R8191j42899l22571
2245.1G79622192K976j32370J41754j17111J52817K39257l5247N19638Q2092L00217
2254.7G80776215k37732n67627j44806l85971Q8958L39509L50265Q850J86691K52152
2264.4G80666504j2817l10746n78308k6626R9792L23563j27335K3422L18680N0812
2274G80426941O10199K32925j04522l76664J00403O3706m58603K4032j09558L79868
2283.7G80788727L41720J57547k63824m76379j2589j81885K26898n09948l43323K79007
2293.3G80005951J89438L78799K34604M92020l45688j93863k60925o90003Q7891O485
2302.9G79904709O637k92968K34298K78321P1029r1934j79062Q04062p69806j122131
$$ y = [779479675, 779328995, 779278107, 778974304, 779306107, 779315109, 779519424, 779989471, 780087662, 779944763, 779622192, 779625168, 779492798, 779634552, 779517441, 779670258, 779909515, 779874268, 780393906, 780475998, 780776215, 780538483, 779970856, 779826050, 779440079, 779529037, 779868546, 780218811, 780227661, 780414352, 780666504, 780653687, 780342941, 779764633, 779738007, 779837799, 780161362, 780034027, 780057449, 780376129, 780426941, 781037140, 781270065, 781165543, 780788879, 780889282, 780952988, 780494385, 780518417, 780408859, 780788727, 781130447, 781287994, 781024170, 780547791, 780535202, 780353317, 780580215, 780070267, 779726944, 780005951, 780195389, 780574188, 780808792, 781300812, 780955124, 780761261, 780500336, 779810333, 779898224, 779904709, 779911346, 779618378, 779852676, 780130997, 780202026, 780110092, 779931030, 780735092, 779965286, 778843155]
2312.6G78843155k97165o4774N20859N71976P71027k14844n74417r34525r7809J028443
2322.2G79551926o22483j088104J78528R16214o91986j87302M76608m94079M81491
2330.9G78520813K05688o53839j431350r4986L93524o32935M79126K38953M5700M28772
2340.6G77499466j80817j127472l84063L56521r89990q97598M24499J263733J299744
2349.2G77264023P78198K8458l05n78537j095887j221542k57111Q66623j424865m09852
2358.9G73949203R58024K97470O03637K76871J06735j692276p54776j22070N6076P91473
2368.5G74470367l48053j28707K18353L67508J63269K28882k07291k24915J30005p20138
2378.2G73949280j21994M51202M23889K93274K5711j10550k53448j32218l70483j17798
$$ y = [778843155, 778545990, 778481216, 779002075, 779574051, 780345078, 780130234, 779555817, 778621292, 778523483, 779551926, 778929443, 777841339, 778019867, 778936081, 778244095, 778056793, 778533401, 778039322, 778520813, 778726501, 778072662, 776641312, 776546326, 776939850, 776306915, 776786041, 777024994, 777070694, 777499466, 777318649, 776191177, 775807114, 776163635, 775173645, 774276047, 774700546, 775964279, 777264023, 778042221, 778070679, 778070374, 777491837, 776395950, 775174408, 774917297, 775783920, 774359055, 773949203, 774907227, 775204697, 775808334, 776085205, 776191940, 774499664, 773744888, 773622818, 773678894, 774470367, 774122314, 773993607, 774211960, 774579468, 774742737, 774971619, 774764328, 774539413, 774669418, 773949280, 773827286, 774278488, 774702377, 774995651, 775021362, 774910812, 774657364, 774525146, 774154663, 774036865]
2387.8G74036865l02200k27280L74527o714K0676J49155L65066j9989m91257k71072
2397.4G73627777o3248l2348n20249j92489l0594l5172J35422R1324n4474o27518l02124
2408.1G71996307m88357n56183K61002L52859J33667M5471J83792l14483o51932l64075
2417.7G70598068n6686j48392l68347m17099m51355O8817m0893j73798j70593J37100
2427.3G68976822J86539o85502j53427l45764p48215j71737J42135J75095l07770o5765
2437G67002411m52194o72226n5008k3117r4376k90604j72042n7145j90429l27149K27814
2447.6G64895935J18332n38788l15475m78821l12271l09983l40271k25296K0523L24250
2457.2G62838135l28293l70483n19257k70233j5564p16553n07660O6605K51007l4943
$$ y = [774036865, 773734665, 773507385, 773881912, 773875198, 773895874, 774045029, 774410095, 774390106, 773898849, 773627777, 773564529, 773532181, 773011932, 772819443, 772788849, 772753677, 772889099, 772980423, 772925949, 772298431, 771996307, 771507950, 770951767, 771212769, 771565628, 771699295, 771744766, 771928558, 771614075, 770962143, 770598068, 770541382, 770392990, 770024643, 769607544, 769156189, 769225006, 769184113, 769010315, 768839722, 768976822, 769163361, 768477859, 768324432, 767978668, 767230453, 767058716, 767200851, 767375946, 767068176, 767002411, 766550217, 765877991, 765822983, 765799866, 765705490, 765414886, 765242844, 765185699, 764995270, 764668121, 764895935, 765014267, 764475479, 764160004, 763681183, 763368912, 763058929, 762718658, 762493362, 762513885, 762838135, 762509842, 762139359, 761620102, 761349869, 761334305, 760617752, 760110092, 760176697, 760427704, 760392761]
2466.9G60392761J11237L8528j78222k70310o57043l77884k36359J2436j83411l48663
2476.5G58303070p4692q1939L06396L30124j16196p93152m21524k8152l12958l64303
2486.2G56746674o13480L3951J42669q8882R7656j35956l67507l57438o6681l08380
2495.8G55082626k88238l61023l57285K55051N67245J84556o93665l40195j43432n55039
2505.5G53350601m83169N1727K80304j78681J08033K8839L7231J38626J9989j42440
2515.1G53211060o96793l44925m97818l57819K23771R8266J73722K95333k14386j200409
2524.7G50690002m48989L41186K5864l16239o27899n66711l28446L69339J43967M120
2534.4G49286194k9450m71725m62494o22864q6136j83868k15378P6828M0741P3929
$$ y = [760392761, 760503998, 760542526, 760364304, 760093994, 759436951, 759059067, 758822708, 758835144, 758651733, 758303070, 758228378, 758146439, 758452835, 758782959, 758666763, 757873611, 757452087, 757423935, 757110977, 756746674, 756133194, 756167145, 756309814, 756220932, 756318588, 756182632, 755815125, 755457687, 755391006, 755082626, 754794388, 754433365, 754076080, 754331131, 754898376, 755082932, 754389267, 754049072, 753905640, 753350601, 752867432, 752919159, 753199463, 753020782, 753128815, 753157654, 753194885, 753333511, 753353500, 753211060, 752514267, 752169342, 751671524, 751313705, 751537476, 751635742, 751809464, 752104797, 751890411, 750690002, 750241013, 750582199, 750608063, 750291824, 749663925, 749097214, 748768768, 749138107, 749282074, 749286194, 749256744, 748785019, 748322525, 747699661, 747613525, 747429657, 747214279, 747291107, 747331848, 747405777]
2544G47405777m13361k6779p6980l22266m63791p93991m28772l43552m119K46963K84576
2554.6G45063705q3465k92359k34832o30188m21982k38190j91650l34854j58005P4463
2564.3G42552643q7891j90811m82788k50015m29230l39584K0523k23847k87323k89230
2573.9G39992447m6768j91422l28369j46332K26746m2038m52881j80664n83420m31289
2583.6G37816010n5008K63290J23978m58145l38822n03311l05J11313l17154l52021
2593.2G36289825l33862j54953r4986J33057l83606m65851j75018K19345K89230p55081
2602.9G34568100m66385k23923k10495R0943O8969l3798l09372j67465n61371k50396
2612.5G32504807m5701p20520o52618l71551P2402o0119p8659p4234l88413l84597
$$ y = [747405777, 746992416, 746965637, 746888657, 746566391, 746102600, 745308609, 744879837, 744536285, 744532166, 744779129, 745063705, 744980240, 744687881, 744453049, 743822861, 743400879, 743162689, 742971039, 742636185, 742478180, 742552643, 742464752, 742273941, 741791153, 741541138, 741111908, 740772324, 740792847, 740569000, 740281677, 739992447, 739945679, 739754257, 739425888, 739279556, 739506302, 739464264, 739011383, 738830719, 738247299, 737816010, 737761002, 738024292, 738148270, 737690125, 737351303, 736847992, 736847687, 736959000, 736641846, 736289825, 735955963, 735801010, 735706024, 735839081, 735455475, 734989624, 734814606, 735033951, 735323181, 734568100, 734101715, 733877792, 733667297, 733758240, 733827209, 733793411, 733484039, 733316574, 732755203, 732504807, 732459106, 731738586, 731085968, 730714417, 730786819, 730726700, 730648041, 730573807, 730185394, 729800797]
2622.1G29800797o34690o02722m22821l80325k47498l2730m01993o72912j52207L3417
2631.8G26286316j72348m06876o13708r39026l52173l7003o65054l78570j79291j90582
2641.4G22351685l38211n08805m86831m96674l47900o83136m23813R92m83017o29273
2651.1G17955017j23596r5902m55322l82461n70984p19681m32434k92816k94648j72729
2660.7G14414444q0109J90277J0453o73371n14068q04138q10471l96805l59344J5030
2670.4G10991898k00501R0942N4474k39563j77154m29535l11585n92956l71933o63071
2680G08151016p64999j18714l27072r9868j54648k2126j69906m42352l19138p47681
2689.6G04984512n69915o59714m57764K01569K31704j49917p7439J16044p45469p87582
$$ y = [729800797, 729166107, 728563385, 728140564, 727760239, 727512741, 727480011, 727078018, 726405106, 726252899, 726286316, 726113968, 725707092, 725093384, 724154358, 723802185, 723765182, 723100128, 722721558, 722542267, 722351685, 722013474, 721504669, 721017838, 720521164, 720173264, 719490128, 719066315, 719067307, 718584290, 717955017, 717831421, 717735519, 717280197, 716897736, 716326752, 715607071, 715174637, 714881821, 714587173, 714414444, 714334335, 714524612, 714535065, 713861694, 713347626, 712543488, 711733017, 711336212, 710976868, 710991898, 710791397, 710882339, 710936813, 710697250, 710520096, 710090561, 709778976, 709186020, 708814087, 708151016, 707386017, 707267303, 706940231, 706840363, 706685715, 706663589, 706493683, 706051331, 705732193, 704984512, 704414597, 703754883, 703297119, 703498688, 703730392, 703580475, 703503036, 703619080, 702873611, 702086029]
2699.3G02086029n76935n58471l50876l29819j7853k90451l75137j12229k01416n19104
2708.9F98753738p12432q14057n33600j754m13895k30179l7765n22156k16446K26974
2718.6F95498428L9368o61926p89871m48990o1493n5619l62243l69110l42789l25317
2728.2F92120438m53492k83966k36282j50986m25644q13064j56479j59531j29394L53698
2737.9F89665298K89155k56348n93872n69000n05906J61667r3155l19671j62125l38516
2747.5F87277527o3248n34973n92270j65558p0495k58332m28314m28390o69480J58539
2757.2F84225006L02887l76892M3869j2665o91910l21579J8769n48630j90811j30234
2766.8F82317810m52499j2970L4485L3493L5781j35955l62015n98831r01490n28945
$$ y = [702086029, 701509094, 700950623, 700599747, 700269928, 700252075, 699961624, 699586487, 699474258, 699272842, 698753738, 698041306, 697227249, 696693649, 696691895, 696278000, 696047821, 696010056, 695487900, 695271454, 695498428, 695537796, 694875870, 694085999, 693637009, 693575516, 693519897, 693157654, 692788544, 692445755, 692120438, 691666946, 691382980, 691146698, 690995712, 690570068, 689757004, 689600525, 689440994, 689311600, 689665298, 689954453, 689698105, 689104233, 688535233, 688029327, 688190994, 688097839, 687778168, 687616043, 687277527, 687214279, 686679306, 686087036, 685921478, 685850983, 685592651, 685164337, 684735947, 684066467, 684225006, 684527893, 684151001, 684194870, 684182205, 683490295, 683168716, 683187485, 682638855, 682448044, 682317810, 681865311, 681852341, 681886826, 681920319, 681956100, 681820145, 681458130, 680859299, 679957809, 679428864]
2776.4F79428864p7286m49372l24173m5242K9755j83335m93240q13827o81839j55182
2786.1F76235123l74680k58789k31018k40173l81165k82135r1019r72671m50668l73841
2795.7F72578964o72912k95029j066132j143493p02286j06812p6980n62744o83136
2804.4F67269440q49533o02188o71921p46460m80499k59095p36389j316452r09500
2813.1F60697403n26428n58090o60553n94635q80738q75091r98001j192398o36673
2821.8F53774796o18973n39551j045532j466217j309815j080398l10974q40455j256408
2830.4F45306473j084671j012879r69772j224365j094780j400299j203079r97658j370583
2839.1F34948387j761627k196732j656761j629371k119751k393837k731781k668763
$$ y = [679428864, 679351578, 678902206, 678578033, 678532791, 678562546, 678379211, 677885971, 677072144, 676390305, 676235123, 675860443, 675601654, 675370636, 675130463, 674749298, 674467163, 674376144, 673403473, 672952805, 672578964, 671906052, 671611023, 670544891, 669401398, 668699112, 668592300, 668515320, 667952576, 667269440, 666419907, 665817719, 665145798, 664399338, 663918839, 663659744, 662923355, 661606903, 660697403, 660170975, 659612885, 658952332, 658357697, 657476959, 656601868, 655603867, 654411469, 653774796, 653155823, 652616272, 651570740, 650104523, 648794708, 647714310, 647403336, 646562881, 645306473, 644221802, 643208923, 642239151, 641014786, 639920006, 638519707, 637316628, 636318970, 634948387, 633186760, 630990028, 629333267, 627703896, 625584145, 623190308, 620458527, 617789764]
2846.8F17789764k727203k574272k462616k483978j790619j275292j027565o05468
2854.6F02842751n12772j86653J23863J55907K14195j65062o29005j054879o67915
2863.2F00120430l57704q35343j022605j453782j546249j517830j458588j576423j883011
2871.9E88468895j490555j328850j209564j628532j921387j669922j568718j484718
2879.6E76166649j965752j487427r81369j164665j042938r76868o33583o81343o98204
2888.3E66534500o10962o91604q68111r64508o70548m88090k9831m50821j001015l65257
2897.9E60393753k3346k74925q21152j220131r91440m39148o79397r87282j172752
2906.6E53784180j256676o26564q34198j426010j940727j905518j876984k684555k521972
$$ y = [617789764, 615062561, 612488289, 610025673, 607541695, 605751076, 604475784, 603448219, 602842751, 602329979, 602143326, 602267189, 602423096, 602637291, 602472229, 601843224, 600788345, 600120430, 599762726, 598927383, 597904778, 596450996, 594904747, 593386917, 591928329, 590351906, 588468895, 586978340, 585649490, 584439926, 582811394, 580890007, 579220085, 577651367, 576166649, 574200897, 572713470, 571732101, 570567436, 569524498, 568547630, 567914047, 567232704, 566534500, 565923538, 565231934, 564363823, 563399315, 562728767, 562240677, 562210846, 561760025, 560759010, 560393753, 560370407, 560095482, 559274330, 558054199, 557062759, 556623611, 555944214, 554956932, 553784180, 552527504, 551900940, 551066742, 549640732, 547700005, 545794487, 543917503, 541232948, 538710976]
2915.3E38710976k293587k442589k287941j743584j633415j997986j261558p81212
2923E24269104p86781q56591q44230j65444J60523k08740O370Q30536Q99315J154709
2932.7E24458771J138382J202430J700974J309662J457977J449280J863480K730026
2940.4E37310982K483291K663460K688866K267227K297554J981277J600647J912156
2948.1E55205460K081718K492180K737274K078323J607666J555024K163543J750527
2955.8E71671715J198349J876449J966248K161140K181626J741905J803627K225189
2963.5E86826248K127915J689987J463089J618919J900940J514702J924095J856766
2971.2F00922661J141777J656303J882172J350326J072998J843110J772384J353340
$$ y = [538710976, 536417389, 533974800, 531686859, 529943275, 528309860, 526311874, 525050316, 524269104, 523482323, 522625732, 521781502, 521616058, 521776581, 521567841, 521574211, 522404747, 523304062, 524458771, 525597153, 526799583, 528500557, 529810219, 531268196, 532717476, 534580956, 537310982, 539794273, 542457733, 545146599, 547413826, 549711380, 551692657, 553293304, 555205460, 557287178, 559779358, 562516632, 564594955, 566202621, 567757645, 569921188, 571671715, 572870064, 574746513, 576712761, 578873901, 581055527, 582797432, 584601059, 586826248, 588954163, 590644150, 592107239, 593726158, 595627098, 597141800, 599065895, 600922661, 602064438, 603720741, 605602913, 606953239, 608026237, 609869347, 611641731, 612995071]
2979F12995071J373291O79245O66924R54285J375122J467247J117630P05871R33304
2987.6F22267990J672363Q29125M25606N87387N95245O92558L82500L39508K72484
2996.3F28064766Q20084O85501l13645k68631j06773m03443l776M04930j90277k23503
3006F28465233j25160J79443K43721m66957k10304j11618m89846p00111m46472k59514
3015.6F26078415k90260j39504m16756m41970m18473l73268q11920j048622l67394
3024.3F21770248m22592j028633j145820k26365l13568r74922q85963q21724n49279
3033F15401382j113166j055870m24958o36978p50313p85408j033821r66949n72586
3041.6F08061333r72634j105957j267738r14574k79579j044693q89091j121827j318359
$$ y = [612995071, 614368362, 615047607, 615714531, 616668816, 618043938, 619511185, 620628815, 621334686, 622267990, 623940353, 624769478, 625195084, 625782471, 626377716, 627070274, 627452774, 627792282, 628064766, 628884850, 629570351, 629256706, 628988075, 628881302, 628477859, 628474083, 628879013, 628688736, 628465233, 628340073, 628519516, 628763237, 628296280, 628085976, 627974358, 627484512, 626784401, 626337929, 626078415, 625788155, 625648651, 625231895, 624789925, 624371452, 623998184, 623186264, 622137642, 621770248, 621347656, 620319023, 619173203, 618946838, 618633270, 617658348, 616772385, 615950661, 615401382, 614288216, 613232346, 612807388, 612170410, 611420097, 610634689, 609600868, 608633919, 608061333, 607088699, 605982742, 604715004, 603800430, 603520851, 602476158, 601587067, 600465240, 599146881]
3050.3E99146881l88298n18799j124916j208229p83539j130867j440277j261711r28116
3059E90362129o38847j043472r72786p35474p03506j057587r98001q87680j247368
3067.7E82077408j160088j262245p98149o82564o90079o91986j334266j297150j319542
3076.4E72841339q23669n08576j016197j126785p23839n92766j105003j009789j148109
3085E64786606j439324j517944j197739o75430p91359n53970j085282j672782j142006
3093.7E54710770m08707m94728j417503j254502p56683o88095j150360j413994p18308
3102.4E46407890j24092o80313j798477j502380r89609m60358m13360j337777j224403
3111.1E37877121j261597j116676m71268o18324j165390j372223j152153j445122j517143
$$ y = [599146881, 598758583, 598239784, 597114868, 595906639, 595123100, 593992233, 592551956, 591290245, 590362129, 589723282, 588679810, 587707024, 586971550, 586268044, 585210457, 584212456, 583324776, 582077408, 580917320, 579655075, 578856926, 578174362, 577484283, 576792297, 575458031, 574160881, 572841339, 572017670, 571509094, 570492897, 569366112, 568642273, 568049507, 566944504, 565934715, 564786606, 563347282, 561829338, 560631599, 559956169, 559164810, 558610840, 557525558, 555852776, 554710770, 554302063, 553807335, 552389832, 551135330, 550378647, 549690552, 548540192, 547126198, 546407890, 546283798, 545603485, 543805008, 542302628, 541313019, 540852661, 540439301, 539101524, 537877121, 536615524, 535498848, 535027580, 534409256, 533243866, 531871643, 530719490, 529274368, 527757225]
3119.8E27757225q17985l86048q14514r35936m51469r27620j312371q16803j022377
3128.4E20272102j428680j106606j213951j178055o92405n50881m45823o33469r29069
3137.1E12093163j151467j170120j318817j075173o78520j160431j318474j262397
3144.8E02957764o84357n72777j023178r04083j164055r04160p15332r48524j545639
3153.5D94495659j452484m00734m95110n31082n69382q35991j338806j415786r61571
3162.2D86494713j373863j017189o08330o10619n92613p09686q29315j100731q73833
3170.9D78778534p58743q07801j111793r74541j044693j202621n79148p55729n41649
3179.5D71001816n64499m62418n22651j373177r28192j236229j321983o67305q79631
$$ y = [527757225, 526939240, 526553192, 525738678, 524802742, 524351273, 523423653, 522111282, 521294479, 520272102, 518843422, 517736816, 516522865, 515344810, 514652405, 514101524, 513655701, 513022232, 512093163, 510941696, 509771576, 508452759, 507377586, 506699066, 505538635, 504220161, 502957764, 502273407, 501700630, 500677452, 499773369, 498609314, 497705154, 496989822, 496041298, 494495659, 493043175, 492642441, 492147331, 491616249, 491046867, 490210876, 488872070, 487456284, 486494713, 485120850, 484103661, 483495331, 482884712, 482292099, 481582413, 480753098, 479652367, 478778534, 478019791, 477211990, 476100197, 475125656, 474080963, 472878342, 472299194, 471543465, 471001816, 470437317, 469974899, 469452248, 468079071, 467150879, 465914650, 464592667, 463925362, 463045731]
3188.2D63045731q94700n76972n02625q51822q87070q66775o81458n12657p09800j384774
3197.9D55177078j451530m38767l21960k89116n66559r90448r62486n88417n52483
3206.5D49015312j427803p47986m77447p53861o94046r00955l20549n29404p92503
3215.2D42370758j038856q00400l19710r11942j162223o85654L9787n30548q24737
3223.9D36136475p24564o72569m46434j253472r07097m00276l73878n37567o85921
3232.6D30134697l04260m10576n10559r98879r03892o85082o21490p22542r94148k17438
3242.2D23765831m10538n64308n17425q28400q26225q95234n14678m10309k57149m04549
3251.9D18137016n75370p57943o85005l23830p76596m68521l69911o02074o19964k77367
$$ y = [463045731, 462151031, 461574059, 461071434, 460219612, 459332542, 458465767, 457784309, 457271652, 456561852, 455177078, 453725548, 453286781, 452964821, 452675705, 452109146, 451118698, 450156212, 449567795, 449015312, 447587509, 446839523, 446362076, 445608215, 444914169, 444013214, 443692665, 443163261, 442370758, 441331902, 440531502, 440211792, 439299850, 438137627, 437451973, 437491760, 436961212, 436136475, 435411911, 434739342, 434292908, 433039436, 432132339, 431732063, 431358185, 430820618, 430134697, 429830437, 429419861, 428909302, 427910423, 427006531, 426321449, 425699959, 424977417, 423983269, 423765831, 423355293, 422790985, 422273560, 421445160, 420618935, 419723701, 419209023, 418798714, 418541565, 418137016, 417561646, 416803703, 416118698, 415794868, 415018272, 414549751, 414179840, 413577766, 412957802, 412680435]
3261.5D12680435N8327m58717o51894j079826p88727l40157k40898k01569o71195l34855
3271.2D07970924R8839m9057j243553j171532l69949m31290j89399n64080j37520l24554
3280.8D03588829p21626l14293m61083l10440p03964m51126o8474k11410l69454n88608
3290.4C99388351n18493o03180j65672m67263o89125l57399r9869r5634q15887k80343
3300.1C95295486L052l42636m30946n89905l86696n23109p32575n90019k25868n57137
3309.7C90919647o09627k88353m77638m57535n13343l72277m06341k33231k02827n90782
3319.4C86767693o09703p12815m22363j82533m80042j122703q13370l24021n45234
3328.1C81554909j32599k48642o93665r70420n54505k26364q26569p10601m28162k26326
$$ y = [412680435, 412738762, 412280045, 411628151, 410548325, 409759598, 409419441, 409178543, 408976974, 408305779, 407970924, 408069763, 408020706, 406777153, 405605621, 405235672, 404804382, 404614983, 404050903, 403913383, 403588829, 402867203, 402552910, 402091827, 401781387, 401077423, 400626297, 400557823, 400346413, 399976959, 399388351, 398869858, 398266678, 398101006, 397633743, 396944618, 396587219, 396487350, 396391716, 395575829, 395295486, 395298538, 394955902, 394524956, 393935051, 393548355, 393025246, 392292671, 391702652, 391476784, 390919647, 390310020, 390021667, 389544029, 389086494, 388573151, 388200874, 387794533, 387561302, 387358475, 386767693, 386157990, 385445175, 385022812, 384840279, 384360237, 383237534, 382424164, 382100143, 381554909, 381422310, 381173668, 380480003, 379509583, 378955078, 378728714, 377902145, 377191544, 376763382, 376537056]
3337.7C76537056n05486q48808o20308k53639m94080r06295l29209n27954n47981j54572
3347.3C71348724n67245q37708n58700l0709l82385r18007j096229m58031m21066q70781
3357C65207863j53809m48227o62155n36766n96199p38792p14455k35291p72933p59469
3366.6C59589767o57806l45344j47667o21148j28707m66500p04269n82466l78800K81945
3376.3C55839005k82860j106758j083794p39250n78499l61900n07546k79426j1178
3384.9C50887794l93905m95491q42362k93388K8458k09999j97525p61338n00755N5923
3394.6C47277412K22626k17361p74117o81686k52495m8065k47040J79520l50113q27103
3404.2C44281578K747K29263n760k28806j56708n26351o54335K19192L27339n63164
$$ y = [376537056, 376031570, 375182762, 374562454, 374308815, 373814735, 372908440, 372579231, 372051277, 371503296, 371348724, 370781479, 369943771, 369385071, 369354362, 368971977, 368053970, 366957741, 366499710, 366078644, 365207863, 365054054, 364605827, 363943672, 363406906, 362810707, 362071915, 361357460, 361122169, 360349236, 359589767, 358931961, 358586617, 358438950, 357817802, 357689095, 357222595, 356518326, 355935860, 355557060, 355839005, 355556145, 354449387, 353365593, 352626343, 352047844, 351685944, 351178398, 350898972, 350887794, 350493889, 349998398, 349156036, 348862648, 348891106, 348681107, 348483582, 347722244, 347221489, 347277412, 347500038, 347282677, 346508560, 345826874, 345574379, 345526314, 345279274, 345458794, 345108681, 344281578, 344284325, 344513588, 344507828, 344279022, 344122314, 343595963, 342941628, 343160820, 343488159, 342924995]
3413.9C42924995q66432m66118O5537N51491K78129j22413j87302J88065J99584j88598
3423.5C42376938j10207l94897k61688l8453K85378K57187m56467j01356J40686L01933
3433.2C41999054L53088J65406J20658q2283R8572J30425Q964J62888P93266M56314
3442.8C44206352K6665J68076p9041K27089j16921Q17795J354981L17764N4016J70899
3452.5C47147675O18057j64414M6502J076393J34849J32332O41022L70559L95470P74002
3462.1C51172447L79372J55983P36580Q26301R1515k99721M21448L76358N69763P69577
3471.7C55199623M85268P52334L89176K53944N73540R38492N05600L47023J038398
3480.4C60483398Q65097L82729j45760O85158P69043N72396J315116J57242k05383
$$ y = [342924995, 342058563, 341592445, 341657982, 342209473, 342487602, 342365189, 342177887, 342365952, 342565536, 342376938, 342266731, 341871834, 341610146, 341571693, 341857071, 342114258, 341657791, 341556435, 341697121, 341999054, 342352142, 342517548, 342638206, 342555923, 342654495, 342784920, 342793884, 342956772, 343750038, 344206352, 344233017, 344401093, 344322052, 344549141, 344432220, 345250015, 346604996, 346922760, 346976776, 347147675, 347765732, 347601318, 347647820, 348724213, 348859062, 348991394, 349632416, 350002975, 350398445, 351172447, 351551819, 351707802, 352444382, 353270683, 353362198, 353062477, 353483925, 353860283, 354430046, 355199623, 355684891, 356437225, 356826401, 357080345, 357653885, 358592377, 359097977, 359445000, 360483398, 361348495, 361731224, 361585464, 362270622, 363039665, 363612061, 364927177, 365084419, 364879036]
3489.1C64879036O63605Q73756P63817N68199P08275R27658O47125j16615L33786J028480
3498.7C71277122Q40531O44836J199189Q25996l79906J45645P91703Q41636O38008
3507.4C76824760J806488J349755o72379N88990Q63914P24297K25753M66195J510391
3516.1C83688164J047821R53407K30484K08626P53784J126404J385689O37588O27251
3524.8C90659218O23436Q17756P69616O07032L81432J221161J283188M23469J315041
3533.5C98101349J121063J513329O60133J07193J491623P14111Q89244M07563R98840
3542.1D06004448J646118J611290J151657m21066R48868l43132J532783K347183R42994
3550.8D15421143J234817p62215J281128J294136J428223J914330Q63113K205429R70268
$$ y = [364879036, 365542641, 366416397, 367180214, 367748413, 368456688, 369384346, 370031471, 369914856, 370248642, 371277122, 372117653, 372762489, 373961678, 374787674, 374407768, 374553413, 375345116, 376186752, 376824760, 378631248, 379981003, 379308624, 379897614, 380761528, 381485825, 381711578, 382177773, 383688164, 384735985, 385689392, 385919876, 386128502, 386882286, 388008690, 389394379, 390031967, 390659218, 391282654, 392100410, 392870026, 393477058, 393858490, 395079651, 396362839, 396786308, 398101349, 399222412, 400735741, 401395874, 401503067, 402994690, 403708801, 404598045, 405005608, 406004448, 407650566, 409261856, 410413513, 409992447, 410941315, 410598183, 412130966, 414478149, 415421143, 416655960, 415893745, 417174873, 418469009, 419897232, 421811562, 422674675, 424880104, 425850372]
3559.5D25850372P71370N89600J796951J628533L57399L906784J66473o12030K32277
3568.2D34687729n83992L911133K072067J290741J939697J977158J379623J670342
3575.9D48344498K219543L36533K288208J936760N96122J787110J552620J015358J413536
3584.6D61490288M655380J982880j450310J309585r16137L240700M150924L513870
3592.3D77977180R23386k34489K895240k05574K860489L112984N66254L447837J005974
3601D92349281J083336K448807J617126J960106L149071K970467j036492K913208q13713
3609.6E06641197L50189Q999176J428109l088303L295555l92151M963723M857788k61231
3618.3E26794052J262550j341705Q90160L514023L564109K724533J771851J201592
$$ y = [425850372, 426621742, 427211342, 429008293, 430636826, 430994225, 434901009, 435067482, 434455452, 434687729, 434103737, 438014870, 440086937, 441377678, 443317375, 445294533, 446674156, 448344498, 450564041, 450900574, 453188782, 455125542, 455721664, 457508774, 459061394, 460076752, 461490288, 466145668, 468128548, 466678238, 467987823, 467071686, 470312386, 474463310, 477977180, 478900566, 478666077, 481561317, 481355743, 484216232, 487329216, 487895470, 491343307, 492349281, 493432617, 495881424, 497498550, 499458656, 502607727, 505578194, 504541702, 507454910, 506641197, 506991386, 515990562, 517418671, 514330368, 517625923, 517233772, 522197495, 527055283, 526794052, 528056602, 526714897, 527605057, 531119080, 534683189, 537407722, 539179573, 540381165]
3626E40381165J828193P150727j464158j1967468P302056O308822N855560J112099
3633.8E56506996k460098K609901L547364K541046K20871J270446K190629K035331
3641.5E68462486J351128M04701K322121M262810O210632k524185m452286N811005
3649.2E81848412r67637l498153P67746P257652M805603L712349M962997r483490J570702
3657.9E90976181N850372J115380J412162Q67348J636887P74727J744537J679077R85794
3666.5F07042465N131989J988868k611694j060257n547409M792252R305877Q728600
3674.3F27770691k927132k0068092M822807Q216400M874993j300583J156654L553658
3682F26099396J244430J095810N94063J31950M238205N762253j0608444k365608Q405685
$$ y = [540381165, 542209358, 549360085, 547895927, 535928459, 543230515, 549539337, 555394897, 556506996, 554046898, 556656799, 560204163, 562745209, 562966080, 564236526, 566427155, 568462486, 569813614, 570218315, 572540436, 576803246, 583013878, 580489693, 576037407, 581848412, 580880775, 577382622, 578150368, 585408020, 590213623, 593925972, 598888969, 589405479, 590976181, 596826553, 597941933, 599354095, 600221443, 601858330, 602633057, 604377594, 606056671, 607042465, 612174454, 614163322, 611551628, 610491371, 604943962, 609736214, 619042091, 627770691, 624843559, 604775467, 609598274, 617814674, 622689667, 621389084, 622545738, 626099396, 627343826, 628439636, 629033699, 629165649, 633403854, 639166107, 628557663, 626192055, 634597740]
3690.6F34597740o595497J079330O179619O30112J871948J106949O9237J269836P65229
3699.3F40974503K902526L056260n895234k618866N149689J516037J66245J203231
3707F46454391L071976L580704p860947M354019L094635j4966507N640870N335159
3714.8F48704300J387176J330567K590256J787872l452835L59268N076599l986130
3722.5F53797073m060821N882568J389237o04859l306808J20392M661407J539307N053405
3731.2F64470901n092773p021942J0835876N07431j0597610K246628L387298p81784
3738.9F57954025K287827L101959m005890M051743J2487869j2436600j7220535J2000503
3746.6F58220901O331254O166305k828369j2062836J2005387n698090o966705P567367
$$ y = [634597740, 628002243, 629081573, 635261192, 635891304, 637763252, 638870201, 638939438, 640209274, 640974503, 643877029, 646933289, 641038055, 638419189, 643568878, 645084915, 645251160, 646454391, 649526367, 653107071, 645246124, 649600143, 652694778, 637728271, 643369141, 648704300, 650091476, 651422043, 654012299, 655800171, 652347336, 652706604, 657783203, 653797073, 649736252, 655618820, 657008057, 656403198, 653096390, 653216782, 657878189, 659417496, 664470901, 659378128, 652356186, 663192062, 663699493, 653101883, 655348511, 658735809, 657954025, 660241852, 663343811, 659337921, 663389664, 675877533, 663440933, 646220398, 658220901, 664552155, 670718460, 667890091, 655827255, 667832642, 662134552, 655167847, 662735214]
3754.3F62735214N282974L088608n695495K353515N235138p991943o87256M602966
3762F68923721J480103j32065L228531k431870m788589L916168N368195o75965r142303
3770.7F65745926L461532M323807k22854L4256m57688R10187P03125L126373k06070
3779.4F77418594q375015K406769K527084J827011K488938l626633q61359J394501
3787.1F75199890O52847M32129n31768J115341J052856L81317l21960J232376K734985
3795.8F81948013m905014l869095K954102N054626O445237p697602j1251297M226303
3803.5F72905273M471817N543137M500427j0700454l656464N760269K705689J47247
3811.2F81676941K09732J64337J984940O357574k497101j5651931N456237O626130
$$ y = [662735214, 668018188, 671106796, 665411301, 667764816, 672999954, 665008011, 664320755, 668923721, 670403824, 670271759, 673500290, 671068420, 666279831, 670195999, 675564194, 674888229, 665745926, 669207458, 673531265, 673308411, 673342667, 672884979, 673795166, 674498291, 677624664, 677418594, 669043579, 671450348, 673977432, 675804443, 678293381, 674666748, 673805389, 675199890, 675852737, 676284866, 675753098, 676868439, 677921295, 678302612, 677980652, 679213028, 681948013, 677042999, 673173904, 676128006, 681182632, 687627869, 679930267, 668678970, 672905273, 677377090, 682920227, 687420654, 676720200, 673063736, 678824005, 681529694, 681676941, 681886673, 682051010, 684035950, 690393524, 687896423, 672244492, 677700729, 684326859]
3818.9F84326859M717025l33328j8956909L182907O296387L361129L848420n13840
3826.6F85928650n094986O89468K097779L549728J428070q836441L488312P374039
3834.3F90624619o751938q89130Q438568r335556m615402Q045730o193161Q77381P410583
3843F87611694k826156k651978L589478J349868M39606K302551j660461J607056O124115
3851.7F95885773o834946r49631j6945038L714371J1469040j108093j353531L169708
3859.4F87047653L645096L735199n704117l55987O248169r442368n517654N931701
3867.1F85587692O523743O954803r424896j0431518M621505P467270L633728j1051178
3874.8F83881149J700211M283066l54996K420502L934478o927642o084519O502609
$$ y = [684326859, 689043884, 688710556, 669753647, 672936554, 679232941, 682594070, 686442490, 685928650, 680833664, 681523132, 683620911, 687170639, 688598709, 679762268, 683250580, 690624619, 683872681, 682983551, 691422119, 682086563, 677471161, 685516891, 679323730, 680201111, 687611694, 684785538, 682133560, 685723038, 687072906, 687512512, 689815063, 688154602, 689761658, 695885773, 689050827, 688101196, 671156158, 674870529, 686339569, 685231476, 683877945, 687047653, 690692749, 694427948, 688723831, 688367844, 694616013, 685173645, 679655991, 685587692, 692111435, 699066238, 689641342, 679209824, 683831329, 691298599, 694932327, 683881149, 685581360, 689864426, 689509430, 691929932, 695864410, 688936768, 682852249, 689354858]
3882.6F89354858J273575J975479M438401j2467881K045136M289474O24390L886948
3890.3F95420380j734009r219971K100449L581848q76236K025299J624451K767334
3898F95689545Q08792j2061081M652634L604507l745117L967056m133987r84192J231842
3906.7F89029999Q43429K285843j47705M93851j71814P1564M47387p22732J965942
3915.3F94095764K419739m531097k953492N226975m30374m339600L257294K049560
3923.1F94794769L71018l413468l292389L040390J788559R36203q00628j45264K599793
3931.7F95878983k993775k683639J406250J254959L34396k41928j29623J16424K38724
3940.4F93180771J682815J267853l972702j187057J183929J700745J788559k976532
$$ y = [689354858, 690628433, 692603912, 697042313, 684574432, 686619568, 690909042, 691533432, 695420380, 693686371, 684466400, 686566849, 690148697, 689272461, 691297760, 692922211, 695689545, 696498337, 684437256, 689089890, 692694397, 688949280, 692916336, 688782349, 687798157, 689029999, 689873428, 692159271, 692011566, 692505417, 692333603, 692405167, 692852554, 692129822, 694095764, 696515503, 691984406, 689030914, 694257889, 693827515, 689487915, 692745209, 694794769, 695165787, 691752319, 688459930, 691500320, 693288879, 694225082, 693424454, 693279190, 695878983, 692885208, 690201569, 691607819, 692862778, 693197174, 692955246, 692825623, 692942047, 693180771, 694863586, 696131439, 692158737, 690971680, 692155609, 693856354, 695644913, 692668381]
3948.1F92668381M36554N05829j791382K277755M69513r93957l16010O24543j34888
3956.8F93746338r50089O99768o59103J045303R73282j889038N11856J179123L24097
3965.5F94981537Q5068j52665k3956r21249j068497R35364P99026o39724p0954L43476
3975.1F94267426L76434k14157R1476P39517Q2093l77274J54266K82975p18308n2032
3984.8F94632416j14975l84979L82156J98898K15073o39877j15052K65961K10037O69632
3994.4F95319290j078796o07147Q84246L64991k02027Q8120
4000.2F94768677
$$ y = [692668381, 693104935, 693610764, 691819382, 694097137, 694566650, 693572693, 693256683, 693881226, 693746338, 692796249, 693496017, 692836914, 693882217, 694855499, 692966461, 693478317, 694657440, 694981537, 695066605, 694913940, 694889984, 693968735, 692900238, 693835602, 694634628, 693994904, 693923950, 694267426, 694643860, 694429703, 694521179, 695260696, 695342789, 694965515, 695119781, 695402756, 694684448, 694632416, 694517441, 694132462, 694514618, 694713516, 694928589, 694288712, 694173660, 694439621, 694649658, 695319290, 694240494, 693633347, 694517593, 694882584, 694680557, 694768677]
##END=$$ End of the data block
