##TITLE=$$ Begin of the data block
##JCAMP-DX=5.00 $$ ACD/SpecManager v 10.08
##SPECTROMETER/DATA SYSTEM=Varian
##DATE=20 Nov 2012 15:53:02
##DATA TYPE=INFRARED SPECTRUM
##DATA CLASS=XYDATA
##ORIGIN=
##OWNER=
##NPOINTS=3735
##FIRSTX=399.26403809
##LASTX=4000.35498047
##MAXX=4000.35498047
##MINX=399.26403809
##MAXY=78.38697052
##MINY=33.00761795
##XFACTOR=1.0000000000
##YFACTOR=0.000000100000000
##FIRSTY=58.52139282
##DELTAX=0.96440572
##XUNITS=1/CM
##YUNITS=TRANSMITTANCE
##XYDATA=(X++(Y..Y))
$$ plain form
399.3 585213928 573783035 560831108 569312935 579211845 567877121 563580208 574078941 570622749
407 570622749 560508232 546112976 556325912 578856773 583226624 577036171 573536797 576255417
414.7 576255417 572279358 572855225 569850578 535714874 523732872 553538208 566622314 566111832
422.4 566111832 567203789 567943611 569219971 566319199 563530197 563825684 559356155 560949631 560104370
431.1 560104370 554551353 549002419 548918800 551841736 549925346 558337173 562009811 557454834 554064751
439.8 554064751 559049721 562370110 554760132 555522118 559673843 566093292 564015808 563787270 570327492
448.4 570327492 568522911 568060951 563361549 562560921 563577309 562011490 565641975 567815323 573899193
457.1 573899193 577523079 579332542 579312477 572523918 566509399 564155388 564341354 556431656 554151917
$$ packed form
399.3E85213928j1430893j2951927Q481827R898910j1334724m296913J0498733l456192
407E70622749j0114517j4395256J0212936K2530861M369851o190453l499374K718620
414.7E76255417l976059N75867l004647l4135704j1982002K9805336J3084106n10482
422.4E66111832J091957P39822J276360k900772k789002K95487m469529J593476q45261
431.1E60104370n553017n548934q3619K922936j916390Q411827L672638m554977l390083
439.8E54064751M984970L320389p609978P61986M151725O419449k077484k28538O540222
448.4E70327492j804581m61960m699402q00628J016388j565819L630485K173348O083870
457.1E73899193L623886J809463k0065o788559o014519k354011J85966p909698k279739
$$ plain form
465.8 554151917 561673698 563479767 559492798 559404564 564038963 566118546 560566902 553741684 556875725
474.5 556875725 557775192 552632790 548157959 546478882 551671486 555214615 556060905 553327408 545416336
483.2 545416336 540562935 542879715 547687111 548482513 548005066 549952621 550725441 550094604 551546669
491.8 551546669 551894035 550852280 548363228 543035851 541290398 540614128 540638008 541799927 544643364
500.5 544643364 549262848 547947235 544321022 541532211 539374352 536197395 532706795 533561096 534759331
509.2 534759331 536256294 535979843 535414047 534379501 533880806 531380577 524256058 520376015 520627213
517.9 520627213 520326385 517618828 516929932 518789139 520171013 519532623 518240814 518376465 516473579
526.6 516473579 515393982 511862640 509691010 511550255 513047371 516070366 516067963 516935577 518697701
$$ packed form
465.8E54151917P521781J806069l986969q8234M634399K079583n551644o825218L134041
474.5E56875725Q99467n142402m474831j679077N192604L543129Q46290k733497p911072
483.2E45416336m853401K316780M807396P95402m77447J947555P72820o30837J452065
491.8E51546669L47366j041755k489052n327377j745453o76270K3880J161919K843437
500.5E44643364M619484j315613l626213k788811k157859l176957l490600Q54301J198235
509.2E34759331J496963k76451n65796j034546m98695k500229p124519l880043K51198
517.9E20627213l00828k707557o88896J859207J381874o38390j291809J35651j902886
526.6E16473579j079597l531342k171630J859245J497116L022995k403Q67614J762124
$$ plain form
535.2 518697701 519921799 521833725 521521263 521310883 522446976 526295853 528643456 531204720 534521179
543.9 534521179 535112152 535555878 534040756 532491417 531204376 530162735 530176926 530353088 529937973
552.6 529937973 528412437 529942322 531204910 530478134 528777962 526372910 523382874 519820900 518593674
561.3 518593674 517596970 517658310 515512581 513048019 511715431 508648567 507526703 503843765 500694580
570 500694580 498592262 496500130 495553818 494455376 496018372 497121277 498570709 499538078 500579338
578.6 500579338 500764656 500571404 502358780 504328995 508917122 511517220 513532867 517050667 519682808
587.3 519682808 520825310 520959129 523348923 525176277 525859299 525566139 525352821 525846329 526853943
596 526853943 527463913 525700951 526785164 527767639 526635971 525426216 523980675 526040306 528371735
$$ packed form
535.2E18697701J224098J911926l12462k10380J136093L848877K347603K561264L316459
543.9E34521179N90973M43726j515122j549339j287041j041641J4191J76162m15115
552.6E29937973j525536J529885J262588p26776j700172k405052k990036l561974j227226
561.3E18593674r96704O1340k145729k464562j332588l066864j121864l682938l149185
570E00694580k102318k092132r46312j098442J562996J102905J449432R67369J041260
578.6E00579338J85318j93252J787376J970215M588127K600098K015647L517800K632141
587.3E19682808J142502J33819K389794J827354O83022k93160k13318M93508J007614
596E26853943O09970j762962J084213R82475j131668j209755j445541K059631K331429
$$ plain form
604.7 528371735 528551369 527664948 527480202 527501221 527569427 527502403 526044807 526442719 527699356 529254875
614.3 529254875 530113983 531238022 533153534 533896828 536224823 537192154 536382484 537003365 539065170
623 539065170 540726471 541344032 543184509 546579514 549600677 549793816 549632187 549457436 549650536
631.7 549650536 551464653 552591629 553898239 555403061 557503281 559112816 559962273 560992393 561353149
640.4 561353149 561401215 560544739 559808311 559058762 559752464 561843910 562636642 563488159 564958496 567314301
650 567314301 568157120 567668228 566756058 565866356 566681938 566908226 567334518 568313332 570147972 572193642
659.7 572193642 572888603 573267632 572482224 571781921 571409798 570973015 571021423 569241333 566095467 571592560
669.3 571592560 575830040 578709908 579485626 578772049 578776665 578163452 576920280 577231445 578566284
$$ packed form
604.7E28371735J79634q86421j84746K1019O8206o7024j457596L97912J256637J555519
614.3E29254875Q59108J124039J915512P43294K327995R67331q09670O20881K061805
623E39065170J661301O17561J840477L395005L021163J93139j61629j74751J93100
631.7E49650536J814117J126976J306610J504822K100220J609535Q49457J030120L60756
640.4E61353149M8066q56476p36428p49549O93702K091446P92732Q51517J470337K355805
650E67314301Q42819m88892r12170q89702Q15582K26288M26292R78814J834640K045670
659.7E72193642O94961L79029p85408p00303l72123m36783M8408j780090l145866N497093
669.3E71592560M237480K879868P75718p13577M616o13213j243172L11165J334839
$$ plain form
678 578566284 580683784 582392082 585270271 588574142 589304886 588073997 586673279 585679398 583913422
686.7 583913422 583651390 584627113 586034660 587854271 588385735 588499565 588302574 589255142 588708611
695.3 588708611 585189552 582746353 582056465 582093391 580935211 580790176 582116776 582112617 581281776 579841042
705 579841042 577939110 576566162 575825653 574398994 573969040 575101471 577444496 580720749 581867676
713.7 581867676 582067795 583531113 585574074 585634041 584961395 586242027 587597122 589639473 593185310
722.3 593185310 597040215 600302582 602890167 604954910 606743164 607188950 607161293 608881264 610315132
731 610315132 611720848 614074059 617681808 620893822 621588631 622737389 623867989 624461555 624251747
739.7 624251747 623302422 622954407 621559563 622188759 624931488 626039581 625238876 624344292 623816795
$$ packed form
678E78566284K117500J708298K878189L303871P30744j230889j400718r93881j765976
686.7E83913422k62032R75723J407547J819611N31464J13830j96991R52568n46531
695.3E88708611l519059k443199o89888L6926j158180j45035J326600m159q30841j440734
705E79841042j901932j372948p40509j426659m29954J132431K343025L276253J146927
713.7E81867676K00119J463318K042961N9967o72646J280632J355095K042351L545837
722.3E93185310L854905L262367K587585K064743J788254M45786k7657J719971J433868
731F10315132J405716K353211L607749L212014O94809J148758J130600N93566k09808
739.7F24251747r49325l48015j394844O29196K742729J108093q00705q94584n27497
$$ plain form
748.4 623816795 622173271 620624275 617380257 614080162 612278595 609766045 609054832 608979034 608007851
757.1 608007851 605822525 605123901 605558548 602644806 600091476 598741341 597758446 598595085 599885864
765.7 599885864 600545654 601995811 603973846 604458504 605402069 607016144 608594208 611045074 613615036
774.4 613615036 616552963 620197067 623717346 626466866 629486275 633030434 634971085 635546303 637187004
783.1 637187004 640138397 642419739 644541397 647448196 650501099 652420425 652678528 653741455 654515152
791.8 654515152 654560089 655538330 656409531 657897339 659933548 661658859 663726273 666568375 668001404
800.5 668001404 668544540 669651794 669355621 670507202 672472305 672598190 673145142 674682693 676017990
809.1 676017990 676530457 677248917 677358322 676904297 676342316 675786514 674696350 673308334 674837570
$$ packed form
748.4F23816795j643524j548996l244018l300095j801567k512550p11213p5798r71183
757.1F08007851k185326o98624M34647k913742k553330j350135r82895Q36639J290779
765.7E99885864O59790J450157J978035M84658R43565J614075J578064K450866K569962
774.4F13615036K937927L644104L520279K749520L019409L544159J940651N75218J640701
783.1F37187004K951393K281342K121658K906799L052903J919326K58103J062927P73697
791.8F54515152M4937R78241Q71201J487808K036209J725311K067414K842102J433029
800.5F68001404N43136J107254k96173J151581J965103J25885N46952J537551J335297
809.1F76017990N12467P18460J09405m54025n61981n55802j090164j388016J529236
$$ plain form
817.8 674837570 676820602 678129196 679648895 679739990 678852158 677750473 676649551 674863892 673774033
826.5 673774033 673488693 673732376 674138794 673449173 673000870 672633057 671545639 668705978 665122147
835.2 665122147 662427750 660151520 658343353 657499313 657511368 657256012 656965942 656202316 654553909
843.9 654553909 652895966 651312180 648844376 646502609 645863190 644780731 644356155 644787369 644250107
852.5 644250107 643170166 641850967 640510864 637301407 633630524 630766678 629050484 628551979 627994728
861.2 627994728 629565239 631855469 634140358 637460976 639721718 642067795 644734192 647219315
868.9 647219315 650330048 654214478 658694611 663582230 668236084 671194153 672821655 673153839 673385773
877.6 673385773 673331223 672676544 672297058 671456375 671046219 671140366 671004028 669597397 667768631 666368866
$$ packed form
817.8F74837570J983032J308594J519699R1095q87832j101685j100922j785659j089859
826.5F73774033k85340K43683M06418o89621m48303l67813j087418k839661l583831
835.2F65122147k694397k276230j808167q44040J2055k55356k90070p63626j648407
843.9F54553909j657943j583786k467804k341767o39419j082459m24576M31214n37262
852.5F44250107j079941j319199j340103l209457l670883k863846j716194m98505n57251
861.2F27994728J570511K290230K284889L320618K260742K346077K666397K485123
868.9F47219315L110733L884430M480133M887619M653854K958069J627502L32184K31934
877.6F73385773n4550o54679l79486q40683m10156R4147j36338j406631j828766j399765
$$ plain form
887.3 666368866 663832626 659994965 656870499 655218048 653200150 651878967 651230164 650491791 649953308
895.9 649953308 648419037 646197357 643705292 641761475 639861717 637581291 635962143 634956703
903.7 634956703 634314423 633279114 631868172 630361977 627958488 624248085 619996109 615817528 612520943
912.3 612520943 610156326 607428360 604040375 600633354 597759209 594708672 591557198 588021851
920 588021851 584547348 581938667 579631348 578397255 578049850 577997284 577677803 577094955 576555634 576417351
929.7 576417351 576310539 576028481 576598015 576696053 577180557 578531227 579380760 580928459 583264656
938.4 583264656 585552864 587224770 588450851 589347458 590251045 591313248 591260300 590490646 589928398
947.1 589928398 588904686 586322670 583529549 580276260 575129967 570070190 564682045 559317322
$$ packed form
887.3F66368866k536240l837661l124466j652451k017898j321183o48803p38373n38483
895.9F49953308j534271k221680k492065j943817j899758k280426j619148j005440
903.7F34956703o42280j035309j410942j506195k403489l710403m251976m178581l296585
912.3F12520943k364617k727966l387985l407021k874145l050537l151474l535347
920E88021851l474503k608681k307319j234093l47405n2566l19481n82848n39321j38283
929.7E76417351j06812k82058N69534R8038M84504J350670Q49533J547699K336197
938.4E83264656K288208J671906J226081Q96607R03587J062203n2948p69654n62248
947.1E89928398j023712k582016k793121l253289n146293n059777n388145n364723
$$ plain form
954.8 559317322 554188957 549001045 544160767 538764191 533106346 526673508 520529518 514626007
962.5 514626007 507733612 500114784 492867050 486285172 480145493 473988800 466441345 459279518
970.2 459279518 451446724 443609085 436304970 428714523 421601181 413123322 405223999 397263451
977.9 397263451 390131187 383951302 377542343 371827164 366121864 361434326 356025925 352138329
985.6 352138329 349223366 346076012 343482780 341631470 340817871 339220085 339474869 338491096 336945267
994.3 336945267 336872444 337381897 338171730 337380524 338058052 338281822 338249969 338031654 338096275 338687515
1004 338687515 338625908 339159126 337481613 337198448 336655426 335784264 335873032 334580727 334432182 333278732
1013.6 333278732 332771187 331841202 331282845 331255531 330756264 331028633 330076180 331056328 331751671 333730202
$$ packed form
954.8E59317322n128365n187912m840278n396576n657845o432838o143990n903511
962.5E14626007o892395p618828p247734o581878o139679o156693p547455p161827
970.2D59279518p832794p837639p304115p590447p113342q477859p899323p960548
977.9C97263451p132264o179885o408959n715179n705300m687538n408401l887596
985.6C52138329k914963l147354k593232j851310q13599j597786K54784r83773j545829
994.3C36945267p2823N09453P89833p91206O77528K23770l1853k18315O4621N91240
1004C38687515o1607N33218j677513k83165n43022q71162Q8768j292305j48545j153450
1013.6C33278732n07545r29985n58357k7314m99267K72369r52453R80148O95343J978531
$$ plain form
1023.2 333730202 335793190 336401215 337986450 338708649 340340881 341035500 342763863 343393059 343482246
1031.9 343482246 345013161 345834961 347989998 348729782 350276794 350987549 351276283 351173897 349995003
1040.6 349995003 350882339 350801163 352173271 352744408 353578453 354415474 354465828 355519714 355176773 356862335
1050.2 356862335 357410698 358601837 360135422 361730347 364640312 366594200 370680046 373157120
1058 373157120 376175499 379545822 382974014 386804352 389857063 394260902 396770630 399682808 402557793
1066.6 402557793 405959091 408320503 408006248 405852776 400568314 396095467 390983734 387225266
1074.4 387225266 382955551 379252052 378213425 376286812 377190857 376761169 377126198 377343483 377578735
1083 377578735 379272881 379665871 381739388 382690086 385869217 388824959 391135139 394034042 396221581
$$ packed form
1023.2C33730202K062988O08025J585235P22199J632232O94619J728363O29196Q9187
1031.9C43482246J530915Q21800K155037P39784J547012P10755K88734j02386j178894
1040.6C49995003Q87336q1176J372108N71137Q34045Q37021N0354J053886l42941J685562
1050.2C56862335N48363J191139J533585J594925K909965J953888M085846K477074
1058C73157120L018379L370323L428192L830338L052711M403839K509728K912178K874985
1066.6D02557793L401298K361412l14255k153472n284462m472847n111733l758468
1074.4C87225266m269715l703499j038627j926613R04045m29688L65029K17285K35252
1083C77578735J694146L92990K073517R50698L179131K955742K310180K898903K187539
$$ plain form
1091.7 396221581 399336395 400572014 403782959 406338806 407919884 409312248 410295792 412207413
1099.4 412207413 413338890 415419693 415101166 415428200 415712624 415186539 415706558 415702820 417663841
1108.1 417663841 418421097 420192299 422109108 424322014 426991768 428064423 430567894 432454414
1115.8 432454414 435072708 436438599 438209305 440751762 441682701 442859573 442643700 444057312 445438385
1124.5 445438385 446675110 447992744 449202347 451516190 452940750 455973320 458492088 460535355
1132.2 460535355 462579117 464140167 465810165 466545448 466574287 465123253 464245567 462374725 459858055
1140.9 459858055 457052193 453798981 451880035 448539619 445708389 441996384 438171349 435673828
1148.6 435673828 433659706 431858597 428786354 427586632 425905266 424869499 423990364 423188324 424007721
$$ packed form
1091.7C96221581L114814J235619L210945K555847J581078J392364R83544J911621
1099.4D12207413J131477K080803l18527L27034K84424n26085N20019l738J961021
1108.1D17663841P57256J771202J916809K212906K669754J072655K503471J886520
1115.8D32454414K618294J365891J770706K542457R30939J176872k15873J413612J381073
1124.5D45438385J236725J317634J209603K313843J424560L032570K518768K043267
1132.2D60535355K043762J561050J669998P35283K8839j451034q77686j870842k516670
1140.9D59858055k805862l253212j918946l340416k831230l712005l825035k497521
1148.6D35673828k014122j801109l072243j199722j681366j035767q79135q02040Q19397
$$ plain form
1157.3 424007721 423908691 424805832 425045280 426214638 427372398 428878174 431611176 434117508 438009148
1166 438009148 440911751 444578247 448221817 452520409 457755089 463058853 469221649 474193764 479981346
1174.6 479981346 485492287 490628281 495561295 500696373 506865540 511818275 516157684 520765877
1182.4 520765877 526072998 530737953 535290031 540061417 543888283 547081375 549719391 552706680
1190.1 552706680 554999695 556586227 558048744 559221573 560654564 561681404 562331505 562422295 562601814
1198.8 562601814 563177185 563153572 563034668 563572884 564602737 565185165 565652390 566477051 567796822
1207.4 567796822 569092751 570171700 571278572 572031326 573020668 573881416 575170021 576938438 578361244
1216.1 578361244 580007057 581486053 582844925 583789940 584124832 584291573 584133873 584010162 584048347
$$ packed form
1157.3D24007721r9030Q97141K39448J169358J157760J505776K733002K506332L891640
1166D38009148K902603L666496L643570M298592N234680N303764O162796M972115N787582
1174.6D79981346N510941N135994M933014N135078O169167M952735M339409M608193
1182.4E20765877N307121M664955M552078M771386L826866L193092K638016K987289
1190.1E52706680K293015J586532J462517J172829J432991J026840O50101R0790J79519
1198.8E62601814N75371k3613j18904N38216J029853N82428M67225Q24661J319771
1207.4E67796822J295929J078949J106872P52754R89342Q60748J288605J768417J422806
1216.1E78361244J645813J478996J358872R45015L34892J66741j57700j23711L8185
$$ plain form
1224.8 584048347 584104271 583493652 582736435 582874641 582482758 581252480 580257988 579292068 578008347
1233.5 578008347 577156754 576841545 576264191 575386162 574676094 574449234 574476128 574524574 574175758 573649178
1243.1 573649178 573166389 572966156 573348694 573740463 574183235 574934769 576215668 577090111 577545738
1251.8 577545738 578368874 578885307 579290314 579838982 580343895 580588646 580892372 581392212 581510582 582083626
1261.4 582083626 582976074 583416939 583936310 584406815 584490395 584885635 585756683 586693649 587621422 588270226
1271.1 588270226 589047089 590393028 591637726 592311401 592605782 592895813 593138885 593089180 593328362
1279.8 593328362 593414421 592936821 592779808 593007164 593363419 593357887 593110962 593067398 593170128 593129501
1289.4 593129501 592768478 592424812 592074738 591872330 591405525 590891571 590746803 590130424 589558144 589541397
$$ packed form
1224.8E84048347N5924o10619p57217J38206l91883j230278r94492r65920j283721
1233.5E78008347q51593l15209n77354q78029p10068k26860K6894M8446l48816n26580
1243.1E73649178m82789k00233L82538L91769M42772P51534J280899Q74443M55627
1251.8E77545738Q23136N16433M05007N48668N04913K44751L03726M99840J18370N73044
1261.4E82083626Q92448M40865N19371M70505Q3580L95240Q71048R36966R27773O48804
1271.1E88270226P76863J345939J244698O73675K94381K90031K43072m9705K39182
1279.8E93328362Q6059m77600j57013K27356L56255n532k46925m3564J02730m0627
1289.4E93129501l61023l43666l50074k02408m66805n13954j44768o16379n72280j6747
$$ plain form
1299 589541397 589272118 588079834 586973076 586323776 585339966 584471931 583870888 583392906 582893410 582380562
1308.7 582380562 581689110 580717888 579921989 578894119 577747040 576601944 576067924 576831894 576796989
1317.4 576796989 575822525 575353127 574817886 574556274 574454155 573964767 572934036 571323586 569746857
1326 569746857 568284340 566813316 565270538 563949699 562499695 560562477 559197426 558112259 556980095
1334.7 556980095 555901947 554373283 552658234 551765404 551611519 551683884 551863823 552214928 552889519
1343.4 552889519 553067093 553324699 553312492 553205299 553133316 552401772 552284698 552378502 552772369 553083000
1353.1 553083000 552993813 552441368 551726227 551867104 551080704 550174103 549401016 547817039 547117462 546945992
1362.7 546945992 546038704 545396385 545582733 545375290 545346642 544728050 543442688 543437614 542859955 542777710
$$ packed form
1299E89541397k69279j192284j106758o49300r83810q68035o01043m77982m99496n12848
1308.7E82380562o91452r71222p95899j027870j147079j145096n34020P63970l4905
1317.4E76796989r74464m69398n35241k61612j02119m89388j030731j610450j576729
1326E69746857j462517j471024j542778j320839j450004j937218j365051j085167j132164
1334.7E56980095j078148j528664j715049q92830j53885P2365J79939L51105O74591
1343.4E52889519J77574K57606j2207j07193p1983p31544j17074R3804L93867L10631
1353.1E53083000q9187n52445p15141J40877p86400r06601p73087j583977o99577j71470
1362.7E46945992r07288o42319J86348k07443k8648o18592j285362n074n77659q2245
$$ plain form
1372.3 542777710 542852097 542493324 542944984 544374084 545843964 546117821 547209015 547865753 548026810
1381 548026810 548570366 548685532 549031715 550286026 552625542 554276619 555803871 557868195 559999199
1389.7 559999199 561268158 562023582 563116760 563777237 563254585 561724358 562673340 563368950 563399963
1398.4 563399963 562595558 562384987 563158951 562350082 561723976 560756683 558752060 558319397 558666649
1407.1 558666649 558731079 557489929 556989326 556704750 556054268 555292244 554635086 553938599 552603607
1415.7 552603607 551897774 551239090 551077042 547638092 548413429 551235046 551781273 551789131 550005226
1424.4 550005226 550668755 551781349 551229477 551747093 551750603 551744881 552101974 553595924 554504547 554770966
1434.1 554770966 556077881 556324501 554466934 554618607 557303352 558538818 559040489 560009346 560444107
$$ packed form
1372.3E42777710P4387l58773M51660J429100J469880K73857J091194O56738J61057
1381E48026810N43556J15166L46183J254311K339516J651077J527252K064324K131004
1389.7E59999199J268959P55424J093178O60477n22652j530227R48982O95610L1013
1398.4E63399963q04405k10571P73964q08869o26106r67293k004623m32663L47252
1407.1E58666649O4430j241150n00603k84576o50482p62024o57158o96487j334992
1415.7E52603607p05833o58684j62048l438950P75337K821617N46227P858j783905
1424.4E50005226O63529J112594n51872N17616L510n722L57093J493950R08623K66419
1434.1E54770966J306915K46620j857567J51673K684745J235466N01671R68857M34761
$$ plain form
1442.7 560444107 561636467 562052078 563007622 563355103 562390099 560649948 560852737 561671562 560644875
1451.4 560644875 560321312 559909286 560296745 559434357 557408829 554287300 551577301 556033745 556763382
1460.1 556763382 559045296 559682045 560326538 562409172 560727386 562747612 564946136 568354378 570696716
1468.8 570696716 573772011 577604942 579129639 582897987 586129456 592517738 596134949 599901161
1476.5 599901161 603747749 607406235 611521721 614171982 617623138 619658051 623181038 626001816
1484.2 626001816 628376999 631103058 631209412 633705292 635133934 635547791 636354408 640509949 644375992
1492.9 644375992 645923691 648090515 648194809 646210022 648114166 649483109 649552460 651472092 653651047
1501.6 653651047 654280624 655652771 657121124 660068207 658267670 650878143 653227463 655415955
$$ packed form
1442.7E60444107J192360M15611R55544L47481r65004j740151K02789Q18825j026687
1451.4E60644875l23563m12026L87459q62388k025528l121529k709999M456444P29637
1460.1E56763382K281914O36749O44493K082634j681786K020226K198524L408242K342338
1468.8E70696716L075295L832931J524697L768348L231469O388282L617211L766212
1476.5E99901161L846588L658486M115486K650261L451156K034913L522987K820778
1484.2F26001816K375183K726059J06354K495880J428642M13857Q06617M155541L866043
1492.9F44375992J547699K166824J04294j984787J904144J368943O9351J919632K178955
1501.6F53651047O29577J372147J468353K947083j800537p389527K349320K188492
$$ plain form
1509.3 655415955 658113403 659603195 660647964 659898148 662168655 664065247 663630905 663397293 661707535
1518 661707535 666792603 669510345 667047501 664949036 665233688 669678040 671254425 670676956 671036987
1526.6 671036987 672844009 673247375 674191132 676303024 675933380 675877991 673408127 671972275 675161667
1535.3 675161667 676966171 679087677 680265427 675508041 667009201 672194748 672139587 672238159 676931686
1544 676931686 677488556 677174072 679805832 681661072 682756042 682657471 680803452 681692429 682921143
1552.7 682921143 682887421 679380798 679176254 683048401 685520248 677793274 670972977 674162369 679768143
1561.4 679768143 682422333 683451004 682809525 679629669 679136276 680152588 680500717 678959808 673515625
1570 673515625 676123810 678525848 678153381 677312546 677074051 674059067 664031525 667184830 669401093
$$ packed form
1509.3F55415955K697448J489792J044769p49816K270507J896592m34342k33612j689758
1518F61707535N085068K717742k462844k098465K84652M444352J576385n77469L60031
1526.6F71036987J807022M03366R43757K111892l69644n5389k469864j435852L189392
1535.3F75161667J804504K121506J177750m757386q498840N185547n5161R8572M693527
1544F76931686N56870l14484K631760J855240J094970r8571j854019Q88977J228714
1552.7F82921143l3722l506623k04544L872147K471847p726974o820297L189392N605774
1561.4F79768143K654190J028671o41479l179856m93393J016312L48129j540909n444183
1570F73515625K608185K402038l72467q40835k38495l014984j0027542L153305K216263
$$ plain form
1578.7 669401093 669117050 668653336 667646408 666812973 665478287 664107819 661884308 659431000 657459869
1587.4 657459869 655151596 653618088 651612320 650181961 648668442 647729263 646074753 643180695
1595.1 643180695 641259308 638311119 635965309 633204575 631126366 629161301 627164764 625532799
1602.8 625532799 623103065 621903038 619801292 617547264 614444733 612423706 609661865 606675987
1610.5 606675987 606148911 603948593 602917709 600987015 600922546 600341110 590772896 592589073 592304459
1619.2 592304459 591066589 589061584 588825531 587379150 583065758 584151039 584728050 585697403 582814865
1627.9 582814865 581542358 581575661 580462112 580122337 579087982 579983330 580713692 577308693 576215782
1636.6 576215782 578181915 579283066 580607796 581721764 581195221 582103348 581731720 583163338 584719162
$$ packed form
1578.7F69401093k84043m63714j006928q33435j334686j370468k223511k453308j971131
1587.4F57459869k308273j533508k005768j430359j513519r39179j654510k894058
1595.1F43180695j921387k948189k345810k760734k078209j965065j996537j631965
1602.8F25532799k429734j200027k101746k254028l102531k021027k761841k985878
1610.5F06675987n27076k200318j030884j930694o4469n81436r568214J816177k84614
1619.2E92304459j237870k005005k36053j446381m313392J085281N77011R69353k882538
1627.9E82814865j272507L3303j113549l39775j034355Q95348P30362l404999j092911
1636.6E76215782J966133J101151J324730J113968n26543R08127l71628J431618J555824
$$ plain form
1645.3 584719162 582312317 582940674 583628235 587771034 590614815 593429756 595477142 589649734 587134857
1653.9 587134857 592672958 597434845 600621567 603597374 605225220 607096367 609340897 611875267
1661.6 611875267 613462677 613196449 616273842 618998795 621359940 623733521 625944366 625667114 627481384
1670.3 627481384 631706161 633704681 636348763 639257469 639767685 639342728 643243256 646910477 649171295
1679 649171295 651269226 652506866 655851440 659533310 657915802 649670792 656383743 662839966 666527100
1687.7 666527100 667944565 669419785 670767746 672834778 675066681 676640472 679217377 680183029
1695.4 680183029 673588486 676611252 680669022 684890060 683451614 677669601 683254166 686941757
1703.1 686941757 687847595 686778564 687001724 685377426 686338043 688903656 689459686 688875732 689534836
$$ packed form
1645.3E84719162k406845O28357O87561M142799K843781K814941K047386n827408k514877
1653.9E87134857N538101M761887L186722K975807J627846J871147K244530K534370
1661.6F11875267J587410k66228L077393K724953K361145K373581K210845k77252J814270
1670.3F27481384M224777J998520K644082K908706N10216m24957L900528L667221K260818
1679F49171295K097931J237640L344574L681870j617508q245010O712951O456223L687134
1687.7F66527100J417465J475220J347961K067032K231903J573791K576905R65652
1695.4F80183029o594543L022766M057770M221038j438446n782013N584565L687591
1703.1F86941757R05838j069031K23160j624298R60617K565613N56030n83954O59104
$$ plain form
1711.8 689534836 690792618 691420593 689472809 687887878 690535278 690161896 683133698 687225800 690501709
1720.5 690501709 692105484 692944183 693135605 693040390 693664398 694169769 693785400 694043503 694798279 693227005
1730.1 693227005 692439117 694957047 697283630 693387070 688537827 693079300 696165848 696867447 698072128
1738.8 698072128 696478348 694540863 698321609 700616226 700178680 701351166 703849030 705125122
1746.5 705125122 705629044 706477051 707094574 710333939 711155014 712018204 716525116 719467163 722097244
1755.2 722097244 724685669 724701385 726046906 728473511 730315247 732101440 730809631 731314392 734938736
1763.9 734938736 737151260 738781891 741166306 743090515 741220703 741920547 743986816 742338333
1771.6 742338333 739829254 740287476 744780579 747433319 747603989 750095367 751220093 751907730 751646652
$$ packed form
1711.8F89534836J257782O27975j947784j584931K647400l73382p028198M092102L275909
1720.5F90501709J603775Q38699J91422r5215O24008N05371l84369K58103P54776j571274
1730.1F93227005p87888K517930K326583l896560m849243M541473L086548P01599J204681
1738.8F98072128j593780j937485L780746K294617m37546J172486K497864J276092
1746.5G05125122N03922Q48007O17523L239365Q21075Q63190M506912K942047K630081
1755.2G22097244K588425J5716J345521K426605J841736J786193j291809N04761L624344
1763.9G34938736K212524J630631K384415J924209j869812O99844K066269j648483
1771.6G42338333k509079M58222M493103K652740J70670K491378J124726O87637k61078
$$ plain form
1780.3 751646652 750484543 751155014 752034149 753105469 752614746 753243484 755491562 756890869 757457047
1788.9 757457047 758179321 757984695 757189636 755361481 755166626 757761993 758316574 758209000 760440750
1797.6 760440750 762810059 763267212 762242355 763271942 762731171 762781601 763436737 763061066 763892746
1806.3 763892746 764654694 765101929 766331024 767710953 766670456 766612701 767429047 767214279 767635727
1815 767635727 767479553 767660370 767468567 768133545 769604797 770179901 771182175 770872421 771419296 772019806
1824.6 772019806 768989716 768809280 770369034 771363068 770242081 767994766 770377274 773146210 773732452
1833.3 773732452 773666077 773442764 773259125 773031540 772221909 772480164 772619247 773581848 774442291 775466385
1842.9 775466385 776181717 771299057 772167740 773797760 773295898 772756882 773136673 773910294 774057922
$$ packed form
1780.3G51646652j162109O70471Q79135J071320m90723O28738K248078J399307N66178
1788.9G57457047P22274j94626p95059j828155j94855K595367N54581j07574K231750
1797.6G60440750K369309M57153j024857J029587n40771N0430O55136l75671Q31680
1806.3G63892746P61948M47235J229095J379929j040497n7755Q16346k14768M21448
1815G67635727j56174J80817j91803O64978J471252N75104J002274l09754N46875O00510
1824.6G72019806l030090j80436J559754R94034j120987k247315K382508K768936N86242
1833.3G73732452o6375k23313j83639k27585q09631K58255J39083R62601Q60443J024094
1842.9G75466385P15332m882660Q68683J630020n01862n39016L79791P73621J47628
$$ plain form
1851.6 774057922 774684448 775325546 776051636 775776291 775365829 775448837 774487152 774319305 774416504 774923706
1861.3 774923706 775345612 775713043 776125565 776203766 776638107 775978470 775546036 773805923 772698212
1869.9 772698212 774040070 775119095 776068192 776442719 777114334 777331009 777202988 776877823 776697998
1878.6 776697998 776757660 776176987 776586838 776882629 777063980 777150650 777397766 777836380 777655106 778690948
1888.3 778690948 778548126 776570282 776804199 777600708 777564240 777853775 778233948 777801590 778435974 778595963
1897.9 778595963 778644791 778747864 778473511 778455963 778105850 778357239 777917633 777984314 778856735 779040527
1907.6 779040527 779287033 778789291 777809525 777619324 778238220 778045120 778143845 778471985 778762970 780230865
1917.2 780230865 779286346 778396149 778828506 778663483 778383102 776990128 777111206 778386993 778722305
$$ packed form
1851.6G74057922O26526O41098P26090k75345m10462Q3008r61685j67847R7199N07202
1861.3G74923706M21906L67431M12522P8201M34341o59637m32434j740113j107711
1869.9G72698212J341858J079025R49097L74527O71615K16675j28021l25165j79825
1878.6G76697998N9662n80673M09851K95791J81351Q6670K47116M38614j81274J035842
1888.3G78690948j42822j977844K33917P96509l6468K89535L80173m32358O34384J59989
1897.9G78595963M8828J03073k74353j7548l50113K51389m39606O6681Q72421J83792
1907.6G79040527K46506m97742r79766j90201O18896j93100R8725L28140K90985J467895
1917.2G80230865r44519q90197M32357j65023k80381j392974J21078J275787L35312
$$ plain form
1925.9 778722305 778538818 779040375 779402466 779653091 779672241 779051285 779011307 778323975 777974777 778296051
1935.5 778296051 778715134 779130783 779203491 779715958 779581146 780063629 779348450 776810150 777410965 778384781
1945.2 778384781 778497772 778199387 778759003 779532166 779739075 779975510 779704742 779311066 779052658 778861923
1954.8 778861923 778324509 778242493 778538818 778604126 779247131 779947891 780211639 779874802 779699402 779466782
1964.5 779466782 778829880 778305511 777543793 777467422 778233414 779227371 779823685 780177917 780433121 780359879
1974.1 780359879 780013046 779320450 778771896 778602829 779040833 779275208 779225159 779593048 780236664 780814438
1983.7 780814438 780722351 780383606 779577332 778906784 778388138 777864914 778462143 778755264 778681030 779561768
1993.4 779561768 780487823 780438766 780036240 779573288 778769608 778544083 778243179 778242187 778708725 778978729
$$ packed form
1925.9G78722305j83487N01557L62091K50625J9150o20956l9978o87332l49198L21274
1935.5G78296051M19083M15649P2708N12467j34812M82483p15179k538300O00815R73816
1945.2G78384781J12991k98385N59616P73163K06909K36435k70768l93676k58408j90735
1954.8G78861923n37414q2016K96325O5308O43005P00760K63748l36837j75400k32620
1964.5G79466782o36902n24369p61718p6371P65992R93957N96314L54232K55204p3242
1974.1G80359879l46833o92596n48554j69067M38004K34375n0049L67889O43616N77774
1983.7G80814438r2087l38745q06274o70548n18646n23224N97229K93121p4234Q80738
1993.4G79561768R26055m9057m02526m62952q03680k25525l00904r92M66538K70004
$$ plain form
2003 778978729 779387741 779648132 779834213 779644241 779188614 778583603 777956848 777643738 777452698 777536469
2012.7 777536469 778093643 778735123 778844833 778689041 778122330 777853012 777654266 776899414 776381454 775927200
2022.3 775927200 775931168 776181564 776586227 776941223 777185440 777436523 776755600 776196518 775800095 775504379
2032 775504379 775211716 774826279 774867401 774754715 775112991 775517807 775701141 775582428 775289536 774886780
2041.6 774886780 774192581 774127655 773808899 773764725 773804245 773842392 774233704 774074402 774261322 774151611
2051.2 774151611 773989029 774017944 773912659 773517685 772908249 773346863 773762589 774195938 774204865 773790512
2060.9 773790512 773944626 773907166 774047852 773675308 772974319 772928162 773241882 773468170 773715591 774084244
2070.5 774084244 774056091 774046249 773975983 774226074 774290695 773822174 773772125 773877487 773865891 773739319 773917694
$$ packed form
2003G78978729M09012K60391J86081j89972m55627o05011o26755l13110j91040Q3771
2012.7G77536469N57174O41480J09710j55792n66711k69318j98746p54852n17960m54254
2022.3G75927200L968K50396M04663L54996K44217K51083o80923n59082l96423k95716
2032G75504379k92663l85437M1122j12686L58276M04816J83334j18713k92892m02756
2041.6G74886780o94199o4926l18756m4174L9520L8147L91312j59302J86920j09711
2051.2G74151611j62582K8915j05285l94974o09436M38614M15726M33349Q927m14353
2060.9G73790512J54114l7460J40686l72544p00989m6157L13720K26288K47421L68653
2070.5G74084244k8153r842p0266K50091O4621m68521n0049J05362j1596j26572J78375
$$ plain form
2081.1 773917694 773982010 774178162 774380417 774082870 774036713 773935623 773996582 773991928 773890152 773929749 774123306
2091.7 774123306 774506378 774511414 774255371 773955307 774353485 774589157 774431992 774411926 774239426 774692535
2101.4 774692535 775046539 775094757 774922256 774660416 774731140 774940491 774868927 774486771 774716187 774700470
2111 774700470 774823380 775081253 775034180 775200653 774839020 774877701 775040436 775063019 775163956 775099182 775170975
2121.6 775170975 775087662 774922867 774599228 774637680 774497452 774446182 774737167 774732056 775004578 775005798 775161285
2132.3 775161285 775301361 775362549 775270157 774630432 774421005 774374084 774424210 774187164 774049377 774325256
2141.9 774325256 774980392 775601883 775308609 775331879 775359802 775092087 774734802 774606781 774800186 774936523
2151.5 774936523 775393600 775373688 775298920 775126877 775048981 774976349 774596863 774973679 775223465 775199661
$$ packed form
2081.1G73917694O4316J96152K02255k97547m6157j01090O0959m654j01776L9597J93557
2091.7G74123306L83072N036k56043l00064L98178K35672j57165k0066j72500M53109
2101.4G74692535L54004M8218j72501k61840P0724K09351p1564l82156K29416j5717
2111G74700470J22910K57873m7073J66473l61633L8681J62735K2583J00937o4774P1793
2121.6G75170975q3313j64795l23639L8452j40228n1270K90985n111K72522J220J55487
2132.3G75161285J40076O1188r2392o39725k09427m6921N0126k37046j37787K75879
2141.9G74325256O55136O21491k93274K3270K7923k67715l57285j28021J93405J36337
2151.5G74936523M57077j9912p4768j72043p7896p2632l79486L76816K49786k3804
$$ plain form
2161.2 775199661 774788055 775060196 775954819 776018143 776121368 776071014 776215820 776142883 775757751 775739441
2170.8 775739441 775879745 776010284 776107101 776866531 777336807 777424545 777509995 777379532 777039795 776791763
2180.5 776791763 777120590 777368164 777702560 777840958 778226700 778532181 778524017 779095535 779247284 779095459
2190.1 779095459 778313599 777903595 778209839 778304367 778684006 778920975 779274368 779496002 779918671 780023956
2199.8 780023956 779755402 779834900 779652710 779581146 779031830 779175644 779869919 780061798 780427170 780642548
2209.4 780642548 780939713 780916367 780918121 780846252 780655441 780453262 780135040 780379639 780786057 781341553
2219 781341553 781440277 781670151 781973038 781746826 781613693 781257248 781372986 781578827 781522598 781436844
2228.7 781436844 781846313 782442017 782669983 782965317 782490311 782209015 782040558 781805191 781674500 781511078
$$ packed form
2161.2G75199661m11606K72141Q94623O3324J03225n0354J44806p2937l85132j8310
2170.8G75739441J40304J30539R6817P59430M70276Q7738Q5450j30463l39737k48032
2180.5G76791763L28827K47574L34396J38398L85742L05481q164N71518J51749j51825
2190.1G79095459p81860m10004L06244R4528L79639K36969L53393K21634M22669J05285
2199.8G80023956k68554P9498j82190p1564n49316J43814O94275J91879L65372K15378
2209.4G80642548K97165k3346J754p1869j90811k02179l18222K44599M06418N55496
2219G81341553R8724K29874L02887k26212j33133l56445J15738K05841n6229q5754
2228.7G81436844M09469N95704K27966K95334m75006k81296j68457k35367j30691j63422
$$ plain form
2238.3 781511078 781905670 781935730 782281265 782407532 782415695 782632751 782354965 782201996 781982269 782279663
2248 782279663 782236023 782174149 782310867 782366257 782797470 782607651 782964630 783161697 782750473 782592697
2257.6 782592697 782491531 782442169 782253494 782450180 782643051 782951736 783056870 783320160 783548203 783013306
2267.3 783013306 782748795 782440948 782508774 782632675 782841721 783060226 783281250 783869705 783772736 783657990
2276.9 783657990 783341827 783531342 783661118 783273849 783198853 782680283 783046036 783598633 783814697 783563995
2286.5 783563995 783140411 783212585 782924576 782964554 782738342 782927322 783059540 782886200 783133469 783176117
2296.2 783176117 783374710 782747116 782773514 782675629 782147141 782546539 782345810 782314682 782399902 782903748
2305.8 782903748 783157425 783495865 783842926 783257141 783378296 782304916 781523590 781743546 782078476
$$ packed form
2238.3G81511078L94592L0060L45535J26267Q163K17056k77786j52969k19727K97394
2248G82279663m3640o1874J36718N5390M31213j89819L56979J97067m11224j57776
2257.6G82592697j01166m9362j88675J96686J92871L08685J05134K63290K28043n34897
2267.3G83013306k64511l07847O7826J23901K09046K18505K21024N88455r6969j14746
2276.9G83657990l16163J89515J29776l87269p4996n18570L65753N52597K16064k50702
2286.5G83563995m23584P2174k88009L9978k26212J88980J32218j73340K47269M2648
2296.2G83176117J98593o27594K6398r7885n28488L99398k00729l1128Q5220N03846
2305.8G82903748K53677L38440L47061n85785J21155j073380p81326K19956L34930
$$ plain form
2314.5 782078476 782620697 782372818 782793198 782296524 781816711 781893387 781489792 781838913 781349335 780255737
2324.2 780255737 779679642 780435333 781118469 781184082 781046600 780785828 781095276 780377426 779563980 778691254
2333.8 778691254 778356857 778563156 777549210 777291870 777794800 778171387 778964157 779976349 779729309
2342.5 779729309 778619461 778443375 777992249 777554245 778036804 778497086 779609985 780419312 780018921
2351.2 780018921 780226822 779508743 778932571 777625504 776319199 777394562 775238724 775391617 777951431
2359.8 777951431 778404083 777794800 776493835 776224823 774663925 775081329 775752411 775354385 775742569
2368.5 775742569 775868301 776369629 776501541 777057495 777270432 777712936 777668762 777035599 777116165 776804657
2378.2 776804657 777087631 777105484 777015839 777474518 777619476 777349167 776942902 777110291 777097549 777042465
$$ packed form
2314.5G82078476N42221k47879M20380m96674m79813P6676m03595L49121m89578j093598
2324.2G80255737n76095P55691O83136O5613j37482k60772L09448p17850q13446q72726
2333.8G78691254l34397K06299j013946k57340N02930L76587P92770J012192k47040
2342.5G79729309j109848j76086m51126m38004M82559M60282J112899Q09327m00391
2351.2G80018921K07901p18079n76172j307067j306305J075363k155838J52893K559814
2359.8G77951431M52652o09283j300965k69012j560898M17404O71082l98026L88184
2368.5G75742569J25732N01328J31912N55954K12937M42504m4174o33163Q0566l11508
2378.2G76804657K82974J7853q9645M58679J44958k70309m06265J67389j2742n5084
$$ plain form
2387.8 777042465 776659546 776324615 776674805 776717072 776921921 776875229 776814575 776740570 776416931 776208954
2397.4 776208954 775921021 775928574 775670547 775408096 775341187 775414429 775501785 775521774 775522690 775112610 774945145
2408.1 774945145 774516449 774252548 774193268 773875885 774168549 774386292 774300079 774125443 773787384 773263321
2417.7 773263321 773290100 773260498 772634735 772241821 771786346 772052841 772369995 772379456 772348633 772235794
2427.3 772235794 772228775 771412811 771003036 770665359 770324478 770375443 769990387 769918442 769903030 769962540 769849396
2438 769849396 769709473 769497833 768937912 768484879 767966461 767960968 767915726 767723770 767561111 767531891 767410126
2448.6 767410126 766684113 766449814 766265488 765860901 765512695 765511017 765365753 765110550 765631866 765391998
2458.2 765391998 764889297 764710083 764512405 764366302 763996201 763708420 763252106 763169861 763188934 763109055
$$ packed form
2387.8G77042465l82919l34931L50190M2267K04849m6692o0654p4005l23639k07977
2397.4G76208954k87933P553k58027k62451o6909P3242Q7356J9989R16m10080j67465
2408.1G74945145m28696k63901n9280l17383K92664K17743q6213j74636l38059n24063
2417.7G73263321K6779k9602o25763l92914m55475K66495L17154R461l0823j12839
2427.3G72235794p019q15964m09775l37677l40881N0965l85056p1945j5412N9510j13144
2438G69849396j39923k11640n59921m53033n18418n493m5242j91956j62659k9220j21765
2448.6G67410126p26013k34299j84326m04587l48206j678j45264k55203N21316k39868
2458.2G65391998n02701j79214j97678j46103l70101k87781m56314q2245J9073p9879
$$ plain form
2467.8 763109055 763139801 763103790 763035507 762738190 762543106 761997299 761434326 761043777 760927582 761090622
2477.5 761090622 761012955 761284866 761343155 761183929 760968323 760706024 760156708 759278412 759131317 759059525
2487.1 759059525 759013901 759158859 759422073 759299927 758722076 758837051 758638458 758120346 758016281 757739792
2496.8 757739792 757200699 757125931 757458725 757628860 757857208 757714005 757416000 757137604 756550217 755920486
2506.4 755920486 755889893 756124573 755787125 755979385 756526566 756572418 756309509 756236801 756192245 755705261
2516.1 755705261 755457993 754876633 754247513 754057922 754188690 754754333 754788818 754381714 753980255 753930969
2525.7 753930969 753842621 753470535 752990570 752304153 751765900 751667252 752446671 752867203 752771454 752559967
2535.4 752559967 751987991 751639938 750908661 750390549 750187073 750069962 750407715 750579605 750656357 750672531
$$ packed form
2467.8G63109055L0746l6011o8283k97317j95084n45807n62973l90549j16195J63040
2477.5G61090622p7667K71911N8289j59226k15606k62299n49316q78296j47095p1792
2487.1G59059525m5624J44958K63214j22146n77851J14975j98593n18112j04065k76489
2496.8G57739792n39093p4768L32794J70135K28348j43203k98005k78396n87387o29731
2506.4G55920486l0593K34680l37448J92260N47181M5852k62909p2708m4556m86984
2516.1G55705261k47268n81360o29120j89591J30768N65643L4485m07104m01459m9286
2525.7G53930969q8348l72086m79965o86417n38253r8648P79419M20532r5749k11487
2535.4G52559967n71976l48053p31277n18112k03476j17111L37753J71890P6752J6174
$$ plain form
2545 750672531 750677643 750247269 749360352 748688126 748427124 748094177 747665710 747829361 747974548 748001175
2554.6 748001175 747965851 747885132 747676773 747087860 746697464 746358414 745954056 745365982 745208054 745484009
2564.3 745484009 745473251 745389404 745066681 744835892 744421616 743792572 743341751 743180618 743270264 743318405
2573.9 743318405 743631287 743353958 742797699 742730637 742712860 742634811 742089615 741587296 741281052 740803528
2583.6 740803528 740498962 740557861 740815430 740899200 740544968 740290070 740470886 740306702 739845886 739437256
2593.2 739437256 739232254 739000549 738760757 738880310 738886261 738797302 738506927 738527985 738412857 737500458
2602.9 737500458 737083817 737153549 737076569 736632462 736699982 736914291 736540451 736356354 735874023 735575867
2612.5 735575867 735449066 734904251 734467545 734350357 734482498 734287109 733690948 733330612 733311157 732808838
$$ packed form
2545G50672531N112m30374q86917o72226k61002l32947m28467J63651J45187K6627
2554.6G48001175l5324q0719k08359n88913l90396l39050m04358n88074j57928K75955
2564.3G45484009j0758q3847l22723k30789m14276o29044m50821j61133Q9646M8141
2573.9G43318405L12882k77329n56259o7062j7777p8049n45196n02319l06244m77524
2583.6G40803528l04566N8899K57569Q3770l54232k54898J80816j64184m60816m08630
2593.2G39437256k05002k31705k39792J19553N951q8959k90375K1058j15128r12399
2602.9G37500458m16641O9732p6980m44107O7520K14309l73840j84097m82331k98156
2612.5G35575867j26801n44815m36706j17188J32141j95389n96161l60336j9455n02319
$$ plain form
2622.1 732808838 732201080 731779480 731396484 731086502 730570450 730703430 730737610 730327835 729786987 729169083
2631.8 729169083 729077225 728718567 728205795 727398605 726875763 726865845 726302338 725795364 725377197 725120544
2641.4 725120544 724914932 724681091 724325027 723923874 723628235 722793427 722403488 722332230 721917038 721675262
2651.1 721675262 721610565 721337204 720761032 720229645 719577637 718917999 718230972 718023071 718068085 717647629
2660.7 717647629 717477341 717535629 717566681 717273865 716822891 716081009 715361633 715093918 714523544 714124451
2670.4 714124451 713773193 713747940 714079971 714056854 713682175 713035889 713029175 713022995 712422562 711502380 710825729
2681 710825729 710573044 710271301 710258026 709934082 709837646 709937210 709469681 708917770 708134537 707643280
2690.6 707643280 707548447 707525787 707237091 706864471 706918259 706974335 706719437 706134262 705587845 705050888
$$ packed form
2622.1G32808838o07758m21600l82996l09982n16052J32980L4180m09775n40848o17904
2631.8G29169083r1858l58658n12772q07190n22842r918n63507n06974m18167k56653
2641.4G25120544k05612k33841l56064m01153k95639q34808l89939p1258m15192k41776
2651.1G21675262o4697k73361n76172n31387o52008o59638o87027k07901M5014m20456
2660.7G17647629j70288N8288L1052k92816m50974p41882p19376k67715n70374l99093
2670.4G14124451l51258k5253L32031k3117l74679o46286o714o180o00433r20182o76651
2681G10825729k52685l01743j3275l23944r6436R9564m67529n51911p83233m91257
2690.6G07643280r4833k2660k88696l72620N3788N6076k54898n85175n46417n36957
$$ plain form
2700.3 705050888 704683304 704076157 703271027 703383408 703796463 703895721 703557281 702998886 702559891 702022018
2709.9 702022018 701150513 700215225 699798965 699769897 699971161 699908371 699546814 699152832 698915100 698986740
2719.5 698986740 698509293 697580719 696783218 696541977 696802368 696838531 696617432 696464539 696109543 695497284
2729.2 695497284 695498352 695347977 694583359 693955383 693555679 693466415 693365173 693203125 693027420 693390503
2738.8 693390503 693632660 692913742 692264557 691598816 691140594 691074600 691012497 690941315 690897903 690829010
2748.5 690829010 690449524 690087280 689609909 689331207 689226456 688763351 688145981 687425385 687410965 687952499
2758.1 687952499 688023682 687809296 687636871 686986542 686479874 686766968 686524887 685998306 685884552 685727158
2767.8 685727158 685384903 685263290 685355759 685027237 684890366 685020523 684678192 684093933 683651123 683104019
$$ packed form
2700.3G05050888l67584o07147q05130J12381M13055R9258l38440n58395m38995n37873
2709.9G02022018q71505r35288m16260k9068K01264o2790l61557l93982k37732P1640
2719.5F98986740m77447r28574p97501k41241K60391L6163k21099j52893l54996o12259
2729.2F95497284J068j50375p64618o27976l99704q9264j01242j62048j75705L63083
2738.8F93390503K42157p18918o49185o65741m58222o5994o2103p1182m3412o8893
2748.5F90829010l79486l62244m77371k78702j04751m63105o17370p20596j4420N41534
2758.1F87952499P1183k14386j72425o50329n06668K87094k42081n26581j13754j57394
2767.8F85727158l42255j21613R2469l28522j36871J30157l42331n84259m42810n47104
$$ plain form
2777.4 683104019 682701721 682649155 682316895 681951065 681672134 681678314 681588821 680785828 679961777 679404831
2787 679404831 679307098 679224777 678859329 678327484 677657318 677051926 676551437 676466370 676443710 676040039 674955826
2797.7 674955826 673833389 672969513 672297058 672451553 672248764 671509399 670767441 670222931 670048065
2806.3 670048065 669335403 668356628 667752075 667272186 666421738 665656815 664958191 663900909 662878876
2815 662878876 662314758 662270660 661563568 660604553 659828720 658579788 657199860 656288528 655882721 654969635
2824.7 654969635 654226532 653266602 651760025 651075745 650202408 648937759 647787323 646688614 645715714
2833.3 645715714 645043793 644207611 642787018 641576080 640377121 638948898 636789322 634255486 632347527
2842 632347527 630908241 629375572 627076187 624754028 622161789 619230499 616427040 613575935 611559868
$$ packed form
2777.4F83104019m02298n2566l32260l65830k78931O180q9493q02993q24051n56946
2787F79404831r7733q2321l65448n31845o70166o05392n00489q5067k2660m03671j084213
2797.7F74955826j122437q63876o72455J54495k02789p39365p41958n44510j74866
2806.3F70048065p12662r78775o04553m79889q50448p64923o98624j057282j022033
2815F62878876n64118m4098p07092r59015p75833j248932j379928r11332m05807r13086
2824.7F54969635p43103r59930j506577o84280q73337j264649j150436j098709r72900
2833.3F45715714o71921q36182j420593j210938j198959j428223k159576k533836j907959
2842F32347527j439286j532669k299385k322159k592239k931290k803459k851105k016067
$$ plain form
2850.7 611559868 609936333 608519440 607549362 606609306 605811234 605401001 605426369 605569725 605772667
2859.4 605772667 605751648 605405693 604693794 603822289 602833862 601800575 601050529 599766350 598024521
2868.1 598024521 596535759 595690269 594523163 592461700 590664482 588966827 587261887 585474205
2875.8 585474205 583988571 582947922 581517639 579569664 577344742 575793533 574515228 573129425
2883.5 573129425 572061195 571224709 570810890 570195274 569148331 568347206 567744751 566669273 566033554
2892.2 566033554 566018715 565696220 565538788 565016174 564170303 563354416 562731094 562506981 562128525 561681519
2901.8 561681519 560853691 559785576 558715630 558030663 557377281 556092873 555046692 553945732 552761345
2910.5 552761345 551252060 549019699 546481476 544054375 542078667 539517746 536795044 534856300
$$ packed form
2850.7F11559868j623535j416893r70078r40056p98072m10233K5368J43356K02942
2859.4F05772667k1019l45955p11899q71505r88427j033287p50046j284179j741829
2868.1E98024521j488762q45490j167106k061463j797218j697655j704940j787682
2875.8E85474205j485634j040649j430283j947975k224922j551209j278305j385803
2883.5E73129425j068230q36486m13819o15616j046943q01125o02455j075478o35719
2892.2E66033554j4839l22495j57432n22614q45871q15887o23322k24113l78456m47006
2901.8E61681519q27828j068115j069946o84967o53382j284408j046181j100960j184387
2910.5E52761345j509285k232361k538223k427101j975708k560921k722702j938744
$$ plain form
2918.2 534856300 532968903 530653915 528830376 528024902 527163506 526162415 524951324 524091301 524213066
2926.9 524213066 524431801 524251823 524203491 525031776 525857124 526657906 527839737 529365044 531163635
2935.6 531163635 532455673 534026604 535948372 537803726 539786110 541986084 544954338 547973022
2943.3 547973022 550403633 552842903 555122948 556798172 558508453 560617180 563138962 565388260
2951 565388260 567161484 568933029 570437851 572800827 574942093 575931549 577711143 579793854 581699371
2959.7 581699371 583989258 586331596 588294830 590113564 591735535 593183556 595102310 597242432
2967.4 597242432 598900452 600171661 602118950 604229584 605748520 607384148 609354172 610763550
2975.1 610763550 611650810 613539391 615416260 616686897 617967453 618978844 620017433 621058998
$$ packed form
2918.2E34856300j887397k314988j823539q05474q61396j001091j211091q60023J21765
2926.9E24213066K18735j79978m8332Q28285Q25348Q00782J181831J525307J798591
2935.6E31163635J292038J570931J921768J855354J982384K199974K968254L018684
2943.3E47973022K430611K439270K280045J675224J710281K108727K521782K249298
2951E65388260J773224J771545J504822K362976K141266R89456J779594K082711J905517
2959.7E81699371K289887K342338J963234J818734J621971J448021J918754K140122
2967.4E97242432J658020J271209J947289K110634J518936J635628J970024J409378
2975.1F10763550Q87260J888581J876869J270637J280556J011391J038589J041565
$$ plain form
2982.8 621058998 622354012 623354912 624291229 625570412 626660728 627703094 628508339 629486427 630204353
2991.5 630204353 630498581 630655174 630811577 631773224 632757568 633107948 633298149 633825874 633990097 633256035
3001.1 633256035 632544174 632306099 632476730 633006287 633196182 632775917 632947083 633176575 633110886 633067093
3010.8 633067093 632487984 632005272 631665382 631521530 631010056 630508957 630499039 629775887 629101906 628537369
3020.4 628537369 627842026 627111702 626546211 626320877 625604477 624586372 623846130 623604774 623094368
3029.1 623094368 622641182 622127724 620920525 620233574 619398232 618334312 617810555 617341614 616474648
3037.8 616474648 615479927 614388237 613429413 612938957 611937599 611171989 610314064 608877068 607954636
3046.5 607954636 607317619 606738853 605599632 604743767 603986549 602772827 601942902 600878792 599659004
$$ packed form
2982.8F21058998J295014J000900R36317J279183J090316J042366Q05245R78088P17926
2991.5F30204353K94228J56593J56403R61647R84344L50380J90201N27725J64223p34062
3001.1F33256035p11861k38075J70631N29557J89895m20265J71166K29492o5689m3793
3010.8F33067093n79109m82712l39890j43852n11474n01099r918p23152o73981n64537
3020.4F28537369o95343p30324n65491k25334p16400j018105p40242k41356n10406
3029.1F23094368m53186n13458j207199o86951q35342j063920n23757m68941q66966
3037.8F16474648r94721j091690r58824m90456j001358p65610q57925j436996r22432
3046.5F07954636o37017n78766j139221q55865p57218j213722q29925j064110j219788
$$ plain form
3055.1 599659004 598558197 597607613 596490746 595574493 594847870 593827133 593101006 592312546 591463356
3063.8 591463356 590258255 589262848 588433762 587065697 585988312 584905891 584175301 583403168 582408676
3072.5 582408676 581488113 580218201 579195557 578258972 577329559 576274109 575221100 574233665 573308372
3081.2 573308372 572576790 571486320 570269547 569282722 568922386 568098869 566606865 565405273 564037895
3089.9 564037895 563268852 562854843 561481590 559748230 558967819 558112259 556530380 555556984 554815941
3098.5 554815941 554038429 553116684 552004700 551113281 550620689 550011902 548922386 547931557 546662636
3107.2 546662636 545621033 544717102 543604622 542805672 541583557 540157013 539073105 538392868 537680779
3115.9 537680779 536846237 535982170 534662209 533219604 532164497 531515617 530261879 528857613 527963257
$$ packed form
3055.1E99659004j100807r50584j116867r16253p26623j020737p26127p88460q49190
3063.8E91463356j205101r95407q29086j368065j077385j082421p30590p72133r94492
3072.5E82408676r20563j269912j022644r36585r29413j055450j053009r87435r25293
3081.2E73308372p31582j090470j216773r86825l60336q23517j492004j201592j367378
3089.9E64037895p69043m14009j373253j733360p80411q55560j581879r73396p41043
3098.5E54815941p77512r21745j111984q91419m92592o08787j089516r90829j268921
3107.2E46662636j041603r03931j112480p98950j222115j426544j083908o80237p12089
3115.9E37680779q34542q64067j319961j442605j055107o48880j253738j404266q94356
$$ plain form
3124.6 527963257 527030029 526213837 525513000 524715691 523443832 522489166 521893196 520794029 519441299
3133.3 519441299 518497620 517917824 516827316 515766296 514876785 514229736 513514442 512008286 510468712
3141.9 510468712 509180260 508482170 507781754 507128296 506416130 505316658 504718513 503976555 503210106
3150.6 503210106 502228317 500965767 499567223 498043289 496981392 495647278 494808235 494667358 494213486
3159.3 494213486 493026161 491556587 490517654 489387436 488485222 488076210 487683640 486655807 485691299
3168 485691299 484809113 483565292 482777252 481626091 480553818 479705200 478847275 478122139 477119637
3176.6 477119637 476243629 475243378 474866066 474249725 473328323 472994881 471798973 470412903 469442215
3185.3 469442215 468484421 467550545 466782799 465978127 465401039 465209618 464642220 463938637 462701530
$$ packed form
3124.6E27963257r33228q16192p00837p97309j271859r54666n95970j099167j352730
3133.3E19441299r43679n79796j090508j061020q89511o47049p15294j506156j539574
3141.9E10468712j288452o98090p00416o53458p12166j099472n98145p41958p66449
3150.6E03210106r81789j262550j398544j523934j061897j334114q39043j40877m53872
3159.3D94213486j187325j469574j038933j130218r02214m09012l92570j027833r64508
3168D85691299q82186j243821p88040j151161j072273q48618q57925p25136j002502
3176.6D77119637q76008j000251l77312o16341r21402l33442j195908j386070r70688
3185.3D69442215r57794r33876p67746q04672n77088j91421n67398p03583j237107
$$ plain form
3194 462701530 461603203 460735931 459501724 458469315 457367554 456882782 456707535 455963936 454871101
3202.7 454871101 454136467 453623276 453096542 452645073 451480675 450635071 449694710 448495522 448055573
3211.4 448055573 447574844 446957245 445999527 445483017 445122795 444313622 443581619 442739220 441585922
3220 441585922 440340347 440025101 439817848 439382973 438810616 437856255 437309113 436687660 436097450 435063934
3229.7 435063934 433661957 433009758 432777939 432489319 431942711 431424675 430658607 429820595 429246483
3238.4 429246483 428512383 427555237 427149620 427089920 426502380 425774117 424587402 423962631 424093742 423685837
3248 423685837 423004723 422108650 421215515 420273285 419703903 419156609 418390503 418300629 418231888 417865257
3257.7 417865257 417476006 417070198 416088257 415395203 415137978 414420052 413775406 413081589 412886543 412794647
$$ packed form
3194D62701530j098327q67272j234207j032409j101761m84772j75247p43599j092835
3202.7D54871101p34634n13191n26734m51469j164398q45604r40361j199188m39949
3211.4D48055573m80729o17599r57718n16510l60222q09173p32003q42399j153298
3220D41585922j245575l15246k07253m34875n72357r54361n47142o21453n90210j033516
3229.7D35063934j401977o52199k31819k88620n46608n18036p66068q38012n74112
3238.4D29246483p34100r57146m05617n9700n87540p28263j186715o24771J31111m07905
3248D23685837o81114q96073q93135r42230n69382n47294p66106q9874o8741l66631
3257.7D17865257l89251m05808r81941o93054k57225p17926o44646o93817j95046r1896
$$ plain form
3267.3 412794647 412425041 411883163 411127968 410583382 409813499 409350357 408765106 408169136 407786636 407423859
3276.9 407423859 407134209 406298790 406059647 405628662 405259361 405553970 405038681 404427795 403798485 403170128
3286.6 403170128 402942238 402916183 402265892 401397858 400920372 400261002 400258217 400051003 399130783 398317146
3296.2 398317146 397933502 397990227 397823830 397491608 397046204 396771164 396327591 395987167 395965157 395652008
3305.9 395652008 395239487 394497032 393832550 393108292 392546082 392578773 392302856 391525879 390916290 390394821
3315.5 390394821 389456520 389323578 389138374 388037262 387499237 387386208 387201118 386780891 386380882
3324.2 386380882 385644035 384903336 384423561 384051476 383978539 383058586 382182426 381741524 381371193 381175804
3333.8 381175804 380501289 379710197 378854256 378267632 377770424 377350159 376885681 376231232 376147957 375800400
$$ packed form
3267.3D12794647l69606n41878p55195n44586p69883m63142n85251n95970l82500l62777
3276.9D07423859k89650q35419k39143m30985l69301K94609n15289o10886o29310o28357
3286.6D03170128k27890k6055o50291q68034m77486o59370k785k07214r20220q13637
3296.2C98317146l83644N6725j66397l32222m45404k75040m43573l40424k2010l13149
3305.9C95652008m12521p42455o64482p24258n62210L2691k75917p76977o09589n21469
3315.5C90394821r38301j32942j85204j101112n38025j13029j85090m20227m00009
3324.2C86380882p36847p40699m79775l72085p2937r19953q76160m40902l70331j95389
3333.8C81175804o74515p91092q55941n86624m97208m20265m64478o54449q3275l47557
$$ plain form
3343.5 375800400 374971962 373934326 373240623 373111153 372562714 371749268 371274071 370909882 369959221
3352.2 369959221 368968239 368650627 368608704 367959938 367239189 367039680 366429062 365757141 365265656 364618225
3361.8 364618225 363557434 363121338 363126221 362112160 361730156 361564941 360618019 359542770 358544388
3370.5 358544388 358249130 358548813 358334198 357049065 356439285 356402435 356068382 355634880 354839783 354303932
3380.1 354303932 353786316 353416901 352895508 352326050 352066193 351661034 351748352 351491165 350810509 350314407
3389.8 350314407 349955940 349470596 348777428 348546867 348393669 348287621 348167496 348218880 347917061 347235870
3399.4 347235870 347198639 347184563 347231445 346832161 345927658 345685349 345668373 345364952 345429687 345507622 344684906
3410 344684906 344069557 343798370 343593063 343597794 343735580 344053688 344149590 344095192 343516083 343357086 343294945
$$ packed form
3343.5C75800400q28438j037636o93703j29470n48439q13446m75197l64189r50661
3352.2C69959221r90982l17612m1923o48766p20749j99509o10618o71921m91485o47431
3361.8C64618225j060791m36096M883j014061l82004j65215r46922j075249r98382
3370.5C58544388k95258K99683k14615j285133o09780l6850l34053m33502p95097n35851
3380.1C54303932n17616l69415n21393n69458k59857m05159Q7318k57187o80656m96102
3389.8C50314407l58467m85344o93168k30561j53198j06048j20125N1384l01819o81191
3399.4C47235870l7231j4076M6882l99284r04503k42309j6976l03421O4735P7935q22716
3410C44684906o15349k71187k05307M731J37786L18108R5902n4398n79109j58997o2141
$$ plain form
3420.6 343294945 342648659 343094864 343697929 343443985 342805443 343042717 343760338 343677254 343605499 343688850
3430.3 343688850 343708687 343481865 343213577 343364639 343661499 343610458 343557396 343948021 344690132 345153618
3439.9 345153618 344737015 344816132 344944954 345195694 346129837 346485596 346577110 346064911 346686401 347653580
3449.6 347653580 347391472 347546425 348006325 348515053 348841286 349549255 349902420 349728508 350327339 350531006
3459.2 350531006 351036453 351950493 352335052 352265587 352404366 352958298 353542938 354445000 354915199 355359802
3468.8 355359802 355780182 355962067 356161118 356548386 357704849 358655853 359091682 359335403 360180817
3477.5 360180817 361080170 361708679 362565422 362812653 362998314 362950211 363799706 364778404 364960289 365873146
3487.2 365873146 366082573 366431885 367367706 367699852 367749062 368013306 368845177 369775162 370714684 371186943
$$ packed form
3420.6C43294945o46286M46205O03065k53944o38542K37274P17621q3084p1755Q3351
3430.3C43688850J9837k26822k68288J51062K96860n1041n3062L90625P42111M63486
3439.9C45153618m16603P9117J28822K50740R34143L55759R1514n12199O21490R67179
3449.6C47653580k62108J54953M59900N08728L26233P07969L53165j73912N98831K03667
3459.2C50531006N05447R14040L84559o9465J38779N53932N84640R02062M70199M44603
3468.8C55359802M20380J81885J99051L87268J156463R51004M35829K43721Q45414
3477.5C60180817Q99353O28509Q56743K47231J85661m8103Q49495R78698J81885R12857
3487.2C65873146K09427L49312R35821L32146M9210K64244Q31871R29985R39522M72259
$$ plain form
3496.8 371186943 371892433 372848206 373410912 374234962 375371628 375889740 375193100 375644913 376869812
3505.5 376869812 377518845 378430138 379851990 380491600 380533600 382156639 383237495 383366776 383971405
3514.2 383971405 384708710 385331345 386024742 387458572 388241005 388973503 390154037 390808487 391168251
3522.9 391168251 390856895 391668816 393325233 394197235 394801903 395601120 396008911 396980019 398260117
3531.5 398260117 399032135 400340919 401378593 402710991 403194084 402683525 403676720 404621391 406059608
3540.2 406059608 407409439 408450699 409263763 410086823 410864372 410523224 411826553 412756462 414138260
3548.9 414138260 415607872 417266197 420197868 419668083 419909973 421286888 422618561 424623032 425390320
3557.6 425390320 426381340 427271118 428707848 429544144 431177101 432715073 433476944 436953354 436628342
$$ packed form
3496.8C71186943P05490R55773N62706Q24050J136666N18112o96640M51813J224899
3505.5C76869812O49033R11293J421852O39610M2000J623039J080856J29281O04629
3514.2C83971405P37305O22635O93397J433830P82433P32498J180534O54450L59764
3522.9C91168251l11356Q11921J656417Q72002O04668P99217M07791R71108J280098
3531.5C98260117P72018J308784J037674J332398M83093n10559R93195R44671J438217
3540.2D06059608J349831J041260Q13064Q23060P77549l41148J303329R29909J381798
3548.9D14138260J469612J658325K931671n29785K41890J376915J331673K004471P67288
3557.6D25390320R91020Q89778J436730Q36296J632957J537972P61871L476410l25012
$$ plain form
3566.2 436628342 436990128 438181648 437759819 441416473 443334427 444703674 446663666 448464241 449412231
3574.9 449412231 450340958 452285728 452910728 455594521 457771912 458240356 459998856 461977997 463683357
3583.6 463683357 465257797 469877701 471498184 468774261 470159225 470151329 473701286 477548523 480954933
3592.3 480954933 482280807 482211533 485449867 484751129 486895065 490555420 492198219 496158791 496232910
3601 496232910 496185150 498762817 500665894 503160858 506722641 509345474 508327675 511437225 510486526
3609.6 510486526 510235672 518577957 520563354 518868713 522306709 521351700 526225395 531108093 530369415
3618.3 530369415 531380806 529780121 531142654 535151176 538740730 541736145 543964005 545695076
3626 545695076 547588043 553901863 552766418 541455727 547377052 553728561 559629288 560080185 558226624
$$ packed form
3566.2D36628342L61786J191520m21829L656654J917954J369247J959992J800575R47990
3574.9D49412231R28727J944770O25000K683793K177391M68444J758500J979141J705360
3583.6D63683357J574440M619904J620483k723923J384964p896L549957L847237L406410
3592.3D80954933J325874o9274L238334o98738K143936L660355J642799L960572P4119
3601D96232910m7760K577667J903077K494964L561783K622833j017799L109550r50699
3609.6E10486526k50854Q342285J985397j694641L437996r55009M873695M882698p38678
3618.3E30369415J011391j600685J362533M008522L589554K995415K227860J731071
3626E45695076J892967O313820j135445j1310691N921325O351509N900727M50897j853561
$$ plain form
3634.7 558226624 561217461 564375000 566100960 566447563 568991814 571625214 573318443 573891525 574587250
3643.4 574587250 577239647 580964508 587368088 584560432 579992104 586411819 584396515 580810318
3651.1 580810318 582544899 589846878 594583092 598685112 602766724 592580147 594755821 600426826
3658.8 600426826 602228317 604058151 604901657 607030830 607723694 609465637 611899452 612629623 616307259
3667.5 616307259 617985077 616684914 615341797 608390579 613224678 622703781 630959167 628085289
3675.2 628085289 608292923 612829399 621569939 626403046 624791527 626095963 629713516 631374397
3682.9 631374397 632853203 633420334 633943596 638508759 644737320 634854660 631211472 639134445 632611122
3691.6 632611122 633623390 639630699 640406189 642842255 643633957 643126297 644269333 644854660 647621765
$$ packed form
3634.7E58226624K990837L157539J725960L46603K544251K633400J693229N73082O95725
3643.4E74587250K652397L724861O403580k807656m568328O419715k015304l586197
3651.1E80810318J734581P301979M736214M102020M081612j0186577K175674N671005
3658.8F00426826J801491J829834Q43506K129173O92864J741943K433815P30171L677636
3667.5F16307259J677818j300163j343117o951218M834099R479103Q255386k873878
3675.2F28085289j9792366M536476Q740540M833107j611519J304436L617553J660881
3682.9F31374397J478806N67131N23262M565163O228561r882660l643188P922973o523323
3691.6F32611122J012268O007309P75490K436066P91702n07660J143036N85327K767105
$$ plain form
3700.3 647621765 650521698 644910660 642698517 648247452 650575104 650935822 651467209 653936844 656371918
3709 656371918 646874313 651985626 657447815 643876114 648801270 653670502 654743423 656105347
3716.7 656105347 658497391 659448471 655973358 657070847 662649536 658411865 654076385 660378799
3724.4 660378799 661752777 660846329 657792587 658322067 662641144 663893738 669652481 665066681 657599564
3733.1 657599564 668027115 668232193 657054291 658630981 662112045 661599731 664815140 669152908
3740.8 669152908 665474548 668652802 679503326 664321136 648717422 662109451 669667358 676322174
3748.5 676322174 673142776 660436859 670916595 665263367 660369568 667800064 673027649 676240692
3756.2 676240692 670617752 673043137 678222198 669344025 668169174 673472519 675368195 675375900 678232727
$$ packed form
3700.3F47621765K899933n611038k212143N548935K327652L60718N31387K469635K435074
3709F56371918r497605N111313N462189j3571701M925156M869232J072921J361924
3716.7F56105347K392044R51080l475113J097489N578689m237671m335480O302414
3724.4F60378799J373978r06448l053742N29480M319077J252594N758743m585800p467117
3733.1F57599564J0427551K05078j1177902J576690L481064n12314L215409M337768
3740.8F69152908l678360L178254J0850524j5182190j5603714J3392029P557907O654816
3748.5F76322174l179398j2705917J0479736n653228m893799P430496N227585L213043
3756.2F76240692n622940K425385N179061q878173j174851N303345J895676P705K856827
$$ plain form
3764.9 678232727 674465103 669627914 673648148 679356995 679716034 671137238 673668823 676938095
3772.6 676938095 677205658 677887802 677986603 679166183 678853607 681322250 681170654 673348618 676553040
3781.3 676553040 679400406 680870895 682970276 678590088 677394333 679946289 681037292 680864334
3789 680864334 680522995 681692734 682437820 683219757 682653198 683197327 686750870 682851868 679012527
3797.7 679012527 682059174 686248932 691362457 683526230 674145966 678526459 682518463 688515472
3805.4 688515472 693780212 682097015 677376938 682710876 685369110 685752029 685925140 686052933 687649002
3814.1 687649002 693135300 689087982 674465027 681834259 688799896 693322372 692987137 673630219
3821.8 673630219 677093887 683551254 686991043 690463409 690097961 686282501 687360001 689253693
$$ packed form
3764.9F78232727l767624m837189M020234N708847L59039q578796K531585L269272
3772.6F76938095K67563O82144R8801J179580l12576K468643j51596p822036L204422
3781.3F76553040K847366J470489K099381m380188j195755K551956J091003j72958
3789F80864334l41339J169739P45086P81937n66559N44129L553543l899002l839341
3797.7F79012527L046647M189758N113525p836227r380264M380493L992004N997009
3805.4F88515472N264740j1683197m720077N333938K658234L82919J73111J27793J596069
3814.1F87649002N486298m047318j4622955P369232O965637M522476l35235j9356918
3821.8F73630219L463668O457367L439789L472366l65448l815460J077500J893692
$$ plain form
3829.5 689253693 692429352 693534317 684502487 687856216 694720688 688228989 688591766 696738358
3837.2 696738358 687182693 683260880 690681229 684290161 685365524 692702408 689645538 686252289
3844.9 686252289 690067215 692043839 692049713 694358978 693404846 695078049 700372391 690826721 689130096
3853.6 689130096 673619232 678843994 690992889 689885330 688792572 692624435 696399460 698769684
3861.3 698769684 691861954 691758575 698267975 690323181 685022278 690353394 696670685 703936920
3869.1 703936920 694728241 683865356 688863373 696334000 699442596 688257828 690102463 694498291
3876.8 694498291 694748993 697547760 701292877 693712997 687183228 693964233 694889297 696832275 701361542
3885.4 701361542 688509445 690906525 694763641 696036530 700979004 699157867 690294266 692613297
$$ packed form
3829.5F89253693L175659J104965r031830L353729O864472o491699L62777Q146592
3837.2F96738358r555665l921813P420349o391068J075363P336884l056870l393249
3844.9F86252289L814926J976624N874K309265r54132J673203N294342r545670j696625
3853.6F89130096j5510864N224762J2148895j107559j092758L831863L775025K370224
3861.3F98769684o907730j03379O509400p944794n300903N331116O317291P266235
3869.1G03936920r208679j0862885M998017P470627L108596j1184768J844635M395828
3876.8F94498291K50702K798767L745117p579880o529769O781005R25064J942978M529267
3885.4G01361542j2852097K397080L857116J272889M942474j821137q863601K319031
$$ plain form
3893.2 692613297 696171341 694106827 695594025 697778168 700361176 701261673 690754547 696198196
3900.9 696198196 698222580 692742081 697149963 692742310 691332092 692743454 694246902 696981277
3908.6 696981277 697169418 697537079 697320862 697226639 697046585 697164307 699287643 700818787 696582718
3917.3 696582718 693831406 699379807 699286346 694774857 697425537 698948898 699637070 697267685 694380417
3926 694380417 696272507 697302475 698341217 697719803 698361053 700924454 696692657 694504242 697146530
3934.6 697146530 698489227 698581924 698241501 697791214 697667389 697754593 699130096 700190887 696629257
3943.3 696629257 696322403 697684631 698053360 699319229 697523346 698967667 699925690 697513580 699564209
3952 699564209 699703522 698652878 698739166 698960342 699178543 698409958 698973999 698715820 699997711 700837555
$$ packed form
3893.2F92613297L558044k064514J487198K184143K583008R00497j0507126N443649
3900.9F96198196K024384n480499M407882m407653j410218J411362J503448K734375
3908.6F96981277J88141L67661k16217r4223j80054J17722K123336J531144m236069
3917.3F96582718k751312N548401r3461m511489K650680J523361O88172k369385k887268
3926F94380417J892090J029968J038742o21414O41250K563401m231797k188415K642288
3934.6F97146530J342697R2697l40423m50287j23825Q7204J375503J060791l561630
3943.3F96629257l06854J362228L68729J265869j795883J444321R58023k412110K050629
3952F99564209J39313j050644Q6288K21176K18201p68585N64041k58179J281891Q39844
$$ plain form
3961.6 700837555 698334579 698884048 699768524 699719315 699644165 699091949 699354019 698857269 698405838 699398193
3971.3 699398193 700149765 699825821 699329147 699255753 698993683 698830338 699713669 700278091 699934769 699826355
3980.9 699826355 699640274 699245071 699605484 700303955 699805527 699505463 699857864 699826508 699938049 699665527
3990.6 699665527 699629211 699373322 699221573 699399109 698104553 697539139 698683319 700190887 700556717
3999.2 700556717 700323639
4000.2 700323639
$$ packed form
3961.6G00837555k502976N49469Q84476m9209p5150n52216K62070m96750m51431R92355
3971.3F99398193P51572l23944m96674p3394k62070j63345Q83331N64422l43322j08414
3980.9F99826355j86081l95203L60413O98471m98428l00064L52401l1356J11541k72522
3990.6F99665527l6316k55889j51749J77536j294556n65414J144180J507568L65830
3999.2G00556717k33078
4000.2G00323639
##END=$$ End of the data block
