##TITLE=$$ Begin of the data block
##JCAMP-DX=5.00 $$ ACD/SpecManager v 10.08
##SPECTROMETER/DATA SYSTEM=Varian
##DATE=20 Nov 2012 15:40:02
##DATA TYPE=INFRARED SPECTRUM
##DATA CLASS=XYDATA
##ORIGIN=
##OWNER=
##NPOINTS=3735
##FIRSTX=399.26403809
##LASTX=4000.35498047
##MAXX=4000.35498047
##MINX=399.26403809
##MAXY=79.54006195
##MINY=11.20309639
##XFACTOR=1.0000000000
##YFACTOR=0.000000100000000
##FIRSTY=39.86206055
##DELTAX=0.96440572
##XUNITS=1/CM
##YUNITS=TRANSMITTANCE
##XYDATA=(X++(Y..Y))
399.3C98620605p77664n097847k280464j034698L320465l785630o853485n45730J726990
407.9C83292542L847808J823578k347793R82628l40043k456970N06020J785812j775322
416.6C85318260n733909J1813469J6718902q199348p242394j1948204q348999R0370
424.3C72468147n43403J788940P532730N251923l869019n800628m841156J028938M314842
433C77331314Q19054l625794l738670k595749J73683L886299m59327j310883r50279
441.7C69529648j75476N568466O637421L332824j753006P98340J328888o03104L284455
450.4C87948456M135132K147636K405548K750321l933297m914283M73213m17099j062355
459.1C89533272r8686M780998J007538o465416m677162m58184N70908m041367k138824
$$ y = [398620605, 397842941, 392745094, 390464630, 389429932, 392750397, 388964767, 382111282, 381565552, 383292542, 387140350, 388963928, 386616135, 387598763, 387258720, 384801750, 385307770, 387093582, 385318260, 379584351, 391397820, 408116722, 399917374, 392674980, 380726776, 372377777, 372468147, 371924744, 373713684, 381246414, 386498337, 382629318, 376828690, 371987534, 373016472, 377331314, 378150368, 374524574, 370785904, 368190155, 368363838, 372250137, 371790810, 370479927, 369529648, 369354172, 374922638, 381560059, 384892883, 383139877, 383938217, 385267105, 384664001, 387948456, 392083588, 394231224, 396636772, 399387093, 395453796, 390539513, 391012726, 390595627, 389533272, 389434586, 394215584, 395223122, 388757706, 384080544, 383622360, 384193268, 380151901, 378013077]
467.7C78013077l055916j833763J654930l980827k008248p01446j920815J395493o61621
476.4C66900864m265633k778091k303238j200638J103515j027603q1443K117042K494698
485.1C60959473r30939j71242K574234j166382k908516k042160L576012J220398l013763
493.8C58097115j929207l631516k88429j56403O86150j463852k230720K238235k099991
502.5C49221382k224693j217346O91299O75507k154389j244468j034089J69716k531967
511.1C40350952l794441m683113k069626P70149l042183m462547l717995N51186j587887
519.8C18314495k228374j234780k319965P92770J74656K81143l040771k790337M23241
528.5C08372078Q27408N60665j036587J542149K489929K541447R83581q84018J100331
$$ y = [378013077, 374957161, 373123398, 374778328, 370797501, 368789253, 368087807, 366166992, 367562485, 366900864, 362635231, 359857140, 357553902, 356353264, 357456779, 356429176, 356347733, 358464775, 360959473, 360028534, 359857292, 362431526, 361265144, 358356628, 356314468, 359890480, 361110878, 358097115, 356167908, 352536392, 352247963, 352091560, 352777710, 351313858, 349083138, 351321373, 349221382, 346996689, 345779343, 346470642, 347146149, 344991760, 343747292, 342713203, 342882919, 340350952, 336556511, 331873398, 329803772, 330573921, 327531738, 323069191, 319351196, 319902382, 318314495, 316086121, 314851341, 312531376, 313324146, 313498802, 313779945, 310739174, 307948837, 308372078, 309199486, 309760151, 308723564, 310265713, 312755642, 315297089, 316280670, 315396652, 316496983]
537.2C16496983K767524L380871J710320L437500M335899R58633N98793K482338J274605
545.9C37443466j026764Q10051P96662q16384l62129n06973k276459k327385K48070
554.5C31982155n16091j923446k270012p76749l0441j862869k752266l389549j560097
563.2C16900635l263397l029004j473407n137673l714084k231846k915707l958301
570.9B91177216j741276p66926j650200q44135k196713R55849J076412J195622K222194
579.6B89428043K655068L079586K556667M697151L324623M236489L132343P79591K026691
588.3C15916252J801167K293529K305489J828308J09711J181221J247367n84640O36253
597C26734657K24037j95465j194877m15688R73854o5651m85763j75057K19002r45434
$$ y = [316496983, 319264507, 322645378, 324355698, 327793198, 332129097, 333087730, 333686523, 336168861, 337443466, 336416702, 337226753, 338023415, 337207031, 336844902, 336337929, 334061470, 331734085, 331982155, 331466064, 329542618, 327272606, 326495857, 326465416, 324602547, 321850281, 318460732, 316900635, 313637238, 310608234, 309134827, 303997154, 300283070, 298051224, 295135517, 291177216, 289435940, 288669014, 287018814, 286174679, 283977966, 284933815, 286010227, 287205849, 289428043, 292083111, 295162697, 297719364, 302416515, 305741138, 309977627, 313109970, 313889561, 315916252, 317717419, 320010948, 322316437, 324144745, 324254456, 325435677, 326683044, 326098404, 326734657, 326958694, 326763229, 325568352, 325152664, 326126518, 326060867, 325575104, 325400047, 325619049, 324673615]
606.6C24673615J05285o2370p33681P31697Q08258P18346R3040R75190P33184J304512
616.3C29347076L070298L068313K016793J437034L056336R87396p8354R39560J601448
624.9C45445900K568779J943779K242966J292419K507439K585487R23348J437454L49998
633.6C61297569P68242M78401L65181N20020j73798J382141J557236J055908Q65898
642.3C68116798Q56438K10724M16489K301101J946488L62205j28212J356240J523132
651C76961403R60083J068649O4659L99895J036377K52342l69873N76248J31073j612701
660.6C79468155K46048J502304N89371k16828J80512K697181P340966J1560936r231110
669.3C94137535n790558j918297J100045J671180N2147M99535K299919J232414P19452
$$ y = [324673615, 324778900, 324716530, 323982849, 324714546, 325522804, 326241150, 326334190, 327309380, 328042564, 329347076, 332417374, 335485687, 337502480, 338939514, 341995850, 342983246, 342904892, 343844452, 345445900, 348014679, 349958458, 352201424, 353493843, 356001282, 358586769, 359510117, 360947571, 361297569, 362065811, 362544212, 362909393, 363429413, 363255615, 364637756, 366194992, 367250900, 368116798, 368973236, 369183960, 369600449, 371901550, 373848038, 374210243, 374082031, 375438271, 376961403, 377921486, 378990135, 379054794, 379454689, 380491066, 380743408, 380373535, 380949783, 381080856, 379468155, 379714203, 381216507, 381805878, 381589050, 381769562, 384466743, 391807709, 403368645, 394137535, 388346977, 386428680, 387528725, 389199905, 389252052, 389751587, 392051506, 393283920, 394003372]
678C94003372J027832O67267M97360R55506J929969O73256k57835P45049J680297J190720
687.6D03112793o14090o56052K89078K00081m34113J01700j94473k073746j760750
696.3C97970428q03184j135864j830902j907921k075234j655426l94745j265831j891975
705C85009346j372490o10046p49665j398925L54118L35274P00302J802521J440239
713.7C85510674K942237L274384K669487K435188K615662L886719L867874J168899
721.4D08371124J102371L998261M362755M026527L833199K957344L179474L580665
729.1D35411720K280541J381416K069168J923218J795463R69010M17290K264900K354927
737.8D50867653J185951J611443J026001O2446j41258k38152M39568L662j397705k165108
$$ y = [394003372, 395031204, 395698471, 396195831, 397151337, 399081306, 399754562, 399496727, 400241776, 401922073, 403112793, 402498703, 401842651, 402131729, 402331810, 401897697, 401999397, 401804924, 399731178, 397970428, 397167244, 396031380, 394200478, 392292557, 390217323, 388561897, 388167152, 386901321, 385009346, 383636856, 383026810, 382277145, 380878220, 381232338, 381567612, 382267914, 384070435, 385510674, 388452911, 391727295, 394396782, 396831970, 399447632, 403334351, 407202225, 408371124, 409473495, 413471756, 417834511, 421861038, 425694237, 428651581, 431831055, 435411720, 437692261, 439073677, 441142845, 443066063, 444861526, 445830536, 446247826, 448512726, 450867653, 452053604, 453665047, 454691048, 454753494, 454612236, 454374084, 454813652, 454817314, 453419609, 451254501]
747.4D51254501j833763j459350k413330l825264k324791K75650j970101l917846l058815
756.1D30726891k799111l539734m781456l551864j228638j40915l61404j040421p68433
764.8D12514915N1156J213226J872368J656227J564865K410774L820114L627701L360977
773.5D32092323M512863N561104N004425L895874M226036M623108N073395M669838
781.2D69658966M197617L028259K135162L682213M381638L391380J815186J959190
788.9D94249611J539116K178879L549995K819443K677688K126274K234040J471329
796.6E12846375K832603L128509J240540K798500J737633J831169K390137J516227
804.3E30321693J046257J391488K775611J485253J079712j27182m76418K1286P1564
$$ y = [451254501, 449420738, 447961388, 445548058, 441722794, 439398003, 439673653, 437703552, 433785706, 430726891, 427927780, 424388046, 419606590, 416054726, 414826088, 414685173, 414323769, 413283348, 412514915, 412566071, 413779297, 415651665, 417307892, 418872757, 421283531, 425103645, 428731346, 432092323, 436605186, 442166290, 447170715, 451066589, 455292625, 459915733, 464989128, 469658966, 473856583, 476884842, 479020004, 482702217, 487083855, 490475235, 492290421, 494249611, 495788727, 497967606, 501517601, 504337044, 507014732, 509141006, 511375046, 512846375, 515678978, 518807487, 520048027, 522846527, 524584160, 526415329, 528805466, 530321693, 531367950, 532759438, 535535049, 537020302, 538100014, 537972832, 537496414, 537517700, 537589264]
813E37589264Q41980L6659P20711Q18863M11339n33028n10674j6822j254692p21703
822.6E37381897k76146M0321r86824j553764j896095k642441j863670k035981k595520
831.3E23571777l664741l232308k829933k031593j895180l362312k386704k591476
839E01577530k670555k446785k140694j960907k955093k373085k266083j475372j459122
847.7D81829834k226677j762733j671257j457062k371941k220192j634559k418785
855.4D66066628k368622k441178l027763k743149j579323p58552N69839K830010L947372
864.1D60495262M906120N565911N149727N612106O661530O684112O298637N225716
871.8E06599121N130806N525513M925079N097466L460502K732964J423187N72n43289
$$ y = [537589264, 538431244, 538467903, 539188614, 540007477, 540418816, 539885788, 539375114, 539358292, 538103600, 537381897, 537105751, 537146072, 536159248, 534605484, 532709389, 530066948, 528203278, 526167297, 523571777, 519907036, 516674728, 513844795, 511813202, 509918022, 506555710, 504169006, 501577530, 498906975, 496460190, 494319496, 492358589, 489403496, 487030411, 484764328, 483288956, 481829834, 479603157, 477840424, 476169167, 474712105, 472340164, 470119972, 468485413, 466066628, 463698006, 461256828, 458229065, 455485916, 453906593, 453148041, 453717880, 456547890, 460495262, 465401382, 470967293, 476117020, 481729126, 488390656, 495074768, 501373405, 506599121, 511729927, 517255440, 522180519, 527277985, 530738487, 533471451, 534894638, 534895210, 534351921]
880.5E34351921k234459j715317k184066k399407l190689l510818l205338l825416
888.2E12086411l599892m004860l269234m073334m349594m217872m223328l035698
895.9D81312599l308525k060738k117881k206993j539078k398834k567559l001632
903.7D62111359l346787m333458m169540m344483n139732m578323m604721l954049
911.4D27640266m675674n560913n125198n629845n730400o337357o200866m983979
919.1C83396034m196090k691002k786179k649155j852378o65055O41251l33824j83983
927.8C68679619l87573j15166J84173l98216Q46672J293145J718368J394577J160278
936.4C74375877J691933J922913L336906L538628K435951K176628K665978K307853
$$ y = [534351921, 532117462, 530402145, 528218079, 525818672, 522627983, 519117165, 515911827, 512086411, 508486519, 504481659, 501212425, 497139091, 492789497, 488571625, 484348297, 481312599, 478004074, 475943336, 473825455, 471618462, 470079384, 467680550, 465112991, 462111359, 458764572, 454431114, 450261574, 445917091, 440777359, 436199036, 431594315, 427640266, 422964592, 417403679, 412278481, 406648636, 400918236, 394580879, 388380013, 383396034, 379199944, 376508942, 373722763, 371073608, 369221230, 368556175, 369197426, 368863602, 368679619, 368292046, 368176880, 368361053, 367962837, 368809509, 370102654, 371821022, 373215599, 374375877, 376067810, 377990723, 381327629, 384866257, 387302208, 389478836, 392144814, 394452667]
944.2C94452667J294480N09109m20418j589927l052750l814735m205513n209580o124000
952.8C71839333o491013o467514p123451o931687p138099p996674p997627p881012
960.6C13812256p500229q026295q053283q963757r006519q173485q096104q250370
968.3B47742214r114570q304558r417343q788853q127441q474446p594566p971287
976A79949150o522922p283593o996927o964168n841189m600305n571967l685474l772774
984.7A28709831j920337k841807k892790j065540j321554k7647j322556m35657j258946
993.3A15622997p71293J36041J00613N05743j073608R57040j4448M03738J07460j78852
1003A15795431O93464o81629R97782q67128k38877j32284l85027k29006j008844J128979
$$ y = [394452667, 395747147, 396256256, 395835838, 394245911, 391193161, 387378426, 383172913, 377963333, 371839333, 365348320, 358880806, 351757355, 344825668, 337687569, 329690895, 321693268, 313812256, 306312027, 298285732, 290232449, 281268692, 272262173, 264088688, 255992584, 247742214, 238627644, 230323086, 220905743, 212116890, 203989449, 195515003, 187920437, 179949150, 173426228, 166142635, 159145708, 152181540, 146340351, 141740046, 136168079, 132482605, 128709831, 126789494, 123947687, 121054897, 119989357, 118667803, 118640156, 117317600, 116881943, 115622997, 114851704, 114987745, 115088358, 115594101, 114520493, 115477533, 115463085, 115866823, 115974283, 115795431, 116488895, 115807266, 116805048, 115937920, 115699043, 115566759, 115181732, 114952726, 113943882, 115072861]
1012.6A15072861j087036l55864n83830j89600K37255j062822J085758M18081Q99868
1021.3A14434671n81722P20158J453676R62343K084694L24307J539783N11990J819744
1030A23269644O31256k63739J976338M55722J245547J06878J040259K00758J17349
1038.7A28780012J016131j54286O39105n64976J204682k53926K87218J059294l7727
1047.4A31975527Q30746r27182J561270J074390J223336J470251J478977K445269J590881
1056A42723465K861996J239185L064919K969741L135414L269921K444515N074863L540612
1064.7A70324631M061813K195549K418842K094593p83290j332608m434299l132191
1072.4A71413040m132767l730259l502807l984022j055756j465320k09780q87633N96095
$$ y = [115072861, 113985825, 113629961, 113046131, 112856531, 113093786, 112030964, 113116722, 113534803, 114434671, 113852949, 114573107, 116026783, 116989126, 119073820, 119398127, 120937910, 121449900, 123269644, 123900900, 123637161, 125613499, 126069221, 127314768, 127421646, 128461905, 128662663, 128780012, 129796143, 129641857, 130280962, 129715986, 130920668, 130666742, 130953960, 132013254, 131975527, 132806273, 131879091, 133440361, 134514751, 135738087, 137208338, 138687315, 141132584, 142723465, 145585461, 146824646, 149889565, 152859306, 155994720, 159264641, 161709156, 166784019, 170324631, 174386444, 176581993, 179000835, 181095428, 180312138, 178979530, 174545231, 171413040, 167280273, 163550014, 160047207, 156063185, 155007429, 153542109, 153332329, 152444696, 153040791]
1081.1A53040791P90882R69190J382370J221600K955541Q39482K965851J866855K139282
1089.8A68171844K917901J184063K688770J885814L324414J998005K706146K316208
1097.5A87193165R83810J546307n31178J201153M1161k55051n10025N34515J664525
1106.2A91868382K62699J765251O03943K271442J306686J332798K843342J745301K324676
1114.9B06324520P69882K212639J508999J632004J763401J106205K258701R58939J556778
1123.5B20092068L47538J338634J104088R08260K107373J282310K982159J611309K357807
1132.2B34131546J948376J589069J949978p57618r24759j814670r07135j618424k376556
1140.9B31219807l018494m013920l183365m061145k353154l356952l003579k472629
$$ y = [153040791, 153831673, 154800863, 156183233, 157404833, 160360374, 161199856, 164165707, 166032562, 168171844, 171089745, 172273808, 174962578, 176848392, 180172806, 182170811, 184876957, 187193165, 188176975, 189723282, 189192104, 190393257, 190434418, 190179367, 189669342, 190203857, 191868382, 192131081, 193896332, 194500275, 196771717, 198078403, 199411201, 202254543, 203999844, 206324520, 207094402, 209307041, 210816040, 212448044, 214211445, 215317650, 217576351, 218535290, 220092068, 220439606, 221778240, 222882328, 223790588, 225897961, 227180271, 230162430, 231773739, 234131546, 236079922, 237668991, 239618969, 238861351, 237936592, 236121922, 235214787, 233596363, 231219807, 228201313, 224187393, 221004028, 216942883, 214589729, 211232777, 208229198, 205756569]
1148.6B05756569k347031j233730l000774j428032j880780p39421p64370p83387L21980
1157.3A93901024l61443J633683L25069J719685J806831J925259K380371J783180M091873
1166B09205532L181534M887657N471726O118469O250057N919361O807461N987530P639846
1174.6B61469173O830903P412071P456646O817360P452297O926670P425156O244297
1182.4C18034573O576862O582947O293678O096535N419311N395165M046707L551254
1190.1C61997032K655754K649842K688484J798744J928177J037407N75790M24690N85366
1198.8C76341286O39343P8163L39584M25530N37300K87933M89579J247482J526260
1207.4C81912460J771889K042542K034912K000961K377892K423896K260590K200317
$$ y = [205756569, 203409538, 202175808, 199175034, 197747002, 195866222, 195126801, 194362431, 193579044, 193901024, 193539581, 195173264, 195498333, 197218018, 199024849, 200950108, 203330479, 205113659, 209205532, 212387066, 217274723, 222746449, 228864918, 235114975, 241034336, 247841797, 253829327, 261469173, 268300076, 275712147, 283168793, 289986153, 297438450, 304365120, 311790276, 318034573, 324611435, 331194382, 337488060, 343584595, 349003906, 354399071, 358445778, 361997032, 364652786, 367302628, 369991112, 371789856, 373718033, 374755440, 375331230, 375755920, 376341286, 376980629, 377058792, 377398376, 377823906, 378361206, 378649139, 379138718, 380386200, 381912460, 383684349, 385726891, 387761803, 389762764, 392140656, 394564552, 396825142, 399025459]
1215.1C99025459K277870J631699J023064J154060J264877Q23594L77006N66826M31709
1223.8D08576164L73459n38788j257019r18846j187096j146926j496315j834794j214714
1232.5C99355125p84683p65800r83773p45391o86722m26750n01252p09076p8163o23016
1242.2C93050499o00128j1368L52440O55517M17023Q42819R29375R08699R36890R21058
1251.8C98402824P31392P30858J363373J076240M27819M19960O49605N99212R72481
1260.5D05373764J233597R13849P00149O48957J158142J225586J029548R19419R27658
1269.2D14130669J156005J389046J235275Q18367J012345Q15887O62232K12669o1340
1277.8D21371155P5226l12844l54538n09300m37508j36070J79405M19121K2431l77961
$$ y = [399025459, 401303329, 402935028, 403958092, 405112152, 406377029, 407200623, 407577629, 408144455, 408576164, 408949623, 408410835, 407153816, 406234970, 405047874, 403900948, 402404633, 400569839, 399355125, 398570442, 397804642, 396820869, 396075478, 395388756, 394962006, 394460754, 393751678, 393673515, 393050499, 392450371, 392439003, 392791443, 393446960, 393863983, 394706802, 395636177, 396544876, 397481766, 398402824, 399134216, 399865074, 401228447, 402304687, 402732506, 403152466, 403802071, 404401283, 405373764, 406607361, 407521210, 408221359, 408870316, 410028458, 411254044, 412283592, 413203011, 414130669, 415286674, 416675720, 417910995, 418729362, 419741707, 420557594, 421219826, 421432495, 421371155, 421446381, 421133537, 420778999, 420269699, 419832191, 419696121, 419875526, 420294647, 420317078, 419939117]
1287.5D19939117l79142l12043l39622l96957j255951j405182o68869o13632r83544
1296.2D13584175j217270j095695j104889q94394j022110j234284j389999j637077
1303.9D03988457j221161j023369p97539j078148j174736n76934r62945j123046j182213
1312.5C94848366j243057j172066j132698p81441j307640j654587j587524j056824
1320.3C84912529m24538r32846j135368j355019j528816k012176k915421k451057k230950
1328.9C69926338k422104k528495k195626j746139j840210j182518j025429o78062
1336.7C56307755m47159m61235j143074j369820k25143k68326L57666J67694K68860
1345.3C53187218K10647o2179O04439K3307k86979m65927m39377o35987o63376q08601
$$ y = [419939117, 419559975, 419247932, 418908310, 418511353, 417255402, 415850220, 415181351, 414567719, 413584175, 412366905, 411271210, 410166321, 409271927, 408249817, 407015533, 405625534, 403988457, 402767296, 401743927, 400946388, 399868240, 398693504, 398116570, 397153625, 396030579, 394848366, 393605309, 392433243, 391300545, 390519104, 389211464, 387556877, 385969353, 384912529, 384487991, 383555145, 382419777, 381064758, 379535942, 377523766, 374608345, 372157288, 369926338, 367504234, 364975739, 362780113, 361033974, 359193764, 358011246, 356985817, 356307755, 355860596, 355399361, 354256287, 352886467, 352661324, 352392998, 352750664, 352918358, 353187218, 353397865, 353335686, 353940125, 353963432, 353676453, 353210526, 352771149, 352135162, 351471786, 350663185]
1355C50663185q56972k25372r99069o74896k80953l56445p80487j093292p90711o99768
1364.6C43905220n0011j237182q75283p62443n20439O88209J6747J161880M42276M11682
1374.3C43180656Q14972N84526R99794O6605Q69942L28750J185418J270179R33419
1382.9C50234261J274223Q58841K301788J793862K438888J996117J730575J424790
1390.7C64053345L33137M40407L17879P98530q50677O71387P33337l24440j351280
1399.3C64821625j168404M96025j126098q03948q84018j654396o31294p02477l02505
1408C58044510j288757m90151o69784p33796m88510p36999l63426j470719m23393q73337
1417.7C50505638n08804j959076n4093K078896K28577P53288o59065P17125P44362
$$ y = [350663185, 349806213, 349580841, 348581772, 347906876, 347625923, 347269478, 346488991, 345395699, 344604988, 343905220, 343855209, 342618027, 341742744, 340980301, 340459862, 341148071, 341164818, 342326698, 342768974, 343180656, 343995628, 344580154, 345579948, 345646553, 346516495, 346845245, 348030663, 349300842, 350234261, 351508484, 352367325, 354669113, 356462975, 358901863, 360897980, 362628555, 364053345, 364386482, 364826889, 365144768, 365943298, 365092621, 365764008, 366497345, 366172905, 364821625, 363653221, 364149246, 363023148, 362219200, 361335182, 359680786, 359049492, 358347015, 358044510, 356755753, 356265602, 355595818, 354862022, 354373512, 353636513, 353273087, 351802368, 351378975, 350505638, 349996834, 348037758, 347983665, 350062561, 350291138, 351044426, 350385361, 351102486, 351846848]
1426.3C51846848l14103J011544J68151J008454p2327J179238J129798P78466J687050
1435C58423119K02484J284675L38631K112846R68628O05622J055107O31370K000656
1443.7C67623138J18523J115723P35206N06287j32980k82174O65131j323585j27297
1452.4C68897972j284332K80533m24157k069396N06286l033905L579712j188583J767883
1461.1C67032013P82318Q64983K786216n86166L439026J505813L829422L215409M029808
1469.7C86898842N536842L719902O930084L895188P435264L773156N400238M832992
1477.5D28422508L812485N273590L841171N922966L269120M714622M198189L837776
1485.2D63292427M902115K035255M395752J625824L088379K022248L192634L729401
$$ y = [351846848, 351532745, 352544289, 352712440, 353720894, 353648567, 354827805, 355957603, 356736069, 358423119, 358625603, 359910278, 360248909, 362361755, 363330383, 363936005, 364991112, 365622482, 367623138, 367741661, 368857384, 369592590, 370098877, 369965897, 369683723, 370348854, 369025269, 368897972, 367613640, 367894173, 367470016, 365400620, 365906906, 362873001, 366452713, 365264130, 367032013, 367814331, 368679314, 371465530, 370879364, 374318390, 375824203, 379653625, 382869034, 386898842, 392435684, 396155586, 403085670, 406980858, 414416122, 418189278, 423589516, 428422508, 432234993, 437508583, 441349754, 447272720, 450541840, 455256462, 459454651, 463292427, 468194542, 470229797, 474625549, 476251373, 479339752, 481362000, 484554634, 488284035]
1492.9D88284035K307472M523277K373886J611939J790314K308273J538391J980515
1500.6E06718102K670707K54402K521477J916199K117691N54314l837624L718185K032013
1509.3E18665466M007035J497268J661988j07766J705895J719704N90286K983780l411675
1518E29311981M030152L079528K23008R1819n32112M424439R68895k25640J74408J908684
1527.6E43455162P77969K80953K170296L49350J426200j290588r78126K630996P14188
1536.3E49536400J476974J303101j502266q595238O186333K771110j592826J521339
1544E51104927q74901m11644J473580J397781M98123j501426k052155O36940J590614
1552.7E51861839L62778l359108n42870L239365K609139r015084o385002m34914L784028
$$ y = [488284035, 490591507, 495114784, 497488670, 499100609, 500890923, 503199196, 504737587, 506718102, 509388809, 509643211, 512164688, 514080887, 516198578, 516752892, 512915268, 516633453, 518665466, 522672501, 524169769, 525831757, 525723991, 527429886, 529149590, 529739876, 532723656, 529311981, 533342133, 536421661, 536644669, 536736488, 536204376, 540628815, 541597710, 541372070, 541546478, 543455162, 544233131, 544514084, 546684380, 547033730, 548459930, 547169342, 546191216, 548822212, 549536400, 551013374, 552316475, 550814209, 542218971, 548405304, 551176414, 549583588, 551104927, 550230026, 549818382, 551291962, 552689743, 553187866, 551686440, 549634285, 550271225, 551861839, 552224617, 548865509, 548322639, 551562004, 554171143, 545156059, 538771057, 538336143, 542120171]
1561.4E42120171J301803j53656m46052k972908j331444O0310N2567p23992o199875
1570E31706924L5134M63066j094208r60350K97585r61914q804093J195679R03778j02997
1579.7E22678604n01785j595268j287842j434975j078071j775322j605263j583328
1587.4E11816750j437111o31409j601868j154327j888390j200866j073609j790123
1595.1E01039047j438484k005501j160927k068634j535759j752166j857872j736832
1602.8D87482872k484474o72150j279602j311226k532005j687813j699028k573929
1610.5D73242645p64656k117004j469078j763230R4643q60214o985016J406822n00145
1619.2D60284767o08902j662369q7661j021309n027504m3221l76167M55399k249947
$$ y = [542120171, 543421974, 543268318, 542822266, 539849358, 538517914, 538578224, 538630791, 537906799, 531706924, 531742058, 532205124, 531110916, 530150566, 530448151, 529486237, 520682144, 521877823, 522781601, 522678604, 522176819, 520581551, 519293709, 517858734, 516780663, 515005341, 513400078, 511816750, 510379639, 509748230, 508146362, 506992035, 505103645, 503902779, 502829170, 501039047, 499600563, 497595062, 496434135, 494365501, 492829742, 491077576, 489219704, 487482872, 484998398, 484326248, 483046646, 481735420, 479203415, 477515602, 475816574, 473242645, 472477989, 470360985, 468891907, 467128677, 467223320, 466363106, 459378090, 460784912, 460284767, 459675865, 458013496, 457925835, 456904526, 451877022, 451833801, 451457634, 451913033, 449663086]
1627.9D49663086j321068j67732r79691o59446j004372R41734M22974m501915j949806
1636.6D40443764J693649k2812K71073O66313o74553J160621l16543J155968J722145
1645.3D46099625j331520J286125o00853J723442J942863L423043K714042m438057
1653D50818710k362098M604568M479408K300797K418747J679153K060509K500229K998123
1661.6D71498146K351914L54232L559151K907753L061066K975692K778435J145706
1669.4D90632095K089730M676017K566567L968773M521637K919922N84259L558502
1677.1E15517502L967590K965241K809524J810570M067993M522171J943855o66923
1684.8E36937523M745712N521469L976212K525177K931099K794838K559585K885514
$$ y = [449663086, 448342018, 448174286, 447194595, 446535149, 445530777, 446472511, 446895485, 442393570, 440443764, 442137413, 442114601, 442385674, 443051987, 442377434, 443538055, 443221512, 444377480, 446099625, 444768105, 446054230, 445453377, 447176819, 449119682, 452542725, 455256767, 450818710, 448456612, 453061180, 457540588, 459841385, 462260132, 463939285, 465999794, 468500023, 471498146, 473850060, 474204292, 477763443, 480671196, 483732262, 486707954, 489486389, 490632095, 492721825, 497397842, 499964409, 503933182, 508454819, 511374741, 511959000, 515517502, 519485092, 522450333, 525259857, 527070427, 531138420, 535660591, 537604446, 536937523, 541683235, 547204704, 551180916, 553706093, 556637192, 559432030, 561991615, 564877129]
1692.5E64877129K607193L675575L378677k096176M015656M929199N840759q6822n651207
1701.2E81489983N608749L737602J486550O0730J832161l66784J634827K819557J360550
1709.9E99663925O67381J350289J966667J340141o47850j580276K086448m96025n804252
1718.5E98546448M097519K841262J675797J197205P88383j92146P05414Q41140j3313
1727.2F10487709P09457N27153r95483m35715K565079K792473l337212m334259M228096
1735.9F12207298L398781P84111K152138L5705l080787L163147K621536N4855L36037
1744.6F21672821K920418K884102K002716J813240N64995L518333N3635j08757L896980
1753.3F39218483K378197K640457K844009Q80127J692810L057404K788086L271484
$$ y = [564877129, 567484322, 571159897, 574538574, 572442398, 576458054, 581387253, 587228012, 587141190, 581489983, 587098732, 590836334, 592322884, 592383614, 594215775, 593848991, 595483818, 598303375, 599663925, 600331306, 601681595, 603648262, 604988403, 604340553, 602760277, 604846725, 604350700, 598546448, 602643967, 605485229, 607161026, 608358231, 609146614, 608954468, 609659882, 610501022, 610487709, 611197166, 611724319, 610728836, 610293121, 612858200, 615650673, 612313461, 607979202, 612207298, 615606079, 616390190, 618542328, 618578033, 615497246, 618660393, 621281929, 621336784, 621672821, 624593239, 627477341, 629480057, 631293297, 631858292, 635376625, 635430260, 635321503, 639218483, 641596680, 644237137, 647081146, 647961273, 649654083, 652711487, 655499573, 658771057]
1761F58771057J77002l00140K978515J687699J339798J744766J910934q18786K249222
1769.7F69740067M758987J145859j596604j321258L503341J737442j211776J586075
1777.4F78342133O39114J517258O80160o73523J247254K409896K161408o02570J35193
1786F85856323R66416M80346J69297O85882K44293L26004j163711p36237L729248J902237
1795.7F92460098M0818J372451J707077j78527k306901J182557p33338l62701J409073
1804.4F94590607P55615J459808J007538N44815J202316J616364j239853n46875K50321
1813F99640656k17057O07682m04282O34308M62036J124191J508484N27573J090088
1821.7G04973679k38495Q95385R02329l312454j403199J662446K184982K66418k690963
$$ y = [658771057, 658948059, 658647919, 661626434, 663314133, 664653931, 666398697, 668309631, 667490845, 669740067, 674499054, 675644913, 674048309, 672727051, 676230392, 677967834, 676756058, 678342133, 678981247, 680498505, 681178665, 680505142, 681752396, 684162292, 686323700, 685721130, 685856323, 686822739, 687303085, 687472382, 688158264, 688402557, 688728561, 687564850, 686828613, 690557861, 692460098, 692500916, 693873367, 695580444, 695401917, 693095016, 694277573, 693544235, 693181534, 694590607, 695346222, 696806030, 697813568, 698358383, 699560699, 701177063, 699937210, 699390335, 699640656, 699423599, 700031281, 699626999, 700261307, 700723343, 701847534, 703356018, 703883591, 704973679, 704735184, 705630569, 706532898, 703220444, 701817245, 703479691, 705664673, 705931091, 703240128]
1830.4G03240128P70034K772370O46744M02908N63583M0665n88150j627884N84717
1839.1G06805115j69068N8594O63223J444931J335602l585892K100525J751175m2267
1847.8G10361938m84237j90048o791j257171K04162P3090N29099P69882P47528J071930
1857.4G11819382j44043L12347J373k14309j221619o47430j6785j12686P41730j91346
1867.1G10326614J523362L91464o17676Q41751N91507O15616p27158o43234p17468
1875.7G11584778R3841J41907J88675J062698O32630J304092L22418K47956l4104l00445
1885.4G15244446k36588r52911O36444n95245j395722J310578J935348Q95157M91714
1894.1G17333221J62278n36499P54013o55060p66983n07507o34614K84729j07727O78254
$$ y = [703240128, 704010162, 706782532, 707429276, 707832184, 708395767, 708436432, 707848282, 706220398, 706805115, 706636047, 706694641, 707357864, 708802795, 710138397, 706552505, 708653030, 710404205, 710361938, 709877701, 709687653, 709680862, 708423691, 708627853, 708700943, 709230042, 709999924, 710747452, 711819382, 711675339, 711987686, 711989059, 711774750, 710553131, 709905701, 709888916, 709776230, 710517960, 710326614, 711849976, 712241440, 711623764, 712465515, 713057022, 713672638, 712945480, 712302246, 711584778, 711678619, 711820526, 712009201, 713071899, 713704529, 715008621, 715331039, 715578995, 715544891, 715244446, 715007858, 714054947, 714691391, 714096146, 712700424, 714011002, 715946350, 716841507, 717333221, 717495499, 716959000, 717713013, 717057953, 716290970, 715783463, 715148849, 715433578, 715325851, 716004105]
1903.7G16004105L60946J002732J045074J18332k11563q75015n89142q56323J5640
1912.4G16014786m03519J15051M65470L82766J813965q94928l70636J234818R37500
1921.1G19295273M57687k150955j716003L128M77752Q2779N42221P49359N96848O64749
1930.7G19002838M71878O73981o39649q09173j203079p72782R1553j40228M10614K73285
1940.3G17359238J562881J89667j294327J117706O62079k92663p08924k53219m86908
1949G17855530l18222o4926J48544P17850N46875Q65707J81046N63812M70352l10440
1958.7G20656128n33676r07669n04456n54962K65961K69394P56836J180801J83639
1967.3G20811996M41285J42898k1210m10385r7198o00433p09610L48892j79673M13056
$$ y = [716004105, 716365051, 717367783, 718412857, 718531189, 718319626, 717444611, 716855469, 715999146, 716014786, 715611267, 715726318, 716191788, 716574554, 718388519, 717493591, 717122955, 718357773, 719295273, 719752960, 717602005, 715886002, 715889130, 716366882, 716449661, 716991882, 717741241, 718338089, 719002838, 719474716, 720148697, 719509048, 718699875, 717496796, 716724014, 716815567, 716675339, 717085953, 717359238, 718922119, 719111786, 717817459, 718935165, 719597244, 719304581, 718595657, 718342438, 717855530, 717537308, 717472382, 717620926, 718338776, 718885651, 719751358, 719932404, 720496216, 720966568, 720656128, 720122452, 719214783, 718710327, 718155365, 718421326, 718690720, 719447556, 720628357, 720811996, 721253281, 721396179, 721374969, 720964584, 720867386, 720266953, 719557343, 719906235, 719726562, 720139618]
1977G20139618K72369J69754M18854M50363L35312m77066p4463m32358n17654j26343
1986.6G20158386L91159p4539m29611J037369N69763j81656k03247K33230m425n48477
1996.3G20947952l62091n13840j77688k29721N43213N38635K41699K35672k76184O3934
2005.9G21011581n42526l93829o21185n53360j81427l52784L48893j43128J09940R9106
2015.6G18781281O7062r079n33524j65786n80292p52869r01565j4801r3995m30908
2025.2G15365524K53830J42212N22003k34680k98080j41678m54254p74994j085968
2033.9G13293915l64456m94538J12458K61535R1400J78147R1934j24970p52105r1095
2043.5G12202225p77436o18972k48490n33905p4844k66571N08194L32947L80859M22287
$$ y = [720139618, 720411987, 720581741, 721000595, 721450958, 721786270, 721309204, 721234741, 720802383, 720284729, 720158386, 720549545, 720475006, 720045395, 721082764, 721652527, 721470871, 721267624, 721500854, 721496429, 720947952, 720585861, 720072021, 719894333, 719664612, 720207825, 720746460, 720988159, 721223831, 720947647, 721011581, 720469055, 720075226, 719454041, 718900681, 718719254, 718366470, 718715363, 718572235, 718682175, 718781281, 718848343, 718839264, 718305740, 718139954, 717559662, 716806793, 715905228, 715890427, 715796432, 715365524, 715619354, 715761566, 716283569, 716048889, 715750809, 715609131, 715154877, 714379883, 713293915, 712929459, 712434921, 712547379, 712808914, 712900314, 713078461, 713170395, 713045425, 712293320, 712202225, 711424789, 710805817, 710557327, 710023422, 709948578, 709682007, 710190201, 710523148, 710904007, 711326294]
2053.2G11326294J63956R002o57501k30560o38428j42517O0196p7210o6375j40076
2062.8G09606781R39102K77558M43344N09567K7313j87607r01336m60434l00598q3085
2072.5G09870605j00479L77503L47748L29971P98035j29853j32904k86484K7543L7918
2082.1G11139603l20282j82190o50254o4315L41949M28543J31226M30221M91486O0730
2091.7G11806717J00555n77240j41143m15040k95562o8436l22723N75561M07334M64935
2101.4G11534958L38974J69830j13754p1182J79214m29382j04904j04370J48468M7912
2111G11595764r6283n0583Q7738P12662r0179j63041j74484J55411P5378n03311K68173
2121.6G11817245l9443l03498l44391J93329K39639r9487K87628K3499k2736k06299
$$ y = [711326294, 711490250, 711499252, 710841751, 710611191, 709972763, 709830246, 709890442, 709813232, 709746857, 709606781, 710545883, 710823441, 711266785, 711776352, 711803665, 711616058, 710714722, 710254288, 709953690, 709870605, 709770126, 710147629, 710495377, 710825348, 711623383, 711493530, 711360626, 711074142, 711101685, 711139603, 710819321, 710637131, 709986877, 709922562, 710264511, 710693054, 710824280, 711254501, 711745987, 711806717, 711907272, 711330032, 711188889, 710773849, 710478287, 710409851, 710087128, 710662689, 711070023, 711534958, 711873932, 712043762, 711930008, 711858826, 712038040, 711608658, 711503754, 711399384, 711547852, 711595764, 711499481, 711448898, 711536636, 712249298, 712159119, 711996078, 711821594, 711977005, 712052383, 711549072, 711817245, 711777802, 711474304, 711129913, 711323242, 711562881, 711463394, 711751022, 711774521, 711751785, 711545486]
2131.3G11545486K68097k19955m93851K92969J19476K24533k1591J67084j8997n1728
2140.9G11811523k77710o08673L49503L41873K72598k82821k51618J39771q1330J0453
2150.6G11423569J47934O27823L1890L6011r7122k65732J48010o1950J56555P1258
2160.2G12218246M61274N4016j23825J11694J88522O83213N2719J71051k23541J79290
2169.9G13772659O70700O6529K87552m9134M56238M16412K98691L18756J93787K40936
2179.5G16673126k02331N11093K60773J39694J73721j678M51202M62036K20718k83966
2189.1G18404388L69873K72065L74145N28641j2131J16425m01917K65503M21219K60391
2198.8G20598602L35465K80380M59366K3041M26254J71127M2954k85645n035N12924
$$ y = [711545486, 711813583, 711593628, 711099777, 711392746, 711512222, 711736755, 711715164, 711882248, 711863251, 711811523, 711533813, 710925140, 711274643, 711616516, 711889114, 711606293, 711354675, 711494446, 711413116, 711423569, 711571503, 712199326, 712231216, 712267227, 712170105, 711904373, 712052383, 711990433, 712146988, 712218246, 712679520, 712733536, 712609711, 712721405, 712909927, 713593140, 713645859, 713816910, 713593369, 713772659, 714443359, 714509888, 714797440, 714748306, 715204544, 715620956, 715919647, 716238403, 716432190, 716673126, 716470795, 716981888, 717242661, 717382355, 717556076, 717554398, 718005600, 718467636, 718688354, 718404388, 718774261, 719046326, 719420471, 719949112, 719936981, 720053406, 719651489, 719916992, 720338211, 720598602, 720934067, 721214447, 721673813, 721696854, 722123108, 722294235, 722337189, 722051544, 722046509, 722559433]
2208.4G22559433k8000M89502N2109M88968M29458j6403N55420r4070J15738L15017
2218.1G24867172K18048k85034q4686M64859M70734L83834l01971L17688K32162K28806
2227.7G26511612K22092j41983J48315j75705K49863O0043j16043l37143J09863O18897
2237.4G27149811p6218M92859N70450L68576k97699n5313L24402p6523L66592m44336
2247G28322601m77981k12250M00162P41882M19159M69131k0828L35083m7226K12174
2256.7G30141907k03324m58374L66440r9106K71225l23181M16947Q95996N78842P55462
2266.3G32342834j96228L15934l07999l82004j10702M4555J60904m50821K80610n9052
2275.9G31638031P42950O83823j00098m45785o49262N62592n32837k83737j8082O6300
$$ y = [722559433, 722531433, 723020935, 723073044, 723562012, 723991470, 723975067, 724530487, 724436417, 724552155, 724867172, 725085220, 724800186, 724715500, 725180359, 725651093, 726034927, 725732956, 726050644, 726282806, 726511612, 726733704, 726591721, 726740036, 726564331, 726814194, 726874237, 726758194, 726421051, 726530914, 727149811, 727073593, 727566452, 728136902, 728505478, 728207779, 728152466, 728476868, 728400345, 728766937, 728322601, 727844620, 727632370, 728032532, 728774414, 729193573, 729662704, 729641876, 729976959, 729929733, 730141907, 729938583, 729480209, 729846649, 729747543, 730018768, 729695587, 730112534, 731008530, 731587372, 732342834, 732146606, 732462540, 732154541, 731772537, 731661835, 731706390, 731867294, 731416473, 731697083, 731638031, 732380981, 733064804, 732964706, 732518921, 731869659, 732432251, 731899414, 731615677, 731597595, 731663895]
2285.6G31663895O93588K23846J168900O75430Q15125O06842M62494R81063k13470
2294.3G37077713K48413Q4610L99399K63443L509J122132Q78372J157150O04859N10788
2303.9G42350388J100158J583863J664352L37753P15637Q23823Q88061Q09937M47921
2312.6G50721893N63965J20239J634446K061004J649628K091064J991654J991043Q25500
2321.3G63650436Q19626J354523J185684P37229R17053J951294J418686K189788J461411
2329.9G75685730n54504r56040m73556M88433n89523J310578J399002o53611N44510
2338.6G76201019J347428J680755j021194r5749J67847j516190k304077n460663o378555
2347.3G62620621o695862M62341P193833M763412N190125M964981M294738N001908
$$ y = [731663895, 732357483, 732581329, 733750229, 734425659, 735240784, 735847626, 736310120, 737291183, 737077713, 737326126, 737410736, 737810135, 738073578, 738077087, 739199219, 740077591, 741234741, 741839600, 742350388, 743450546, 745034409, 746698761, 747036514, 747752151, 748575974, 749464035, 750273972, 750721893, 751285858, 751406097, 753040543, 755101547, 756751175, 758842239, 760833893, 762824936, 763650436, 764470062, 765824585, 767010269, 767747498, 768664551, 770615845, 772034531, 774224319, 775685730, 775131226, 774175186, 773701630, 774190063, 773600540, 774911118, 776310120, 775656509, 776201019, 777548447, 779229202, 778208008, 778112259, 778280106, 776763916, 774459839, 768999176, 762620621, 755924759, 756387100, 763580933, 768344345, 773534470, 778499451, 782794189, 787796097]
2355G87796097K108002L408889R4452J377106O16074j740647p25021Q3542O24389l010177
2364.7G90632706k034912m101258m006347l217621n112686m713211m832840l061371
2372.4G59552460l545304l268203k651215k992554k350235k761154k521362k978592
2380.1G36483841k736282k287674k269364j877670j950607j034012q05206p76444j93405
2388.8G22553177K61612J12610o32172l77579k10418j42289n41915o05088n7678Q3084
2398.4G20443344k9755l92379R3536p3547n5695J24741n19562o91147n98068q3237
2408.1G18218231k90298l02964j68304l37372q2168M8294K6245m06494l15628o22864
2417.7G15766678p57675l81165k74887j38855l97339p3013l04871l14254k2889k83889
$$ y = [787796097, 789904099, 793312988, 793407440, 794784546, 795400620, 793659973, 792934952, 793018494, 793642883, 790632706, 788597794, 784496536, 780490189, 777272568, 772159882, 767446671, 762613831, 759552460, 756007156, 752738953, 750087738, 747095184, 744744949, 741983795, 739462433, 736483841, 733747559, 731459885, 729190521, 727312851, 725362244, 724328232, 723523026, 722746582, 722553177, 722814789, 722927399, 722295227, 721917648, 721707230, 721564941, 721023026, 720417938, 720360260, 720443344, 720413589, 720021210, 720114746, 720041199, 719985504, 720110245, 719590683, 718899536, 718301468, 718218231, 717927933, 717624969, 717456665, 717119293, 717037125, 717085419, 717111664, 716705170, 716389542, 715766678, 715009003, 714627838, 714352951, 714214096, 713816757, 713743744, 713438873, 713124619, 713101730, 712817841]
2427.3G12817841m31138o80160m28772q29468m99191J27182m11758o84891k72446M120
2437G08711319m03137J74637j53351r01413q38700o20574o8512n99747m71954m20151
2446.6G04408417m18930j87149m56696l58124m92477J90353j97906p46765m16718q38165
2456.3G00485840n16281j6403p2556n14984m59442m02375j69067J4496n17655n18875
2465.9F97312698o45980j98746j45722m96978l73917n69000l74604J8540J50986m73862
2475.6F94203415m85382k61154j42365p4234k97699r8953r94186p22809o9352m08325
2485.2F90648956j78604j76010j91727n38482m92707m91638K365J36338n29099k02331
2494.8F87987061l59803J6556j61514n02930o5765j85089j08109k88696k47193l76434
$$ y = [712817841, 712386703, 711706543, 711277771, 710448303, 709949112, 710076294, 709664536, 708979645, 708707199, 708711319, 708308182, 708482819, 708329468, 707428055, 706589355, 705968781, 705900269, 705300522, 704828568, 704408417, 703989487, 703802338, 703345642, 702987518, 702495041, 702685394, 702487488, 701740723, 701324005, 700485840, 699969559, 699953156, 699880600, 699365616, 698906174, 698503799, 698334732, 698349228, 697831573, 697312698, 696666718, 696467972, 696322250, 695825272, 695451355, 694882355, 694507751, 694526291, 694677277, 694203415, 693718033, 693456879, 693314514, 693240280, 692942581, 692843628, 691849442, 691126633, 691057281, 690648956, 690470352, 690294342, 690102615, 689564133, 689071426, 688579788, 688582153, 688718491, 688189392, 687987061, 687627258, 687643814, 687482300, 686979370, 686913605, 686728516, 686620407, 686331711, 686084518, 685708084]
2504.5F85708084l7842p324m68216l77655l65524J33209r3079K900k36817m94842J2741
2515.1F83775635k28882l36685q76694k83813J2664m92630l08914l23410m425l01361
2524.7F80631485k74582k70004j52741j98135n27878m2572m29382l60413l98407l96423
2534.4F77580948k08130m75922l44085p71103n25208k44751l22418n38559m86145j39465
2544F73525162m68521l42865n79834m61121m1046k61536n77087m58069r5749l17764
2553.7F69921570j18637o0654j63193q41064q57315k89841p92847l18451k76031k12708
2563.3F65990829l70330o51627o8664n14298m65927j83792J34811k83813o26602k33002
2573F62727585p83997o80465n50003r7504K51083O5079l44620q49304m78210o34919
$$ y = [685708084, 685670242, 685662918, 685194702, 684817047, 684451523, 684584732, 684491653, 684494553, 684257736, 683762894, 683775635, 683546753, 683210068, 682333374, 682049561, 682062225, 681569595, 681260681, 680937271, 680932846, 680631485, 680356903, 680086899, 679934158, 679736023, 679208145, 679165573, 678736191, 678375778, 677977371, 677580948, 677372818, 676896896, 676552811, 675781708, 675256500, 675011749, 674689331, 674150772, 673664627, 673525162, 673056641, 672713776, 672133942, 671672821, 671631775, 671370239, 670793152, 670335083, 670239334, 669921570, 669802933, 669742279, 669579086, 668738022, 667880707, 667590866, 666798019, 666479568, 666203537, 665990829, 665620499, 664968872, 664900208, 664385910, 663919983, 663736191, 663871002, 663587189, 662960587, 662727585, 661943588, 661263123, 660713120, 660615616, 660866699, 660931778, 660587158, 659737854, 659259644, 658624725]
2582.6F58624725m20990n01175o57119k22702k15989O5918j56936n03159l94134K23541
2592.2F55841980k03323o18897K0218m06952n94711n92041k82135o1646l90320l42941
2601.9F52369232j64032j70517n09491k14386m54864m51813l38974p81555l54462l22723
2611.5F48606415k52609m83399n09262l17459m87442m67987o88706l57055q06961r04618
2621.2F43330917n87997q41675o01044p26242l75366m08363o87905m37202n11894p50008
2630.8F37403221r42840q08068r55620o36138p6828l48931j066398j088791l80593
2639.5F31099014j96380n33181j125412r74464p04498q32253j069793j042672m74281
2648.2F24146080m91943k50969k35176p62596j173478p27615j41830q47283q59718
$$ y = [658624725, 658203735, 657702560, 657045441, 656822739, 656606750, 656672668, 656515732, 656012573, 655618439, 655841980, 655638657, 655019760, 655039978, 654633026, 654038315, 653446274, 653164139, 653102493, 652712173, 652369232, 652205200, 652034683, 651525192, 651310806, 650855942, 650404129, 650065155, 649283600, 648929138, 648606415, 648353806, 647870407, 647361145, 647043686, 646556244, 646088257, 645399551, 645042496, 644235535, 643330917, 642742920, 641901245, 641300201, 640573959, 640198593, 639790230, 639102325, 638665123, 638153229, 637403221, 636460381, 635652313, 634696693, 634060555, 633983727, 633634796, 632568398, 631479607, 631099014, 630902634, 630369453, 629244041, 628269577, 627565079, 626732826, 625663033, 624620361, 624146080, 623654137, 623403168, 623167992, 622405396, 621231918, 620504303, 620362473, 619515190, 618655472]
2656.9F18655472q18138n84259n60837r90486n21889o69556m06761k96860n53588n87197
2666.5F12665901p54471o98509j066589p87659l69797l59268p27691o67458O2637j78146
2676.1F07118950m64249o60782q84971p84645l06206n96542j159401m69590l59001
2684.8F01433563n75104n92803n16968m45175m11911j65787l04527m98696p73582o17485
2694.5E96531525p03392q96836p46956o40716p9537k22168n61141n02968k80152n16700
2704.1E91380959p17926o44913j250954r42154p32689o76231m89044n68886k88773
2712.8E85069389n35888m34380l09029n45730r56078q08105n21355p53517m17290o75125
2722.4E79112892n56183j39808n6382q09822j436195j0033O0997n80063p49588q18977
$$ y = [618655472, 617837334, 617253075, 616692238, 615701752, 615179863, 614510307, 614103546, 613806686, 613253098, 612665901, 611911430, 611212921, 610146332, 609358673, 608988876, 608629608, 607901917, 607234459, 607297096, 607118950, 606654701, 605993919, 605108948, 604324303, 604018097, 603421555, 602262154, 601792564, 601433563, 600858459, 600265656, 599748688, 599303513, 598891602, 598725815, 598421288, 597922592, 597149010, 596531525, 595828133, 594931297, 594184341, 593543625, 593464088, 593241920, 592680779, 592177811, 591897659, 591380959, 590663033, 590018120, 588767166, 587825012, 587092323, 586416092, 585927048, 585358162, 585069389, 584533501, 584099121, 583790092, 583244362, 582288284, 581480179, 580958824, 580205307, 579788017, 579112892, 578556709, 578416901, 578360519, 577550697, 576114502, 576104469, 576165466, 575585403, 574835815, 574016838]
2732.1E74016838p19185n64575L6507m41971l19672k83623l85665K1514m55093k16255
2741.7E70688820m44222q65783o28395n34478n37376n71671l71627j69030N6763l72467
2751.4E66250534n22346n16777n40314k78206p64275n59501O4888r7428n07698m61616
2761E62067261m98009m46053j8653l68843n89448n47866n27802l44963J3237k69775
2770.7E58469086o47965k34222o69785o79626m53758m02031l71323m43878j39199q20274
2780.3E53607025o67953m53148o01578m59404q35457n15480m12826l53089q10509q53500
2789.9E47644081n69763j218147j004448p89528m64096m73709n32799o44188j066971
2798.6E40880432o25267r11865j066132j254883j424293q79364r00536r93728q42743
$$ y = [574016838, 573297653, 572733078, 572769585, 572327614, 572007942, 571724319, 571338654, 571360168, 570905075, 570688820, 570244598, 569378815, 568750420, 568215942, 567678566, 567106895, 566735268, 566566238, 566623001, 566250534, 565728188, 565211411, 564671097, 564392891, 563628616, 563069115, 563134003, 563036575, 562528877, 562067261, 561569252, 561123199, 561104546, 560735703, 560146255, 559598389, 559070587, 558725624, 558738861, 558469086, 557821121, 557586899, 556917114, 556237488, 555783730, 555381699, 555010376, 554566498, 554427299, 553607025, 552939072, 552485924, 551884346, 551424942, 550589485, 550074005, 549661179, 549308090, 548497581, 547644081, 547074318, 545856171, 544851723, 544062195, 543598099, 543124390, 542591591, 541947403, 540880432, 540255165, 539343300, 538277168, 537022285, 535597992, 534718628, 533818092, 532824364, 531981621]
2807.3E31981621p38602j107941r72786r46159j332435j362496j236229q08220j188621
2816E22288132j352768j328354j516457j171913j038513j198311j099510p97882j884804
2824.7E10899620k364082j388626q85125r56802j865158k003441j429710j283226j486588
2833.3D97236862j436882j400451j692238j475602j973114k357864k218704k069664
2841.1D82612343j761284k124023k435952k513618k282601k166252k482452k859879
2848.8D63986282k556762k167588k703323k277756j691513j639213j635285j156387
2856.5D48158455n83000j349373j364594j223793j582107j712570j769219j658211
2864.2D36915588k071533j975860j920090k364845k563477k540855k621498k637368
$$ y = [531981621, 531243019, 530135078, 529162292, 528216133, 526883698, 525521202, 524284973, 523476753, 522288132, 520935364, 519607010, 518090553, 516918640, 515880127, 514681816, 513582306, 512784424, 510899620, 508535538, 507146912, 506261787, 505304985, 503439827, 501436386, 500006676, 498723450, 497236862, 495799980, 494399529, 492707291, 491231689, 489258575, 486900711, 484682007, 482612343, 480851059, 478727036, 476291084, 473777466, 471494865, 469328613, 466846161, 463986282, 461429520, 459261932, 456558609, 454280853, 452589340, 450950127, 449314842, 448158455, 447575455, 446226082, 444861488, 443637695, 442055588, 440343018, 438573799, 436915588, 434844055, 432868195, 430948105, 428583260, 426019783, 423478928, 420857430, 418220062]
2871.9D18220062k320289k727242k804718k781067k787285k359886k493553k288208
2879.6C97657814k017784j739349j751061j873436j356392j311378j418877j403122
2887.3C84786415j158790j251526j401673q65288o20880l71246j11198j05133j44158
2896C78756523k59628o68755n97419k61765n99251n41229q12759j323891r90181m43459
2905.7C72258186m87976q68263r80110j450501j172332j016236j889343j954842k043190
2914.3C60395393k403984k344360j993446j725884j717949j798553j945038j733551
2922.1C44732628j515732j068764o17141r41773r43603m24347O9008P04116O83670
2930.7C40678062K89994M95071J066132J850395J615639J422195K045441K137222K453613
$$ y = [418220062, 415899773, 413172531, 410367813, 407586746, 404799461, 402439575, 399946022, 397657814, 395640030, 393900681, 392149620, 390276184, 388919792, 387608414, 386189537, 384786415, 383627625, 382376099, 380974426, 380109138, 379488258, 379117012, 379005814, 378900681, 378756523, 378496895, 377828140, 377230721, 376968956, 376369705, 375828476, 375015717, 373691826, 372701645, 372258186, 371770210, 370901947, 369921837, 368471336, 367299004, 366282768, 364393425, 362438583, 360395393, 357991409, 355647049, 353653603, 351927719, 350209770, 348411217, 346466179, 344732628, 343216896, 342148132, 341530991, 340589218, 339645615, 339221268, 339290276, 339994392, 340678062, 340968056, 341463127, 342529259, 344379654, 345995293, 347417488, 349462929, 351600151, 354053764]
2939.4C54053764K487183K404289K339592K610855L273430K891922K808342K886810
2947.1C75756187K912674L047448K786750K707215K908935K871323K337570K392273
2954.8C97720375K516899L135224L565673L055230K899475K558479K820854K636490
2962.6D20908699K405663K716178K256623K467460L099099K869567K072297K222938
2970.3D41018524K338524K336769K666855K360840K100105J534004J723061K140198
2978D58218880K320900K208023J667251K207833J989135J507149J487503J663170J810188
2986.7D75080032J262322J169395J115380J198349J024322J013680J292801J006164
2994.4D84162445P65648M83627M98734K37808J86119J21117k62604K33650P62100O44494
$$ y = [354053764, 356540947, 358945236, 361284828, 363895683, 367169113, 370061035, 372869377, 375756187, 378668861, 381716309, 384503059, 387210274, 390119209, 392990532, 395328102, 397720375, 400237274, 403372498, 406938171, 409993401, 412892876, 415451355, 418272209, 420908699, 423314362, 426030540, 428287163, 430754623, 433853722, 436723289, 438795586, 441018524, 443357048, 445693817, 448360672, 450721512, 452821617, 454355621, 456078682, 458218880, 460539780, 462747803, 464415054, 466622887, 468612022, 470119171, 471606674, 473269844, 475080032, 476342354, 477511749, 478627129, 479825478, 480849800, 481863480, 483156281, 484162445, 484928093, 485411720, 485910454, 486148262, 486334381, 486455498, 486192894, 486426544, 487188644, 487833138]
3004D87833138j86425m78630k26097l51219n19447n51491l87078j31607k56042j090393
3013.7D83654709j121025p18918p82280j014710p17773k29187r77364j396675j140709
3022.4D75556068n17158n36270j334038j526756j472931q09822q24623p49169j228142
3031D66557159k078933j066895j029091j161041j491165j712189j279983j448899j033935
3039.7D54255028j177979j434669j320000j272011j439018j502647j334801j936798
3047.4D42837105j553192r70574j205292j516456j487885j402092j728592j287155
3055.1D31685867j449432j840897j662483j410103j239052j467819j098137j320953
3062.9D20196991j799202j828766j397171q57277j442375j927681j902313j447067
$$ y = [487833138, 487646713, 487168083, 486941986, 486590767, 486071320, 485519829, 485132751, 485001144, 484745102, 483654709, 482533684, 481814766, 481032486, 480017776, 479300003, 479070816, 478093452, 476696777, 475556068, 475038910, 474502640, 473168602, 471641846, 470168915, 469359093, 468534470, 467785301, 466557159, 464478226, 463411331, 462382240, 461221199, 459730034, 458017845, 456737862, 455288963, 454255028, 453077049, 451642380, 450322380, 449050369, 447611351, 446108704, 444773903, 442837105, 441283913, 440313339, 439108047, 437591591, 436103706, 434701614, 432973022, 431685867, 430236435, 428395538, 426733055, 425322952, 424083900, 422616081, 421517944, 420196991, 418397789, 416569023, 415171852, 414314575, 412872200, 410944519, 409042206, 407595139]
3070.6D07595139j367608j506309j241417j550865j407242r73587j524849j949844
3078.3C96073418j534500j531182j371727j117401j472473j633453j736870j378289
3086C84297523j457633j808358j595382j140633q27408j385727j370544j352806j464920
3094.7C71894112j335907j592560j465721j512223j306381j456222j709099j222534
3102.4C60293465j101075j260681j310768j134682j699562j628723q57658j202011
3110.1C50098305j608467j618615j318397j186829r27162j059379j625138j475143
3117.8C39279175j552735j509399j258850j107254j111984j432457j515770j380997
3125.5C28409729j198082j188469j265373j470223j325950j039124j270599j374645
$$ y = [407595139, 406227531, 404721222, 403479805, 401928940, 400521698, 399548111, 398023262, 396073418, 394538918, 393007736, 391636009, 390518608, 389046135, 387412682, 385675812, 384297523, 382839890, 381031532, 379436150, 378295517, 377468109, 376082382, 374711838, 373359032, 371894112, 370558205, 368965645, 367499924, 365987701, 364681320, 363225098, 361515999, 360293465, 359192390, 357931709, 356620941, 355486259, 353786697, 352157974, 351300316, 350098305, 348489838, 346871223, 345552826, 344365997, 343438835, 342379456, 340754318, 339279175, 337726440, 336217041, 334958191, 333850937, 332738953, 331306496, 329790726, 328409729, 327211647, 326023178, 324757805, 323287582, 321961632, 320922508, 319651909, 318277264]
3133.3C18277264j205273j278648j286412j275863j802922j306629o82087j045360
3141C08394070r75972j111869j289463j448059j110478o78635j134700j176434j100998
3149.6B98367462j188450j257705j067601j035556j080227j121121j605034j206340
3157.4B88805428j028309j141491q81481r25160r39598j061058r00154r53941j275158
3166B79699078j304150j034508j029224j044502m21658o97842j328983j078625n69667
3174.7B71189919r12304j230832p06691q38490j193828j152096p67575o54811o78540
3183.4B63054752j088371j480637o73084p44457n47047n19657j292572j087742q03547
3192.1B54817638m01859p14626q78029r51443j013889m72374p87010o52886p70988
$$ y = [318277264, 317071991, 315793343, 314506931, 313231068, 311428146, 310121517, 309439430, 308394070, 307418098, 306306229, 305016766, 303568707, 302458229, 301779594, 300644894, 299468460, 298367462, 297179012, 295921307, 294853706, 293818150, 292737923, 291616802, 290011768, 288805428, 287777119, 286635628, 285754147, 284828987, 283889389, 282828331, 281928177, 280974236, 279699078, 278394928, 277360420, 276331196, 275286694, 274865036, 274167194, 272838211, 271759586, 271189919, 270277615, 269046783, 268340092, 267501602, 266307774, 265155678, 264388103, 263733292, 263054752, 261966381, 260485744, 259812660, 259068203, 258521156, 258001499, 256708927, 255621185, 254817638, 254415779, 253701153, 252823124, 251871681, 250857792, 250385418, 249598408, 248945522, 248174534]
3200.8B48174534p09534k29015o96984j211757j455097q58231o16302p21722p08275
3209.4B40967617r93919p72953l30773k04334p52983j036453o18134k32639l77674
3218.1B35647755q03261j066494q15907k47345m16107o04915o90861p10068q13045
3226.8B29479752o56624k72980o17409k46143q12588j344700m12292k62070l08189
3235.5B24546757n81188l35446m39663j007690n69420l56007m58812m35963k69432
3244.2B20093136p12071r41887o18267j74980k174q32749r37461m29478R7465k35080
3253.8B15306454j032563o90422k79312l23448o86989m92630n40714m47979J78776
3262.5B10991173O9179o06441j114826k71187j72520l21178m2935m55570m14333m14296
$$ y = [248174534, 247465000, 247235985, 246539001, 245327244, 243872147, 243013916, 242397614, 241675892, 240967617, 239973698, 239200745, 238869972, 238665638, 237912655, 236876202, 236258068, 236025429, 235647755, 234844494, 233778000, 232962093, 232714748, 232298641, 231693726, 231002865, 230292797, 229479752, 228823128, 228550148, 227932739, 227686596, 226874008, 225529308, 225117016, 224854946, 224546757, 223965569, 223630123, 223190460, 222182770, 221613350, 221257343, 220798531, 220362568, 220093136, 219381065, 218439178, 217820911, 217645931, 217643757, 216811008, 215873547, 215444069, 215541534, 215306454, 214273891, 213583469, 213304157, 212980709, 212293720, 211801090, 211260376, 210812397, 210991173, 211060352, 210453911, 209339085, 209067898, 208895378, 208574200, 208531265, 208075695, 207661362, 207247066]
3272.1B07247066j39236n11169m31061l58524j370736m98695P1907J50967L5839p31221
3281.8B03465137m97512k74926k32563j80473l94154m41932k94018n28545n21756m18911
3291.4A99680347m01649L7193j18122k02427l74069m54845j70288q4038j76049p97958
3301A96938095m55322Q0356l3721k85588m46510k66705n91774o43463J2589L61099
3310.7A94669056n35030p83501m18320n81379J12953r9010j56975Q6384n60875n76897
3320.3A91156406l88698l32413o71749k82516l7671j84497r003p14493m20284n6610
3330A88058472n92003n68638m99687m17881O8340K5215l97301p9879l61367n35850
3339.6A84699421m04186o24428j03912L3245j23635j09596k91977n27668k71301J75743
$$ y = [207247066, 207107830, 206596661, 206165600, 205807076, 204436340, 203937645, 204009552, 204160519, 204196358, 203465137, 202967625, 202692699, 202460136, 202279663, 201885509, 201443577, 201149559, 200621014, 200099258, 199680347, 199278698, 199315891, 199197769, 198995342, 198621273, 198166428, 197996140, 197912102, 197736053, 196938095, 196482773, 196563129, 196529408, 196243820, 195797310, 195530605, 194938831, 194295368, 194307957, 194669056, 194134026, 193350525, 192932205, 192350826, 192463779, 192364769, 192207794, 192294178, 191733303, 191156406, 190767708, 190435295, 189763546, 189481030, 189443359, 189258862, 189249859, 188535366, 188115082, 188058472, 187466469, 186897831, 186398144, 185980263, 186048603, 186073818, 185676517, 185596638, 185235271, 184699421, 184295235, 183670807, 183566895, 183600140, 183476505, 183366909, 183074932, 182547264, 182275963, 182451706]
3349.3A82451706k35729l62053j34526k05955k43721k87037n43289n34725j05171j41640
3358.9A79657860l60241o76956q01907q9149J67713m04186o3382N2662q31012m18797
3368.6A76232605M902o390J71490N8575j23768p37152n34096j2894Q9054J71318m24614
3379.2A74889030q69979j44406O96450J3160p39612o38142k67658M6596j12819j39714
3388.8A72732906j91459N8136K95124q9684n04398l06416J37673j51635n92784m06895
3398.4A70980568J01757Q6193J56746J32332R556M46624k39391l80859q4553j33514
3408.1A71075459L64437R5672j91421k79522J9226L34682J11428l92132p01409J04619
3417.7A70541039N58223L52745j95961j23901K38247K11887L91312j80550j03321J21823
$$ y = [182451706, 182215977, 181853924, 181719398, 181513443, 181269722, 180982685, 180439396, 179904671, 179799500, 179657860, 179297619, 178620663, 177818756, 177729607, 177897320, 177493134, 177429752, 177482414, 176651402, 176232605, 176237507, 176231117, 176402607, 176461182, 176337414, 175600262, 175066166, 175053272, 175142326, 175313644, 174889030, 174019051, 173874645, 174571095, 174584255, 173844643, 173206501, 172938843, 172985439, 172872620, 172732906, 172541447, 172599583, 172894707, 172805023, 172300625, 171994209, 172131882, 171980247, 171387463, 170980568, 171082325, 171168518, 171325264, 171457596, 171467152, 171913776, 171674385, 171293526, 171208973, 171075459, 171439896, 171535568, 171344147, 171064625, 171083851, 171418533, 171529961, 171137829, 170436420, 170541039, 171099262, 171452007, 171256046, 171132145, 171370392, 171582279, 171973591, 171793041, 171689720, 171811543]
3427.4A71811543p2880j21441k53925J59454L28140L04794j11026j13087L75977N04493
3437A72812042M12216J47839M91333K17228J8158J23024k766K79808Q4095O237J92986
3447.6A74782200L66115M24824N86949J53007p0858N22003J20869J96114L81336M60396
3457.3A77922955L47099l41053J16882N91374Q51574M29992P8602L32089J52854K42615
3466.9A80724983K58789L35903M17004O44550L73898K83718R96533M39300k95582J73474
3476.6A84352570Q37974O10218K50187M43535P28245K09560n9452R58920K37083o4373
3486.2A88504467O26793L27969N53493O38676O75983L23696M83551N73902J48697N56584
3495.8A93413811L87153K97909P61032J186657P55558P00913N82847j92127L86524
$$ y = [171811543, 171738663, 171617222, 171363297, 171522751, 171850891, 172155685, 172044659, 171931572, 172307549, 172812042, 173224258, 173372097, 173863430, 174080658, 174098816, 174221840, 174219074, 174498882, 174582977, 174589214, 174782200, 175148315, 175573139, 176160088, 176313095, 176242237, 176764240, 176885109, 177081223, 177462559, 177922955, 178270054, 177929001, 178045883, 178637257, 179488831, 179918823, 179997425, 180329514, 180482368, 180724983, 180983772, 181319675, 181736679, 182381229, 182755127, 183038845, 184035378, 184474678, 184179096, 184352570, 185190544, 185800762, 186050949, 186494484, 187222729, 187432289, 187372837, 188331757, 188568840, 188504467, 189131260, 189459229, 190012722, 190651398, 191327381, 191651077, 192134628, 192708530, 192857227, 193413811, 193800964, 194098873, 194859905, 196046562, 196802120, 197503033, 198085880, 197893753, 198280277]
3504.5A98280277K53010P98054J138191R45950L12042n90477J122284J099281K59953
3513.2B03618565O18972J212311R01070j45436N27478J093788R69601N86681R91859
3521.9B10374889N67532o42967Q19759J178570R56249N31941O34346Q21437L98503
3530.6B15640259M80575O24237J603127J258488J055717K97794k85224J567249J168613
3539.2B23410835L49865K62490J102581J435680J102810M10118k19135J543407M43783
3547.9B29842434R21268J678734J841793K172795l45650Q74424R91726J117153J773376
3556.6B40868053O44741J437130J090050Q39749Q13942K189502J584225M86603L943901
3565.3B53897896J333618q62789J023559N44072K400093J171703J174488K011414J689396
$$ y = [198280277, 198533287, 199331341, 200469532, 201415482, 201727524, 201137047, 202259331, 203358612, 203618565, 204237537, 205449848, 206350918, 206205482, 206732960, 207826748, 208796349, 209383030, 210374889, 210942421, 210299454, 211119213, 212297783, 213254032, 213785973, 214420319, 215241756, 215640259, 216120834, 216745071, 218348198, 219606686, 220662403, 220960197, 220674973, 222242222, 223410835, 223760700, 224023190, 225125771, 226561451, 227664261, 228074379, 227855244, 229398651, 229842434, 230763702, 232442436, 234284229, 236457024, 236111374, 236985798, 237977524, 239094677, 240868053, 241512794, 242949924, 244039974, 244879723, 245693665, 247883167, 249467392, 249953995, 253897896, 255231514, 254368725, 255392284, 255936356, 258336449, 259508152, 260682640, 262694054, 264383450]
3574B64383450J602726K465972J965409O88934K025433J201420P03430J998634K600269
3582.6B79635677K040654J069889L079414J812000L45440J858120L77293L473663L683357
3591.3B97375507K953759J407985Q28152L199024j53255K222137M014168J341858K427940
3600C15617275P49817R61800K411823K403488L458557L619271K200966l90320L850898
3608.7C34883575L72467O1226P067376P94143j196174M776229M14505M002572M777298
3617.4C55953217J151313R08966r48906K647858M498901L208848K832984L316193K794914
3626C76364288L021584O691666j086426j1454811N756035O831932N817947O10886j311379
3634.7C91241722L591080M012222K947617J309166K275772K648086K362900J688995
$$ y = [264383450, 265986176, 268452148, 270417557, 271106491, 273131924, 274333344, 275036774, 277035408, 279635677, 281676331, 282746220, 285825634, 287637634, 287983074, 289841194, 290218487, 293692150, 297375507, 300329266, 301737251, 302565403, 305764427, 305611172, 307833309, 311847477, 313189335, 315617275, 316367092, 317328892, 319740715, 322144203, 325602760, 329222031, 331422997, 331032677, 334883575, 335256042, 335317268, 342384644, 343178787, 341982613, 346758842, 347173347, 351175919, 355953217, 357104530, 358013496, 357064590, 359712448, 364211349, 367420197, 370253181, 373569374, 376364288, 379385872, 386077538, 384991112, 373536301, 379292336, 386124268, 391942215, 392553101, 391241722, 394832802, 398845024, 401792641, 403101807, 405377579, 408025665, 410388565, 412077560]
3642.4D12077560Q58422K884407M522362O406097q29964l049011O187019j244621l275185
3651.1D24537086R47648P035331O210709N182724M921951q420486K105369N860062
3658.8D48380394K218857K050972J199684K651253J316833K274246K347222J779785
3666.5D64219246N732994K531662p86552q3771n918808M330482J0057183J0452842
3674.3D90535278j957435j9354554M995385R487343N625915k156906K24419L322715
3682D90722160K570343J664963R91821J678124N047836O104317j0593834j972923R352989
3690.6E05565796m490509J431732N946541J140060J737633M15230M74396K254409J723557
3699.3E16198845L228645J816178n654221m73213N919761J944390P5874J400185M008713
$$ y = [412077560, 412935982, 415820389, 420342751, 426748848, 425918884, 422869873, 429056892, 427812271, 424537086, 425484734, 432520065, 438730774, 443913498, 448835449, 440414963, 442520332, 448380394, 450599251, 452650223, 453849907, 456501160, 457817993, 460092239, 462439461, 464219246, 469952240, 472483902, 471697350, 471613579, 465694771, 470025253, 480082436, 490535278, 488577843, 469223289, 474218674, 483706017, 489331932, 487175026, 487399445, 490722160, 493292503, 494957466, 495949287, 497627411, 502675247, 508779564, 498185730, 496212807, 505565796, 501075287, 502507019, 508453560, 509593620, 511331253, 511746483, 512220879, 514475288, 516198845, 519427490, 521243668, 515589447, 515116234, 521035995, 522980385, 523056259, 524456444, 528465157]
3708E28465157M743194q201523L820763M684486j5117035N401078N170517N58853J717224
3716.7E31242714L667564K122536l612976K090034P201691l925362m244422O191253
3724.4E40733032M82369q71773j639671J499786M736710J054954N862541l511467o157913
3733.1E42188568J1186028m96102j0503006n798J975479R32007L992195L727608m700318
3741.8E48296661M181290J2527733j4118347j6401024J2526779P362633O522102l764229
3749.5E57133598r962845J2850838r076805p753105P644234O008529M714089n286370
3757.2E56272163L885537O532249j0238266j765556M831123K272377J313973M088439
3764.9E67192039l552551m810638M889488N922356j27449j0741616K388230M527664
$$ y = [528465157, 533208351, 525006828, 528827591, 533512077, 518395042, 523796120, 528966637, 529525490, 531242714, 534910278, 537032814, 533419838, 535509872, 542711563, 538786201, 534541779, 540733032, 541215401, 540343628, 538703957, 540203743, 544940453, 545995407, 551857948, 548346481, 542188568, 553374596, 552878494, 542375488, 542369690, 544345169, 545277176, 549269371, 552996979, 548296661, 552477951, 565005684, 550887337, 534486313, 547013092, 554375725, 560897827, 557133598, 547170753, 560021591, 550944786, 543191681, 550835915, 556844444, 561558533, 556272163, 560157700, 566689949, 556451683, 554686127, 559517250, 561789627, 563103600, 567192039, 563639488, 558828850, 563718338, 569640694, 569513245, 558771629, 561159859, 565687523]
3772.6E65687523Q14323Q24852K65885J588173N16052L475609r82590q653297M248466
3781.3E67784996K893906J447334K287445m046440q79555J991730J367340J382294
3789E74229050m91677j51443Q65745J134835M06151J618156L888817l550835n018120
3797.7E72930679L102379N595169O399842r044304j1564484N573082M677391O402321
3805.4E84072075N379600j2771034l761635O125870K749634R91402P11898P6218J904449
3814.1E85478477O044236l293419j4749870P092399P113114N573654J206207k2403221
3821.8E72061577L951759P387543K601662L517570L95508m793511L98026L116837M937667
3830.5E93574638J606408j0254403L943749Q079414p955169j34316R482727j0991402
$$ y = [565687523, 566501846, 567326698, 567592583, 569180756, 569696808, 573172417, 572189827, 563536530, 567784996, 570678902, 572126236, 574413681, 570367241, 569487686, 571479416, 572846756, 574229050, 573737373, 573585930, 574451675, 575586510, 575992661, 577610817, 581499634, 577948799, 572930679, 576033058, 581628227, 588028069, 578983765, 567419281, 572992363, 577669754, 584072075, 589451675, 576680641, 572919006, 579044876, 581794510, 582785912, 583497810, 583574028, 585478477, 591522713, 588229294, 573479424, 580571823, 587684937, 593258591, 594464798, 572061577, 576013336, 583400879, 586002541, 589520111, 589915619, 585122108, 585520134, 588636971, 593574638, 595181046, 584926643, 588870392, 596949806, 588994637, 588860321, 598343048, 587351646]
3838.2E87351646m807205R436722o365013R60045Q777618l410415m197121L219681
3845.9E90965958J751251N76134K173690r2125K706147O237716o997566n01480j6912498
3854.6E79907227M142723J2768058k257270k825852L180237L468323K950363o557427
3862.3E94776382O85196Q025093p911300n858536N969734O848831P135239j1153107
3870E98517532j1198158O210289Q332825L273659j2926484J978722N386314M22211
3877.7E99996910L385620N524407o934357q987503O710930Q35342J716881O573601
3885.4F08821831j4243737J439209M909440J190452N071640m32510q849449J343879
3893.2E99250755L158341j786080J920472K266998L530464J166496j1463394P206345
$$ y = [587351646, 582544441, 591981163, 585616150, 586576195, 595353813, 591943398, 587746277, 590965958, 592717209, 593293343, 595467033, 595374908, 598081055, 604318771, 597321205, 596819725, 579907227, 584049950, 596818008, 594560738, 591734886, 594915123, 598383446, 601333809, 594776382, 595461578, 603486671, 595575371, 589716835, 595686569, 602535400, 609670639, 598517532, 587319374, 593529663, 601862488, 605136147, 592209663, 594188385, 599574699, 599996910, 603382530, 608906937, 601972580, 592985077, 599696007, 600531349, 602248230, 608821831, 594578094, 596017303, 600926743, 602117195, 607188835, 606756325, 597906876, 599250755, 602409096, 600623016, 602543488, 604810486, 608340950, 609507446, 598044052, 605250397]
3900.9F05250397J936645o725120N989036l540039k766533O3439J764755K686882l56445
3909.6F04303017K23617k16675P42531N43747m28772J582909K672310m546013m344978
3918.2F00531693N832481k31323l776551M081498J642189K19001k674179l950996K362518
3926.9F04036331L116989J489678j959763p87201K392922l031159j311874K377357
3934.6F06323280J6747m3144P50923R13734l3989m84047K342186M49791n439529K62260
3944.3F05058212K193642J066589J512184k346992J083221M10462k998390K408561
3952F08387489J85662o72608J208954J08452J43967q54874l6240J8082J502380J120224
3961.6F11111488k782249k19612J435776J05018k47536Q3199J22986q16994L23372
$$ y = [605250397, 607187042, 600461922, 606450958, 602910919, 600144386, 600207825, 601972580, 604659462, 604303017, 604526634, 604309959, 605052490, 605596237, 605167465, 606750374, 609422684, 604876671, 600531693, 606364174, 606132851, 602356300, 606437798, 608079987, 608298988, 605624809, 601673813, 604036331, 607153320, 608642998, 606683235, 605896034, 608288956, 605257797, 603945923, 606323280, 606340027, 606296883, 607047806, 607961540, 607927551, 607443504, 609785690, 610235481, 604795952, 605058212, 607251854, 608318443, 609830627, 607483635, 608566856, 608977318, 605978928, 608387489, 608573151, 607900543, 609109497, 609217949, 609361916, 608507042, 608470802, 608488884, 609991264, 611111488, 608329239, 608109627, 609545403, 609650421, 609402885, 609486084, 609609070, 608792076, 609115448]
3970.3F09115448J458282n16777q11958O85997K22664j50604n99060O218O64367L10707
3980F10385284M00734p15561o26678L31879K01454m16336k64397K00691K09885J472473
3989.6F11179428O94389k68592J0109j01204J43585q61550j39198O61545M84810R7771
3999.2F11901093o90423
4000.2F11210670
$$ y = [609115448, 610573730, 610056953, 609244995, 609930992, 610153656, 610003052, 609403992, 609410210, 610074577, 610385284, 610786018, 610070457, 609443779, 609775658, 609977112, 609560776, 609296379, 609497070, 609706955, 611179428, 611873817, 611605225, 611615334, 611514130, 611657715, 610796165, 610656967, 611318512, 611803322, 611901093, 611210670]
##END=$$ End of the data block
