##TITLE=$$ Begin of the data block
##JCAMP-DX=5.00 $$ ACD/SpecManager v 10.08
##SPECTROMETER/DATA SYSTEM=Varian
##DATE=20 Nov 2012 15:39:58
##DATA TYPE=INFRARED SPECTRUM
##DATA CLASS=XYDATA
##ORIGIN=
##OWNER=
##NPOINTS=3735
##FIRSTX=399.26403809
##LASTX=4000.35498047
##MAXX=4000.35498047
##MINX=399.26403809
##MAXY=79.57221222
##MINY=11.24652386
##XFACTOR=1.0000000000
##YFACTOR=0.000000100000000
##FIRSTY=39.95289993
##DELTAX=0.96440572
##XUNITS=1/CM
##YUNITS=TRANSMITTANCE
##XYDATA=(X++(Y..Y))
399.3C99528999j3236236R777221J0584412J617622q457717j6760979m427948Q732147
407C87357521J1044426M013519p171707j4025040k906799J0625611L324356k99340
414.7C91962547L221474J711044m740371o576271L176422O597747L408127o577911
422.4C92182808n423851m932671m373817O733055R89189k290535m495926l942871n99975
431.1C73845406J13830L490753N83115q10242L18833n254517k808266J99166k264977
439.8C67413101M627533N413017m693870O16684M587555J292038J48964N241623Q013267
448.4C92659912L564644J08681q1787j671677l710861o31295J38245N51071J885147
457.1C92812080n619468L57818N165825J789055m135857m071273O62384M63066m68674
$$ plain form
399.3 399528999 386292763 396069984 406654396 408272018 399814301 383053322 378625374 387357521
407 387357521 398401947 402415466 395243759 381218719 378311920 388937531 392261887 391962547
414.7 391962547 395184021 396895065 392154694 385578423 388754845 395352592 398760719 392182808
422.4 392182808 386758957 381826286 377452469 384185524 385174713 382884178 378388252 374445381 373845406
431.1 373845406 373959236 377449989 378033104 377222862 377541695 372287178 369478912 369678078 367413101
439.8 367413101 372040634 377453651 372759781 373376465 377964020 379256058 379405022 384646645 392659912
448.4 392659912 396224556 396333237 396251450 394579773 390868912 390237617 390375862 390926933 392812080
457.1 392812080 387192612 387550430 392716255 394505310 390369453 386298180 386960564 387423630 386954956
465.8C86954956j857147l963242j711998j62010j632957l287659k092285K147407l709297
474.5C70685768q646431R81980L940734p97462o35681k956581k920647j512680K041435
483.2C60180435L828316J535988q57392j973762k210350j965485K303009k106590m290924
491.8C54443245J641655J770210J789513N8594o07415n01175J258850J445580j294899
500.5C60004158m368668o564979n78232k256317j761246O37474k254333j806259o30074
509.2C40421524R64203j556015m097633l033028j056748k420158k923202k269211m548874
517.9C19480858P52563q64334l238411p50141j515179l93543m66041j854458l175583
526.6C07975731O25591J07994k09484K195778N01041R92375M80804J044350J723785
$$ plain form
465.8 386954956 385097809 381134567 379422569 379260559 377627602 374339943 372247658 374395065 370685768
474.5 370685768 362039337 363021317 366962051 366164589 365528908 362572327 359651680 358139000 360180435
483.2 360180435 364008751 365544739 364687347 362713585 360503235 358537750 360840759 358734169 354443245
491.8 354443245 356084900 357855110 359644623 359703217 359095802 358594627 359853477 361299057 360004158
500.5 360004158 355635490 349070511 348492279 346235962 344474716 345112190 342857857 341051598 340421524
509.2 340421524 341385727 339829712 335732079 332699051 331642303 329222145 326298943 324029732 319480858
517.9 319480858 320233421 319369087 316130676 315380535 313865356 313471813 313005772 311151314 307975731
526.6 307975731 308601322 308709316 308499832 310695610 311196651 312189026 312669830 313714180 315437965
535.2C15437965K591706K995605O20194J556778K512207L040084L031693K979927K260475
543.9C37026634J148415J292572p01904j082879P19872n93376k880326o4163Q86765
552.6C35751610j450386l17154n11971j522560k921295k420235p11860j661072k806435
561.3C21428642l885631j374169k461738l763504k987194n142212k607098k38113j580220
570B97388763m429302k087707j177235k231770p58762n21603J911049r1076J203423
578.6B89205780J588459R15489L721600M049682M194565O76003K673473N175133L967666
587.3C16167850J642056j91917J583080K292271M787941J662101o66504m09279n04570
596C26363029Q52776j868858j047402K09580L86924j7509r61533O75927L24287J541710
$$ plain form
535.2 315437965 318029671 321025276 321645470 323202248 325714455 328754539 331786232 334766159 337026634
543.9 337026634 338175049 339467621 338765717 337682838 338402710 337809334 334929008 334864845 335751610
552.6 335751610 334301224 333984070 333472099 331949539 329028244 326608009 325896149 324235077 321428642
561.3 321428642 317543011 316168842 313707104 309943600 306956406 301814194 299207096 298968983 297388763
570 297388763 292959461 290871754 289694519 287462749 286703987 286182384 288093433 288002357 289205780
578.6 289205780 290794239 291709728 295431328 299481010 303675575 304351578 307025051 312200184 316167850
587.3 316167850 317809906 317617989 319201069 321493340 326281281 327943382 327276878 326867599 326363029
596 326363029 327215805 325346947 324299545 324509125 324896049 324878540 323917007 324592934 324917221 326458931
605.6C26458931K64435q87795M4213L8490K83585r04847M68674J153297J776009J467590
615.3C30162582J513253L510704J928177J006088P93686J274948J538696J409531J862068
624C44999733J560898J240349J538047L169060K191849K248497L200149R21021l84483
632.7C60685120L42559J894913R10874K85034J019249R14535Q44918j31798J451721
641.3C68217125K026024J15814N15823J161271R96933J155509M96560j170502q9798
650C73424759K528267K071800j01509L48129J874657J153564K25296k58712j1177O8168
659.7C81323242l29704L42445j02310j89285K00729R65157L005638O534195J1934585
668.3D03684692q576545o158676j375390O89316O81458J216278J209564J678047J311493
$$ plain form
605.6 326458931 326723366 325835571 325879784 325918274 326201859 325297012 325765686 326918983 328694992 330162582
615.3 330162582 331675835 335186539 337114716 338120804 338914490 340189438 341728134 343137665 344999733
624 344999733 346560631 347800980 349339027 352508087 354699936 356948433 360148582 361069603 360685120
632.7 360685120 361027679 362922592 363833466 364118500 365137749 366052284 366897202 366765404 368217125
641.3 368217125 370243149 370358963 370874786 372036057 373032990 374188499 374685059 373514557 373424759
650 373424759 375953026 378024826 377923317 378271446 380146103 381299667 381524963 381266251 381255074 381323242
659.7 381323242 380993538 381335983 381233673 381044388 381245117 382210274 385215912 391750107 403684692
668.3 403684692 395108147 388949471 387574081 388263397 388944855 390161133 391370697 393048744 394360237
677C94360237M95796O03638J330719J780472J036835R05189M10767J55754J82113j56974
686.7D01104546K40364J67007J350708J094666j205788j425438q24051p5722p77397
695.3C99648895j275940n60646j134453j326599k005920k265587j103859o20117r64089
704C88391685j810340j554604j083679j511116q54454O78940N68542P68929J845626
712.7C85439529J908341K610435K647171J998482K373886K784691M026871M923363
720.4D08712769K237472J292420L372764L445549K803154L537979L966751L540459
728.1D32909317L291931K525940J709671J663246J890259J928482J927452K539864
735.8D50386162J864281N37185Q15201J479607J169967N46837j125221j191025Q18901
$$ plain form
677 394360237 394856033 395459671 396790390 398570862 399607697 400512886 400923653 401079407 401261520 401104546
686.7 401104546 401344910 401511917 402862625 403957291 402751503 401326065 400502014 400426292 399648895
695.3 399648895 398372955 397812309 396677856 395351257 393345337 391079750 389975891 389355774 388391685
704 388391685 386581345 385026741 383943062 382431946 381577492 382256432 382824974 383593903 385439529
712.7 385439529 387347870 389958305 392605476 394603958 396977844 399762535 403789406 408712769
720.4 408712769 410950241 412242661 415615425 419060974 421864128 425402107 429368858 432909317
728.1 432909317 436201248 438727188 440436859 442100105 443990364 445918846 447846298 450386162
735.8 450386162 452250443 452787628 453602829 455082436 456252403 456799240 455674019 454482994 455301895
744.5D55301895o55632j896782q43353l34206j530914k542648j957016l018074l067856
753.2D39455414k473679k998199k718849k787667l925667l407020j497955j920472
760.9D17725906k330665j442223M0398M59366o30074P10030K013855J548881J709557
769.6D19805031K819786L941574L897591M040794L951874M733619N176468M176331
777.3D52543068M614525M843216M953537M118766L884697L257370K374039L846283
785D84435501L792915K957879K067260K382355K489281K323990K304840K421074L249969
793.7E08425064J394157J838685K220230K005806K536125J608162K612686K449150
801.4E25090065K279549K250785K513619J913834J083831K054444J025467R15527K78969
$$ plain form
744.5 455301895 454646263 452749481 451906128 451571922 450041008 447498360 445541344 442523270 439455414
753.2 439455414 436981735 433983536 431264687 428477020 424551353 421144333 419646378 417725906
760.9 417725906 415395241 413953018 413993416 414452782 413822708 414532738 416546593 418095474 419805031
769.6 419805031 422624817 426566391 430463982 434504776 438456650 443190269 448366737 452543068
777.3 452543068 457157593 462000809 466954346 471073112 474957809 478215179 480589218 484435501
785 484435501 488228416 491186295 493253555 495635910 498125191 500449181 502754021 505175095 508425064
793.7 508425064 509819221 511657906 513878136 515883942 518420067 520028229 522640915 525090065
801.4 525090065 527369614 529620399 532134018 534047852 535131683 537186127 538211594 539127121 539406090
810.1E39406090l10555p324N02815j74408j012725J119995J290435P57332q78944j097412
819.7E39595299k57874m32739O7902r42688l23563j881371k328338j319123j754493
828.4E30423012n19524j915932l052520l584061l018722k325440k952881k448730k865639
837.1E07739563k890129k502823k108688k868653l324279j812821j657028k494812
844.8D88080330k305336j887550j952210j184044j692276j909218j534500k371292
852.5D73243904j988144k430000k704659k303505k346763k803688k635536j263695
860.3D54767914n95627J469421K990647L077812M058800N264702O273231N444069N846863
868.9D88597832O389160O100464O236992N671615N363312M180641M632988M097824
$$ plain form
810.1 539406090 539095535 539088211 539591026 539416618 538403893 539523888 540814323 541571655 540692711 539595299
819.7 539595299 539337425 538904686 538972588 538029900 537706337 535824966 533496628 532177505 530423012
828.4 530423012 529903488 527987556 524935036 521350975 518332253 516006813 513053932 510605202 507739563
837.1 507739563 504849434 502346611 500237923 497369270 494044991 492232170 490575142 488080330
844.8 488080330 485774994 483887444 481935234 480751190 479058914 477149696 475615196 473243904
852.5 473243904 471255760 468825760 466121101 463817596 461470833 458667145 456031609 454767914
860.3 454767914 454172287 455641708 458632355 461710167 465768967 471033669 477306900 482750969 488597832
868.9 488597832 494986992 501087456 507324448 512996063 518359375 522540016 527173004 531270828
876.7E31270828K563973J026725k54516m11492j739196k274704k642670j944427l063813
885.3E22530708l646316k684174l552513l428688l725700l761750m347000m444236
893D92940331m233513m408684l376198k923508k138519k043838j754761j833916l016281
901.7D67211113k960587k750740l093071m255714m510574m240151m162865m548301
909.4D36689110n203781n077057n287361m731408m265632n401917o269073o345253
917.2C94107628n490875m128189m033967l743782l198852k230721j477050j303673
924.9C68500519j45607p8697J73072k49366n59883N36956N31655J022987J206780R79118
934.5C71917534J126709J832580K800484K246895K166176K734947K181854K144470
$$ plain form
876.7 531270828 533834801 534861526 534607010 534195518 532456322 530181618 527538948 525594521 522530708
885.3 522530708 518884392 516200218 512647705 509219017 505493317 501731567 497384567 492940331
893 492940331 488706818 484298134 480921936 477998428 475859909 473816071 472061310 470227394 467211113
901.7 467211113 464250526 461499786 458406715 454151001 449640427 445400276 441237411 436689110
909.4 436689110 431485329 426408272 421120911 416389503 412123871 406721954 400452881 394107628
917.2 394107628 388616753 384488564 380454597 376710815 373511963 371281242 369804192 368500519
924.9 368500519 368354912 368276215 368449287 368199921 367640038 368176994 368708649 369731636 370938416 371917534
934.5 371917534 373044243 374876823 377677307 379924202 382090378 384825325 387007179 389151649
942.2C89151649K351304J993408J536484N51109j50376j093482k359467l874626n294113
950.9C82811890n405503n902595o628723o261673o672287p749062q306999p309532
958.6C28575516p305565p861061p434635q440972q182735q429470q287735q662148
966.3B63971195r047355p842484r181595q636741q612423q181553q211289q735504
974.1A95522251p758617q292904o883393p376728o560850o289329o252117m865628
981.8A41242685m353227k771321m442167k873592k599898k569627j395207j616249
989.5A18621397m59356j882935k99988n05409k58131K87371K14185J131926r00888
998.2A15948172K43959j99537J95598j75638j79357Q72163k82964P23524j271811k48518
$$ plain form
942.2 389151649 391502953 393496361 395032845 395583954 395433578 394340096 391980629 388106003 382811890
950.9 382811890 377406387 371503792 364875069 358613396 351941109 344192047 335885048 328575516
958.6 328575516 321269951 313408890 305974255 297533283 289350548 280921078 272633343 263971195
966.3 263971195 254923840 247081356 237899761 229263020 220650597 212469044 204257755 195522251
974.1 195522251 187763634 179470730 172587337 165210609 158649759 152360430 146108313 141242685
981.8 141242685 136889458 134118137 129675970 126802378 124202480 121632853 120237646 118621397
989.5 118621397 118162041 116279106 115979118 115473709 115215578 115502949 115717134 116849060 115948172
998.2 115948172 116192131 115992594 116188192 116012554 115833197 116705360 116422396 117145920 115874109 115625591
1007.8A15625591k49500p13749R0437j63937Q17395j388903R212r57851o03456Q64601
1017.5A13329840k89316N54208k10581J469594L1442N80702P64971K93512J744433
1026.1A18268805N58157K088699O6109R25178J161432P18890J846923M66004J531973
1034.8A27632170j65081J192827P12414J28679P38163j81208K82088j382008J238031
1043.5A30196075l1499L82347J345930k25039J000595k83298J726370N63421J105757
1052.2A35780659J811304J443615K086220N21221L160429K267542K642955K859097
1059.9A52573042K927370L715115L465347M361973K347641M235458L738155K927552
1067.6A80291653J309795j482067j735706l912812k535457m210568m397812l163089
$$ plain form
1007.8 115625591 115376091 114662342 114752779 114588842 115406237 114017334 114026546 113068695 112465239 113329840
1017.5 113329840 113040524 113594732 113384151 114853745 114885187 115465889 116230860 116524372 118268805
1026.1 118268805 118826962 120915661 120981770 121906948 123068380 123787270 125634193 126100197 127632170
1034.8 127632170 127467089 128659916 129372330 129501009 130239172 130057964 130340052 128958044 130196075
1043.5 130196075 130164576 130546923 131892853 131667814 132668409 132385111 134111481 134674902 135780659
1052.2 135780659 137591963 139035578 141121798 141643019 144803448 147070990 149713945 152573042
1059.9 152573042 155500412 159215527 162680874 167042847 169390488 173625946 177364101 180291653
1067.6 180291653 181601448 180119381 178383675 174470863 171935406 167724838 163327026 160163937
1075.3A60163937k374173j416425k620373N3978j271887J64118J082048R57003J922789
1084A56661015O96535K115402J908426L327637J365108J744328L183517K544423L102321
1092.7A76648712R99890K773685K137852K062454J745338J310044J361046m92402J713276
1101.4A90259895J96820J56173K11888L39298R50642K51560J903324J96876J549283
1110A96015759J476326J940269K795181J929131K477169L42960K043839J890888K196636
1118.7B13108158J808624L79391J734524N37224J372642Q93307J417980J432819J611004
1127.4B24295673J958352J039924K811890J229915K119885K303848J541672J041126
1135.1B38342285o74972K96592j271610j517754k237987k417526k585621l755646l175373
$$ plain form
1075.3 160163937 157789764 156373339 153752966 153806944 152535057 152699175 153781223 154738226 156661015
1084 156661015 157357550 159472952 161381378 164709015 166074123 167818451 171001968 173546391 176648712
1092.7 176648712 177648602 180422287 182560139 184622593 186367931 187677975 189039021 188546619 190259895
1101.4 190259895 190456715 190612888 190824776 191164074 192114716 192366276 194269600 194466476 196015759
1110 196015759 197492085 199432354 202227535 204156666 206633835 206976795 209020634 210911522 213108158
1118.7 213108158 214916782 215296173 217030697 217567921 218940563 219833870 221251850 222684669 224295673
1127.4 224295673 226254025 227293949 230105839 231335754 233455639 235759487 237301159 238342285
1135.1 238342285 237667313 237963905 236692295 235174541 232936554 230519028 227933407 224177761 221002388
1143.8B21002388l735523k051850l232097l184033k503891k553672j922303l213310
1151.5A98605709j236668j416587q23117r45873j97792M49219q79879J508922P38659
1160.2A95802593J329766J354579K271748K868023K032204L721103L499947N182285
1167.9B18062248M767246N429383N770817O077957P394581O542110P836380O798267
1175.6B68678989P283745P489853P072773O760273O072788P457104P158260P225953
1183.3C25199738O177177O333084O393890N186844M911309L942222M164353L174171
1191C65482788K113190K256508K358665J445656N56679J019287L59230O67763Q72306
1199.7C77132072L20473J13259M6958P82814P14112J292038J336822P33223J097412
$$ plain form
1143.8 221002388 217266865 215215015 211982918 208798885 206294994 203741322 201819019 198605709
1151.5 198605709 197369041 195952454 195129337 194183464 193985672 194434891 193555012 195063934 195802593
1160.2 195802593 197132359 198486938 200758686 203626709 205658913 209380016 212879963 218062248
1167.9 218062248 222829494 228258877 234029694 240107651 247502232 254044342 261880722 268678989
1175.6 268678989 275962734 283452587 290525360 297285633 303358421 310815525 317973785 325199738
1183.3 325199738 331376915 337709999 344103889 349290733 354202042 358144264 362308617 365482788
1191 365482788 367595978 369852486 372211151 373656807 374213486 375232773 375592003 376259766 377132072
1199.7 377132072 377452545 377565804 377612762 378395576 379109688 380401726 381738548 382471771 383569183
1208.4C83569183J862908K550354K425384K406159K154922J967964J857071K153664
1216.1D00947609K197761J380082R95216R34639P60269M52805K81410K58446L42483
1224.8D08550720l60298q55560p72743j039658j272850k046089j690293r32312j234321
1233.5C98346596r02214o73561l06206m78554p91664n10788p95135m01154j18141l96767
1243.1C92972412l30086N12352O82755L08761O94504O37856J168403J350060Q31222
1251.8C98828239P02591R60541J187592P92808O94237M20990L78494Q84705J047058
1260.5D05897255Q51059R26475J101380Q35609O89698O74934J115990J364288J251450
1269.2D14708138J135559J076622J110725R41162J046829R54705N64537k5063O5041
$$ plain form
1208.4 383569183 385432091 387982445 390407829 392813988 394968910 396936874 398793945 400947609
1216.1 400947609 403145370 404525452 405520668 406455307 407215576 407668381 407949791 408208237 408550720
1224.8 408550720 408190422 407334862 406562119 405522461 404249611 402203522 400513229 399580917 398346596
1233.5 398346596 397444382 396770821 396464615 395986061 395194397 394683609 393888474 393487320 393369179 392972412
1243.1 392972412 392642326 393154678 393837433 394146194 394840698 395478554 396646957 397997017 398828239
1251.8 398828239 399530830 400491371 401678963 402471771 403166008 403586998 403965492 404850197 405897255
1260.5 405897255 406748314 407674789 408776169 409611778 410301476 410976410 412092400 413456688 414708138
1269.2 414708138 415843697 416920319 418031044 418972206 420019035 420973740 421538277 421513214 421578255
1277.8D21578255l3799m32167k21672k40440k64664l32756K12860K2965m93698J31836
1287.5D19926720J78032l54805r04313r68132r83543n88188o02455j081200q96759
1296.2D13725357j203422j289406j188698q09288j104164j608048j097946j030197
1303.9D04394188q18634j227722j322708r08471j134338q34351r75074r61190j073722
1312.5C95137978j371308j120643j118203r53903j309891j330909j335869j246719
1320.3C85350533m84658r09691j234436j202469j569290k245903k660598k385712k486763
1328.9C70171013k542610k651596k171326j622124j617622j181793j197090p62558
1336.7C56424294p54586o15730p74231p60994k80266n02281J53465k42500K83585N57174
$$ plain form
1277.8 421578255 421544456 421112289 420890617 420650177 420385513 420052757 420265617 420288582 419794884 419926720
1287.5 419926720 420104752 419749947 418845634 417877502 416893959 416305771 415703316 414622116 413725357
1296.2 413725357 412521935 411232529 410043831 409234543 408130379 406522331 405424385 404394188
1303.9 404394188 403575554 402347832 401025124 400116653 398982315 398147964 397172890 396211700 395137978
1312.5 395137978 393766670 392646027 391527824 390573921 389264030 387933121 386597252 385350533
1320.3 385350533 384865875 383956184 382721748 381519279 379949989 377704086 375043488 372657776 370171013
1328.9 370171013 367628403 364976807 362805481 361183357 359565735 358383942 357186852 356424294
1336.7 356424294 355669708 355053978 354279747 353518753 353238487 352736206 352889671 352647171 352930756 353487930
1346.3C53487930M89273M91753l59268L25470k76985l98522p27272j296387r88006
1355C50747986r26743k66800p14416m09203o19087o14281k19497r45435j101265r71145
1364.6C43960114j51177j028023n88226n68428p90329O43082J35536J180534P19528
1373.3C43512611N19638O04821L10173R28535K45018P92351L12920J304321J093483
1382C49623871O88743J406441J269531K469788J707420K045937J562157J808433J532669
1390.7C64114990N15442J200867L73459o2867o17752O22101L32299K5062r35821j583443
1400.3C63984337L75786r35173o32592n44166k098084j431389l22303n9777j470871
1409C56865768l53355n62286p26624o03638j138267n01328j107368l27492q23517K91977
$$ plain form
1346.3 353487930 353977203 354468956 354109688 354435158 354158173 353759651 353032379 351735992 350747986
1355 350747986 349821243 349554443 348840027 348430824 347811737 347197456 346977959 346032524 344931259 343960114
1364.6 343960114 343808937 342780914 342192688 341624260 340833931 341477013 341612549 342793083 343512611
1373.3 343512611 344032249 344637070 344947243 345875778 346120796 346913147 347226067 348530388 349623871
1382 349623871 350312614 351719055 352988586 355458374 357165794 359211731 360773888 362582321 364114990
1390.7 364114990 364630432 365831299 366204758 366141891 365524139 366146240 366478539 366503601 365567780 363984337
1400.3 363984337 364360123 363424950 362792358 362248192 360150108 358718719 358396416 358336639 356865768
1409 356865768 356512413 355950127 355223503 354619865 353481598 352980270 351872902 351545410 350721893 351013870
1418.6C51013870j478119o72760J774788J10665Q85849p80297L71132O89545k10266
1427.3C51704407R85946J8387P81861J05056J513901R76982P09229K182121M77982
1436C59455872r385J96991K560769R99870P62405J426773L16010J516609K35596J211929
1445.6C68673439Q46939P29065l20854k26784R89189j115989n59884j519126O78749
1454.3C68174744L61442p31735q55217m888268M102021p00951K009392P39059Q25539
1463C69036026K317848q53805L816604J436882M094696L391686M303779N581856L920593
1471.7C97046165Q100777K489281O868820M015198N590248M846039L815574N156289
1479.4D37928391L448753N765915L454437N098190M265747L612976N186043K357025
$$ plain form
1418.6 351013870 349535751 348862991 350637779 350748444 351634293 350853996 351225128 351914673 351704407
1427.3 351704407 352690353 352708740 353490601 353595657 355109558 356086540 356795769 358977890 359455872
1436 359455872 359446487 359643478 362204247 363204117 363966522 365393295 365709305 367225914 367461510 368673439
1445.6 368673439 369520378 370249443 369928589 369701805 370690994 369575005 369015121 367495995 368174744
1454.3 368174744 368536186 367804451 366949234 362060966 366162987 365462036 367471428 368210487 369036026
1463 369036026 371353874 370500069 374316673 375753555 379848251 383239937 387543716 393125572 397046165
1471.7 397046165 405146942 407636223 414505043 418520241 424110489 428956528 432772102 437928391
1479.4 437928391 441377144 447143059 450597496 455695686 459961433 463574409 468760452 471117477
1487.1D71117477M015084J035080K938194K743225L386955L668671K053261M204216
1494.8D95162163J845360K089538K850990K412110Q30650J909294K559128J88179K684059
1503.5E12531471J820297K016449r14230j769333N522385L43246L471871J935386J676865
1512.2E26634407k80037J651306J471024L15437L132668k998238M316940L087960k137
1520.8E37329330O67572j151580M022979J059990J56365N8326J679421Q00514L16086
1529.5E44939003K107887M71840K052536r31549j640587K247620P68623J631661N82733
1538.2E52229767k578278o186943N544815J749077p85179K579231j077423n80864J571465
1546.9E52465668J166115O51893j061325k364273K61879J107788J80245k639466r45129
$$ plain form
1487.1 471117477 475132561 476167641 479105835 481849060 485236015 488904686 490957947 495162163
1494.8 495162163 497007523 499097061 501948051 504360161 505190811 507100105 509659233 509847412 512531471
1503.5 512531471 514351768 516368217 515453987 513684654 519207039 519550285 523022156 524957542 526634407
1512.2 526634407 526354370 528005676 529476700 529792137 532924805 529926567 534243507 537331467 537329330
1520.8 537329330 537996902 536845322 540868301 541928291 542084656 542142982 543822403 544622917 544939003
1529.5 544939003 547046890 547518730 549571266 548639717 546999130 549246750 550015373 551647034 552229767
1538.2 552229767 549651489 543464546 549009361 550758438 549973259 552552490 551475067 550894203 552465668
1546.9 552465668 553631783 554283676 553222351 550858078 551119957 552227745 552407990 549768524 548823395
1555.6E48823395K845039K524681j0626869q068619K683029M483719J097908l32107
1563.3E43430176k05918k393722j155586k2164n0316j121559n843506J38054L4066
1572E32809525j145134p98035J43509j362877p743111J188164K19612o01845n51185
1580.6E22158623j037751r04273j650124j336746j632958j301155j606102j545982
1588.4E11143532q51631j869851q96263j338615j239967j413308j589622j000939j918029
1597D99025307j559983k280120j823311k305641j721535j177979k042694r10644j704140
1605.7D83499260j217957k306594j514016j830749k714386o91338k022896j267890
1613.4D69933434j867409l30734j488991o943550J722183l81355l62206j534271j39694
$$ plain form
1555.6 548823395 551668434 554193115 543566246 535497627 538180656 542664375 543762283 543430176
1563.3 543430176 543224258 540830536 539674950 539652786 539602470 538480911 532637405 532775459 532809525
1572 532809525 531664391 530866356 531009865 529646988 521903877 523092041 523311653 522709808 522158623
1580.6 522158623 521120872 520216599 518566475 517229729 515596771 514295616 512689514 511143532
1588.4 511143532 510291901 508422050 507525787 506187172 504947205 503533897 501944275 500943336 499025307
1597 499025307 497465324 495185204 493361893 491056252 489334717 488156738 486114044 485203400 483499260
1605.7 483499260 482281303 479974709 478460693 476629944 473915558 473224220 471201324 469933434
1613.4 469933434 468066025 467735291 466246300 459302750 461024933 460643578 460281372 458747101 458607407
1622.1D58607407j242943m628220K81487n45273L05023k205810j472779k74429p15294
1630.8D48109169n13763j104279J106834N02892m568787k210159P73850L4446J018677
1639.5D43148880J284866q68644O44531L4981J405601J390267j507874O51207r55696
1648.1D45228119K498512K139969L451843M442635M165153q809929J778183M030304
1655.9D58924789K284012K320481K079734K285653J941032K928123K515374N16281
1663.6D75795479L705330K723808K786713K839737K811851J671524K299843M275207
1671.3D98909492K798386L805199L858528K944717O34308L438683L873977K972145
1679E23235435L176156K157516M253044M384422K381402m52424M063836N526809L799935
$$ plain form
1622.1 458607407 457364464 452736244 453017731 452472458 452777481 450571671 449098892 448824463 448109169
1630.8 448109169 447595406 446491127 447597961 448100853 443532066 441321907 442095757 442130203 443148880
1639.5 443148880 444433746 443565102 444209633 444244614 445650215 447040482 445532608 446183815 445228119
1648.1 445228119 447726631 449866600 453318443 457761078 461926231 453116302 454894485 458924789
1655.9 458924789 461208801 463529282 465609016 467894669 469835701 472763824 475279198 475795479
1663.6 475795479 479500809 482224617 485011330 487851067 490662918 492334442 494634285 498909492
1671.3 498909492 501707878 505513077 509371605 512316322 512950630 516389313 520263290 523235435
1679 523235435 526411591 528569107 532822151 537206573 539587975 539135551 543199387 548726196 552526131
1687.7E52526131K608184K765160K299576K706528L208885K629509L745498L698159
1695.4E76187630k824211L958129N070115O272354K550811o461792M184990L074685
1703.1E92012711J512832N7106J815796k29072J444015K884102J467018P45049J141738
1711.8F02851295J750870J305466p84149j973725J589814N05790n249443L490372L010979
1720.5F06497269J572227J006889O23436J08300R87510Q91838P6752K69699K18621
1729.1F12252541r79538m54903K915878L021622l639984l994141M149742L431092R02366
1737.8F17604675J652794l02543k118531K980919J761971K5940J355743L354416K446670
1746.5F28762054J271782K114830Q14286L212089K92206P4577L892441K483978K817841
$$ plain form
1687.7 552526131 555134315 557899475 560199051 562905579 566114464 568743973 572489471 576187630
1695.4 576187630 573363419 577321548 582391663 588664017 591214828 584753036 588938026 592012711
1703.1 592012711 593525543 593582649 595398445 595169373 596613388 599497490 600964508 601709557 602851295
1711.8 602851295 604602165 605907631 605123482 603149757 604739571 605245361 599995918 603486290 606497269
1720.5 606497269 608069496 609076385 609699821 609808121 610795631 611687469 611764221 612033920 612252541
1729.1 612252541 611273003 610818100 613733978 616755600 613115616 609121475 613271217 616702309 617604675
1737.8 617604675 619257469 618954926 616836395 619817314 621579285 621605225 622960968 626315384 628762054
1746.5 628762054 630033836 632148666 632962952 636175041 636467247 636541824 640434265 642918243 645736084
1755.2F45736084K661591K30026J947326L106080K606506L397293n9814m19312L009110
1763.9F62214890J690597J689301J912002J572342n07431K760620M570160P82776j324921
1772.5F75360336j500320L161468J557389q93860J925659M91409J216202P25937k92053
1781.2F81752167J415252K065049K004776j33973L56141Q60443q9951j75094R73815
1789.9F89028625J39084p0419j022873J14441L855209J066437m19464J459427J770935
1798.6F95921402n417k151337J347428o33240l50647J447067R96018J496506Q73565
1807.3F98941345O07987J067505J836090r55201r60617R995m49066O07071j9150O81610
1816.9G01367569K34756J120758J534424N49546J251602j83869Q89740R64737l075027
$$ plain form
1755.2 645736084 648397675 648627701 650575027 653681107 656287613 659684906 659625092 659205780 662214890
1763.9 662214890 663905487 665594788 667506790 669079132 668571701 671332321 675902481 676685257 675360336
1772.5 675360336 673860016 677021484 678578873 677685013 679610672 680102081 681318283 682044220 681752167
1781.2 681752167 683167419 685232468 687237244 687103271 687459412 688319855 688229904 688054810 689028625
1789.9 689028625 689167709 689097290 688074417 688188858 692044067 693110504 692691040 694150467 695921402
1798.6 695921402 695915985 693764648 695112076 694478836 694128189 695575256 696571274 698067780 698941345
1807.3 698941345 699549332 700616837 702452927 701497726 700537109 700547104 700098038 700705109 700685959 701367569
1816.9 701367569 701602325 702723083 704257507 704807053 706058655 705874786 706764526 707729263 704654236
1825.6G04654236j261749J337738J722335J54419k595367Q11081L092728J037368O08673
1834.3G09561462M29917n44205o06003j250839M39072k71683j5259L98255J315307
1842.9G09456024J591721l538895K025604J913452j60980o32400k21024J44272r57565
1851.6G09620209J38321j30844L32717Q99353R52607Q72192j11847M05731j14517k12097
1861.3G12651825j037521n65110j19857K9602N97534n84412J819687N18341n89828
1869.9G12720261J169510N09872K52533q24814m09012o76117N5771K38419j17264O13480
1879.6G13532639Q41674J728974K68936J29928k47421n96008J90201m36783N42145
1888.3G15954285p95670j539535J062545J768723R06906O81076N48782o08749N17731
$$ plain form
1825.6 704654236 703392487 704730225 706452560 706606979 704011612 704822693 707915421 708952789 709561462
1834.3 709561462 709991379 709447174 708841171 707590332 708029404 707757721 707742462 708140717 709456024
1842.9 709456024 711047745 707508850 709534454 711447906 711286926 710654526 710433502 710577774 709620209
1851.6 709620209 709758530 709627686 709960403 710859756 711812363 712684555 712572708 712978439 712863922 712651825
1861.3 712651825 711614304 711049194 710929337 710958939 711556473 710972061 712791748 713310089 712720261
1869.9 712720261 713889771 714399643 714652176 713827362 713418350 712742233 712798004 713036423 712919159 713532639
1879.6 713532639 714374313 716103287 716372223 716502151 716254730 715658722 715848923 715412140 715954285
1888.3 715954285 715158615 713619080 714681625 716450348 717357254 718038330 718587112 717978363 718496094
1896.9G18496094l94287o48117p21283o37589N12772N0430P64694K33536P74536J089401
1906.6G19520187q6517j96762m91104r74579j092377K26212l93143O5003M98962N66101
1916.2G17641983J763992j093597k91901J306229R54666K94037j999970j494369n6381
1924.9G17024689O97326J27564J66626L87726Q42056J022568J19323N90210n00717
1933.6G20477371p64313p54928o79398l53241m32510N77316L82843J300507J09482
1942.3G19863129j253510J182938Q81042l78341q07496M2496m25262l53470Q163j74865
1951.9G18584824N09948N69687R09043M65469N93338O6376o16150k89459n63660k52380
1961.6G19977036m53110K517L25318Q07876R60465M1656N24521O72989L205r05762
$$ plain form
1896.9 718496094 718101807 717453690 716732407 716094818 716607590 716658020 717422714 717656250 718430786 719520187
1906.6 719520187 719433670 719236908 718745804 717771225 716678848 716905060 716511917 716576920 717075882 717641983
1916.2 717641983 719405975 718312378 718020477 719326706 720281372 720575409 718575439 717081070 717024689
1924.9 717024689 717722015 717849579 718016205 718403931 719245987 720268555 720387878 720978088 720477371
1933.6 720477371 719713058 718958130 718278732 717925491 717492981 718070297 718453140 719753647 719863129
1942.3 719863129 718609619 719792557 720673599 720295258 719487762 719530258 719104996 718751526 718759689 718584824
1951.9 718584824 719094772 719664459 720573502 721038971 721632309 721698685 721082535 720793076 720229416 719977036
1961.6 719977036 719523926 719526443 719851761 720659637 721620102 721661758 722186279 722859268 722862473 721956711
1971.2G21956711k04773k41776m88815j01395l59192M46244L07159P62787N98755P2708
1980.8G22748413K08283m66614k43378l90625k73361l95126J80664J56250l02735J112595
1990.5G22334366O32400l51257n01633K98310K22854n04379l53241o66275k47803j24817
2000.1G20738525N55573L32718K8076N09644M0817J31683o98700m57229l09067o44531
2009.8G20227509l32032n03387N0049R4833K78244J57471J45569n9815n70526n25894
2019.4G18962021n09644j48315o43387l09296n03769l38287L19138j33438M73404l5630
2029.1G17132797l12195p64236r29642l06701o40183l70560m22210Q7814K96936J78146
2038.7G13949966J78147J83716k4414n72663j44272q26645n16357m37546n48782O6681
$$ plain form
1971.2 721956711 721751938 721510162 721021347 720919952 720560760 721007004 721314163 722076950 722675705 722748413
1980.8 722748413 722956696 722490082 722246704 721856079 721582718 721187592 721368256 721524506 721221771 722334366
1990.5 722334366 722966766 722615509 722113876 722412186 722635040 722130661 721777420 721111145 720863342 720738525
2000.1 720738525 721294098 721626816 721654892 722164536 722205353 722337036 721638336 721181107 720872040 720227509
2009.8 720227509 719895477 719392090 719442139 719536972 719815216 719972687 720118256 720058441 719487915 718962021
2019.4 718962021 718452377 718304062 717660675 717351379 716847610 716509323 716828461 716695023 717168427 717132797
2029.1 717132797 716820602 716056366 715126724 714820023 714179840 713809280 713387070 713474884 713771820 713949966
2038.7 713949966 714128113 714311829 714287415 713714752 713570480 712743835 712227478 711789932 711241150 711307831
2048.4G11307831j33896N68237J93939L36838J87073q8654K52762l32184l26385q71048
2058G11094513j40686r613k02713J45645P0801Q89435K01568J51596L83225K11029
2067.6G12794800k66876p72629j72196l96957j27029K7313L93371L44849K77405Q01010
2077.3G12903061J48544j38550m28924j30463k88315k39410j45187n52826K04696K30790
2086.9G11563416L58734J60827M36402L32260R8953O05927m19388m57230o70547k53449
2096.6G11755905O2790l34396M06799L32565N23529M22898J64032m73252j37100M53034
2106.2G13176804l08838k03247l91083J25046Q0490J60904M21981j6021L15780r4986
2115.9G13266830J65101j93634l4867L64685j30081j50299n15747j1826j79062L40500
$$ plain form
2048.4 711307831 711173935 711742172 711936111 712272949 712460022 712371368 712624130 712291946 711965561 711094513
2058 711094513 710953827 710944214 710741501 710887146 710957947 711847382 712048950 712200546 712583771 712794800
2067.6 712794800 712527924 711755295 711583099 711186142 711059113 711086426 711479797 711824646 712102051 712903061
2077.3 712903061 713051605 712913055 712484131 712353668 712065353 711825943 711680756 711127930 711332626 711563416
2086.9 711563416 711922150 712082977 712519379 712851639 712950592 713556519 713137131 712679901 712009354 711755905
2096.6 711755905 711818695 711484299 711891098 712223663 712747192 713170090 713334122 712860870 712723770 713176804
2106.2 713176804 712867966 712664719 712273636 712398682 712479172 712640076 713062057 713046036 713361816 713266830
2115.9 713266830 713431931 713238297 713203430 713568115 713438034 713287735 712771988 712760162 712581100 712921600
2125.5G12921600K01187l88870L27683k5406L07083Q7128q1177m81186n99976K63520
2135.1G12531586J05056J51825p1182J24359p2250J75171J02844m44336K87094L1281
2144.8G12921448J89819j73035o1950K77862k22854L9978j3428M11835o0501j35804
2154.4G13173370m1580l25546J74713L3264N5390K19955P02210J00784k38495R537
2164.1G13863602K08587P42035J10398M02526m7912m8981M84772O7139M80194L13415
2173.7G16575775M34647J02005J48086J97220J31302O35910Q9188J49841L5400J06812
2183.4G18606186j2970J83716M82788K65121O50711J6632L11585o3477k98690N56030
2193G20697632J60141k1286o1951N76630K87170J11008N50537N25208K90451k04773
$$ plain form
2125.5 712921600 713122787 712733917 713061600 713036194 713343277 713430405 713349228 712868042 712268066 712531586
2135.1 712531586 712636642 712788467 712717285 712841644 712769394 712944565 713047409 712603073 712890167 712921448
2144.8 712921448 713111267 712938232 712876282 713154144 712931290 712971268 712957840 713369675 713309174 713173370
2154.4 713173370 713131790 712806244 712980957 713014221 713069611 713289566 713991776 714092560 713854065 713863602
2164.1 713863602 714072189 714814224 714924622 715327148 715279236 715230255 715715027 715782166 716262360 716575775
2173.7 716575775 717010422 717112427 717260513 717457733 717589035 718224945 718314133 718463974 718499374 718606186
2183.4 718606186 718593216 718776932 719259720 719524841 720175552 720192184 720503769 720440292 720141602 720697632
2193 720697632 720857773 720836487 720774536 721351166 721638336 721749344 722299881 722825089 723115540 722910767
2202.6G22910767L40576J17340J19934Q3389L47824N41306q4458M01917r8343K76260
2212.3G24956512J63956k08511M33960J49231N14526K88086m349l26004L19596N82199
2221.9G26869202k31324J43128l1586L86200K51770J57395L61785J00480J66397k31705
2231.6G27941742K13013O0043m55093m17176N77851N80520k31476M96674K40631L40881
2241.2G29347610L05863L92685J22452m82636J40534k71302J755n6381K24304M09317
2250.9G30134201J13220O75354L89481L70331l02201j38931k33841L8529O00738l74298
2260.5G31272583K55203O7520M19159L33557K06376P64694j23978L06931k3194K25830
2270.2G33704681J0987l45536p3242n35431J50223J02310J023026P38144j53122m98886
$$ plain form
2202.6 722910767 723251343 723368683 723488617 723572006 723919830 724461136 724376678 724778595 724680252 724956512
2212.3 724956512 725120468 724911957 725345917 725495148 726009674 726297760 726293411 725967407 726287003 726869202
2221.9 726869202 726637878 726781006 726749420 727135620 727387390 727544785 727906570 728007050 728173447 727941742
2231.6 727941742 728154755 728214798 727759705 727342529 727920380 728500900 728269424 728766098 729006729 729347610
2241.2 729347610 729653473 730046158 730168610 729685974 729826508 729555206 729556961 729500580 729724884 730134201
2250.9 730134201 730247421 730922775 731312256 731682587 731380386 731241455 731007614 731046143 731646881 731272583
2260.5 731272583 731527786 731595306 732014465 732348022 732554398 733319092 733195114 733502045 733478851 733704681
2270.2 733704681 733715668 733370132 733296890 732761459 732911682 733013992 734037018 734775162 734622040 734123154
2279.8G34123154p77283J98364l10516J98974k16217r7198P79190M21448R00268J05896
2289.4G35326080Q16651Q42743P56454R46274j51749M12293m11759R8954N63583M52270
2299.1G39651794J098099O02875J010742N86014J099625J367263R55811J155167L17001
2307.8G47844391O96258P75681J220550R50699L10288Q14743N1041J146698K155914
2316.4G55966263J850128K073975K079544K399521J678161Q94394M07486K52914O47736
2325.1G68250122P93686J721497K003631J725617J157913Q21152K5482p64923p50122
2333.8G74984055j497498J884232K948837l04413Q81271J733094J093750p88269k48185
2342.5G80686874m78897k335815k451325m592056o494903o796341L24783O849060M897003
$$ plain form
2279.8 734123154 733345871 733544235 733233719 733432693 733216476 733119278 733898468 734319916 735220184 735326080
2289.4 735326080 736142731 736985474 737741928 738688202 738536453 738948746 738536987 738635941 739199524 739651794
2299.1 739651794 740749893 741352768 742363510 742949524 744049149 745416412 746372223 747527390 747844391
2307.8 747844391 748540649 749316330 750536880 751487579 751797867 752612610 752663651 753810349 755966263
2316.4 755966263 757816391 759890366 761969910 764369431 766047592 766941986 767349472 767602386 768250122
2325.1 768250122 769043808 770765305 772768936 774494553 775652466 776473618 776499100 775734177 774984055
2333.8 774984055 773486557 775370789 778319626 778015213 778896484 780629578 781723328 780935059 780686874
2342.5 780686874 780207977 777872162 775420837 770828781 764333878 757537537 757862320 764711380 769608383
2351.2G69608383N511551M701767L157578M668579K824707M603805N72891P2861j74713
2359.8G95547409j199570n79223p17392R27505l330841l863373l201522j417466l290863
2368.5G78874664o140670m040604m389343l467484l559570k770310k746658l386230
2376.2G48373795k016373k559128k757492l092194k755813k708206k415848j563187
2383.9G28505554k011490p76214n87540r61151q8348J53884K0524r9640j0987p03735
2393.6G23440857n67551l13339l36304j46179k13470j11542j93558K32773j64566N8136
2403.2G21685257k0371q45794n25284o59866k29340m48837l48892R0866p5531P4157
2412.9G18696365k23541Q2092m03289o07605l96576n68085m70963l45382j4344m76837
$$ plain form
2351.2 769608383 775119934 779821701 782979279 787647858 790472565 795076370 795649261 795722122 795547409
2359.8 795547409 794347839 793768616 793051224 793978729 790647888 786784515 783582993 782165527 778874664
2368.5 778874664 772733994 768693390 764304047 760836563 757276993 754506683 751760025 748373795
2376.2 748373795 746357422 743798294 741040802 737948608 735192795 732484589 730068741 728505554
2383.9 728505554 726494064 725717850 725130310 724169159 724080811 724234695 724255219 724155579 724144592 723440857
2393.6 723440857 722873306 722559967 722223663 722077484 721864014 721752472 721558914 721791687 721627121 721685257
2403.2 721685257 721664886 720819092 720293808 719633942 719404602 718955765 718606873 718697739 718622208 718696365
2412.9 718696365 718472824 718554916 718151627 717544022 717147446 716579361 716108398 715763016 715748672 715271835
2422.5G15271835j62887k21710l31727p5302l45916l07846r29337m98734m50515m32434
2432.2G11515427j12839n42145k16980l22189k53525m36096r2163j88904q82950l17459
2441.8G08150177l90854l19748o77109o64062l17078l85818n2414j88217j61820m84009
2451.5G04509048j72576n01938j274643m11759j49917l11432l62396j49765p3243l94134
2461.1G00707245n93338k49176j69678o39419k88315n15900l54767n4703m54406j94245
2470.7F97193298l76815p24106n89447j07956J9760n4627l97186n63736k43072k68174
2480.4F93887939j21536o25381n51224j94168j31149K00653l34854n14069n42374n01938
2490F90571899l30276J70135Q7357m62952r3460o07986m51431j6633n8746k08130n04684
$$ plain form
2422.5 715271835 715108948 714887238 714555511 714480209 714134293 713826447 712897110 712398376 711947861 711515427
2432.2 711515427 711402588 710860443 710643463 710321274 710067749 709631653 709539490 709350586 708467636 708150177
2441.8 708150177 707759323 707439575 706762466 706098404 705781326 705395508 705343094 705154877 704993057 704509048
2451.5 704509048 704336472 703834534 702559891 702148132 701998215 701686783 701324387 701174622 701101379 700707245
2461.1 700707245 700113907 699864731 699695053 699055634 698767319 698251419 697896652 697841949 697387543 697193298
2470.7 697193298 696816483 696092377 695502930 695394974 695414734 695360107 694962921 694399185 694156113 693887939
2480.4 693887939 693766403 693141022 692589798 692395630 692264481 692465134 692130280 691616211 691073837 690571899
2490 690571899 690241623 690411758 690499115 690036163 689942703 689334717 688883286 688866653 688807907 688599777 688095093
2500.6F88095093J5335j49918k53982n63965l67737K18124n5389k51160q05359m76684
2510.3F85404358j01929K48261K17209m12674k96860l16773M6845k02789m74244l92685
2519.9F83718719l06854p9422m24499l59803n41763l63769j11313j62964k45438o86340
2529.6F80436554n23453k92282j64184m22287k00806l9749m77600o55594o44226j44806
2539.2F76871567m47617m03671l61862m00009N951m56315n26809p16095l22037r842
2548.9F73233261n61676o83975k90680L54690k50091o69632l75061j91956n93109o55288
2558.5F69316483l19519r27582k70310j25122n69992P63O6681k71454o47888m57840
2568.1F65794220n52750m66308k43225j32294m2572o39649q33435o37435j35651l03650
$$ plain form
2500.6 688095093 688110428 687960510 687706528 687142563 686774826 686992950 686937561 686686401 685881042 685404358
2510.3 685404358 685302429 685550690 685767899 685355225 685058365 684741592 684788437 684585648 684111404 683718719
2519.9 683718719 683411865 683332443 682907944 682548141 682006378 681642609 681531296 681368332 681122894 680436554
2529.6 680436554 679913101 679620819 679456635 679034348 678833542 678793793 678316193 677660599 677016373 676871567
2539.2 676871567 676423950 676020279 675658417 675258408 675264359 674808044 674281235 673565140 673243103 673233261
2548.9 673233261 672671585 671987610 671696930 672051620 671801529 671131897 670756836 670564880 669971771 669316483
2558.5 669316483 668996964 668069382 667799072 667673950 667103958 667104721 667171402 666899948 666252060 665794220
2568.1 665794220 665241470 664775162 664531937 664399643 664357071 663717422 662883987 662246552 662110901 661807251
2577.8F61807251l70712q9951k60086k22320m35105m34341r58786n27649J24588n50156
2587.4F58082733l19137q7891p1335j70288r3613j97372m98886l16010n93643p12585
2597.1F55021973l48130K3117m73480j85394L10440j87988k55127o74515l38516j07117
2606.7F52785263l03650o20880q95462l99780n76401j16425o0424l88108l88031p29904
2616.4F48306198o07529n07659l89710r53293q97445q74558q09402j73874o83060k59018
2626F42150650l59497o25153m85839j177063q19359m27246o71654j139603q49380m23508
2635.6F35172348o75049p69806p15332l23753l51105n99899p98149r00650j046143
2644.3F28992462r80530p50274q74863n75867q19969q91342m46663m09660l76854l86162
$$ plain form
2577.8 661807251 661436539 661346588 661086502 660864182 660429077 659994736 659035950 658508301 658632889 658082733
2587.4 658082733 657763596 657675705 657604370 657434082 657340469 657143097 656644211 656328201 655734558 655021973
2597.1 655021973 654673843 654696960 654223480 654038086 654348526 654160538 653905411 653230896 652892380 652785263
2606.7 652785263 652481613 651860733 650965271 650565491 649989090 649872665 649812241 649424133 649036102 648306198
2616.4 648306198 647698669 647191010 646801300 645848007 644950562 644076004 643266602 643092728 642409668 642150650
2626 642150650 641791153 641166000 640680161 639503098 638683739 638256493 637584839 636445236 635595856 635172348
2635.6 635172348 634497299 633727493 633012161 632688408 632337303 631737404 630939255 630038605 628992462
2644.3 628992462 628011932 627261658 626386795 625810928 624990959 624099617 623652954 623243294 622866440 622480278
2654F22480278m65660q44040r73663j289826p72743J5793q28781r58863j10359m9057
2663.6F16203079p72247q55980o70242m06685l54805j145592r36317n86701n39093
2672.3F09935417o91833n49851l43n39055m51088l51982q83598p13120n46913r03626
2681.9F04304008o84852j30272n77889n93833m28582n28907k53792j43318l36953n86586
2691.6F00039024p00302q63456l92914o44684j141396n11017l88298m02755l16048
2700.3E94678154k33650m63066p58934q43315q41599o90918r05380o82144n19715m70390
2709.9E88269043p00798p41043l50800o07948k30522n41458j005593m76188l99781
2718.6E83214912p40547q69255l41606n32570n16014L9787K0218o68983j172943o56014
$$ plain form
2654 622480278 622014618 621170578 620196915 618907089 618134346 618150139 617321358 616362495 616252136 616203079
2663.6 616203079 615430832 614574852 613904610 613497925 613143120 611997528 611061211 610474510 609935417
2672.3 609935417 609243584 608693733 608693390 608154335 607703247 607351265 606467667 605754547 605207634 604304008
2681.9 604304008 603619156 603488884 602910995 602317162 601888580 601359673 601105881 600962563 600625610 600039024
2691.6 600039024 599338722 598475266 598082352 597437668 596296272 595785255 595396957 594994202 594678154
2700.3 594678154 594444504 593981438 593222504 592379189 591537590 590846672 589941292 589259148 588739433 588269043
2709.9 588269043 587568245 586827202 586476402 585868454 585637932 585096474 584090881 583614693 583214912
2718.6 583214912 582474365 581605110 581263504 580730934 580214920 580254707 580274925 579605942 578432999 577776985
2728.2E77776985p09419k36130J2474o76002q21877p55157k11411k28691l85094m09622
2737.9E73356056m38766j37978j29738m67872q93555o80046n29137k73132k52037n79720
2747.5E68974075m29840j04179K03819m23393p99065q46443o85539l79143n07393p1182
2757.2E64931717j48850k50663m82636p02591j83639j92871l29819l37334k20032m42733
2766.8E61640549p06520q42705l61405J36643n31426m45327k29073l23334n31006n31845
2776.4E57274551m87480q27675l94020n84068m34036k59972o82716l46833m68483p22694
2786.1E52066574o70204k54555m98390r22012r97506j212272r70268r39675j89590
2794.8E45412102k30561j016044p00112q72039j243706r92355m97399j072769j493912
$$ plain form
2728.2 577776985 577067566 576831436 576843910 576167908 575346031 574590874 574379463 574150772 573765678 573356056
2737.9 573356056 572917290 572779312 572649574 572181702 571288147 570608101 570078964 569805832 569553795 568974075
2747.5 568974075 568544235 568440056 568643875 568220482 567421417 566574974 565889435 565510292 565002899 564931717
2757.2 564931717 564782867 564532204 564049568 563346977 563163338 562970467 562640648 562303314 562083282 561640549
2766.8 561640549 560934029 560091324 559729919 559866562 559335136 558889809 558660736 558337402 557806396 557274551
2776.4 557274551 556787071 555959396 555565376 554981308 554547272 554287300 553604584 553257751 552789268 552066574
2786.1 552066574 551396370 551141815 550643425 549721413 548723907 547511635 546541367 545601692 545412102
2794.8 545412102 545181541 544165497 543465385 542593346 541349640 540357285 539859886 538787117 537293205
2803.4E37293205j016273j058312j033935r67713r34448p35893p35703j112175j095543
2812.1E28603210j202964j497727j170654j151733j103440j172066j550674j591301
2819.8E18162651r12895r05914j277962o87103j501961j998711j580734j488495j063919
2828.5E06744957j372299j713219j856460j532326j272202j229706j589622k284355
2836.2D93894768j527329j374473j968422k362747k148247j870613k505684k191696
2843.9D77945557k016945k389870k575073k479363k637596k982330k479591k329484
2851.7D58055305k292251k324257j608429q82721j206856j153068j163903p30476j110535
2860.3D45582809j758651j414757j779060k365227k155380j683312k164230k507897
$$ plain form
2803.4 537293205 536276932 535218620 534184685 533216972 532282524 531546631 530810928 529698753 528603210
2812.1 528603210 527400246 525902519 524731865 523580132 522476692 521304626 519753952 518162651
2819.8 518162651 517249756 516343842 515065880 514378777 512876816 510878105 509297371 507808876 506744957
2828.5 506744957 505372658 503659439 501802979 500270653 498998451 497768745 496179123 493894768
2836.2 493894768 492367439 490992966 489024544 486661797 484513550 482642937 480137253 477945557
2843.9 477945557 475928612 473538742 470963669 468484306 465846710 462864380 460384789 458055305
2851.7 458055305 455763054 453438797 451830368 450947647 449740791 448587723 447423820 446693344 445582809
2860.3 445582809 443824158 442409401 440630341 438265114 436109734 434426422 432262192 429754295
2868.1D29754295k601051k506065k367669k774467k554703k565193k701912l046303
2875.8D08636932k813530k254219k505035k093468k053070j651497j733017k333221
2883.5C91199875j510849j291313j281853j404266j368332j000099r00307m86984o52771
2892.2C81303101p58515j16615J5526p07588n29633l84026p46040n31158q52814n99404
2901.8C76092834l65448p18078p40280n01023l67164j125450j455689j192322q70208
2910.5C68757172j394692j937942j776963k365417k434235k348213j981773j732178
2918.2C52785759k117500j463127j145325j598320k346039k006340o18591k47650k79503
2926.9C40963364k06147k65998j83335M89807R56612P94296P17469J470146J847915
$$ plain form
2868.1 429754295 427153244 424647179 422279510 419505043 416950340 414385147 411683235 408636932
2875.8 408636932 405823402 403569183 401064148 398970680 396917610 395266113 393533096 391199875
2883.5 391199875 389689026 388397713 387115860 385711594 384343262 383343163 382442856 381955872 381303101
2892.2 381303101 380544586 380427971 380443497 379735909 379206276 378822250 378076210 377545052 376692238 376092834
2901.8 376092834 375727386 375009308 374269028 373768005 373400841 372275391 370819702 369627380 368757172
2910.5 368757172 367362480 365424538 363647575 361282158 358847923 356499710 354517937 352785759
2918.2 352785759 350668259 349205132 348059807 346461487 344115448 342109108 341490517 341242867 340963364
2926.9 340963364 340757217 340491219 340307884 340797691 341754303 342548599 343266068 344736214 346584129
2935.6C46584129J730538K324257J983184K163010K831764K512703K430649K524910
2943.3C65085144L003311L096733K860451K737007L021813L071479K421570K767372
2951C88064880K932358K487602K403069K697258K915382L283806L601113K849731K588272
2959.7D13823471K835503K719497K368126K239762K412986K555809K744523K664604
2967.4D34364281K779998K454873K159195K572326K653046K238693K216454K605743
2975.1D54044609K115402J913605K060967K216758K315102J889610J900215J855278
2982.8D70311546J788941J257591J385117K034874J351051R05838J021995J569329
2990.5D81626282J539802J065941P05795L36075P90253Q43735P13119K38800j07994
$$ plain form
2935.6 346584129 348314667 350638924 352622108 354785118 357616882 360129585 362560234 365085144
2943.3 365085144 368088455 371185188 374045639 376782646 379804459 382875938 385297508 388064880
2951 388064880 390997238 393484840 395887909 398585167 401500549 404784355 408385468 411235199 413823471
2959.7 413823471 416658974 419378471 421746597 423986359 426399345 428955154 431699677 434364281
2967.4 434364281 437144279 439599152 441758347 444330673 446983719 449222412 451438866 454044609
2975.1 454044609 456160011 458073616 460134583 462351341 464666443 466556053 468456268 470311546
2982.8 470311546 472100487 473358078 474743195 476778069 478129120 479034958 480056953 481626282
2990.5 481626282 483166084 484232025 484937820 485273895 486064148 486907883 487621002 487859802 487751808
2999.2D87751808L31154K48566L95240P28798K76947n51147m76990r2125j83143k00730
3008.8D88228378m99344p09991m85153m51470o50253p76787p65609m55208o12068q73070
3018.5D81949425p92008j047096j090660j226044q84323p77321j513862j387444q79936
3027.2D72350731q62656j144600q58535j461716j851425r24111j254615j363678j416398
3035.9D61212997j155700q82454j516571j319504j325531j268806j182442j377945
3043.6D51184044j319237j341400j617432j913871j309853j086426j458435j746368
3051.3D39391022j545449j151313j452370j493378j695327j836091j536102j233635
3059D27447357j513252j670761q84361j210862j782913j567459j228828j471405j988755
$$ plain form
2999.2 487751808 488082962 488331528 488726768 489455566 489732513 489181366 488704376 488612251 488429108 488228378
3008.8 488228378 487729034 487019043 486533890 486082420 485432167 484655380 483889771 483434563 482822495 481949425
3018.5 481949425 481157417 480110321 479019661 477793617 476909294 476131973 474618111 473230667 472350731
3027.2 472350731 471488075 470343475 469484940 468023224 466171799 465247688 463993073 462629395 461212997
3035.9 461212997 460057297 459174843 457658272 456338768 455013237 453744431 452561989 451184044
3043.6 451184044 449864807 448523407 446905975 444992104 443682251 442595825 441137390 439391022
3051.3 439391022 437845573 436694260 435241890 433748512 432053185 430217094 428680992 427447357
3059 427447357 425934105 424263344 423378983 422168121 420385208 418817749 417588921 416117516 414128761
3067.7D14128761j470031j178170j263008j505585j896667j948471j590576r75342
3075.4D02300911p42188j186943j983070j841087j490670j356315j280747j499557
3083.1C90920334j329651j526794j610642j471748j475182j517372j540794j304551
3090.8C79143600j516418j452599j285209j297150j336136j621895j529464j352883
3098.5C67751846j242828j440125j605262j234551q63991j229400j585007j654358
3106.2C56896324j912536j274224j115341j502647j209259j172524j589699j496658
3114C45623436q69904j159134j167411j400528j920281j473350j244126j138649j708717
3122.6C33541336j250839q01850j540145j211091j184425j325722j352119j279221
$$ plain form
3067.7 414128761 412658730 411480560 410217552 408711967 406815300 404866829 403276253 402300911
3075.4 402300911 401558723 400371780 398388710 396547623 395056953 393700638 392419891 390920334
3083.1 390920334 389590683 388063889 386453247 384981499 383506317 381988945 380448151 379143600
3090.8 379143600 377627182 376174583 374889374 373592224 372256088 370634193 369104729 367751846
3098.5 367751846 366509018 365068893 363463631 362229080 361365089 360135689 358550682 356896324
3106.2 356896324 354983788 353709564 352594223 351091576 349882317 348709793 347120094 345623436
3114 345623436 344753532 343594398 342426987 341026459 339106178 337632828 336388702 335250053 333541336
3122.6 333541336 332290497 331488647 329948502 328737411 327552986 326227264 324875145 323595924
3130.4C23595924j499176j790771j176319j001740q67061j070729j377906j296254
3138.1C13515968j185512j132202j499653j376763q98704q27027j358413j297436j012993
3146.8C02927265q73737r99680j782055j359520j108265q67004q23154j278401j001014
3155.4B92834435j345711p51038p16648j466675j094284j066875j108532j096134r15032
3164.1B83273506r71870q42839r75475j345482j124840j160278p14302p33490r37862
3172.8B74467068r77440j073322p54204r99127j320228j290074q15773r51233q38146
3181.5B65447521n98278j082229o63052p34043r18389r76524j098995p62692q94222
3190.1B57719097p70588p33413r82876j078873p75661p61662r33247o30378o00396
$$ plain form
3130.4 323595924 322096748 320305977 319129658 318127918 317260857 316190128 314812222 313515968
3138.1 313515968 312330456 311198254 309698601 308321838 307423134 306596107 305237694 303940258 302927265
3146.8 302927265 302053528 301053848 299271793 297912273 296804008 295937004 295113850 293835449 292834435
3155.4 292834435 291488724 290737686 290021038 288554363 287460079 286393204 285284672 284188538 283273506
3164.1 283273506 282301636 281458797 280483322 279137840 278013000 276852722 276138420 275404930 274467068
3172.8 274467068 273489628 272416306 271662102 270662975 269342747 268052673 267236900 266285667 265447521
3181.5 265447521 264849243 263767014 263103962 262369919 261451530 260475006 259376011 258613319 257719097
3190.1 257719097 256948509 256215096 255232220 254153347 253377686 252616024 251682777 251052399 250452003
3198.8B50452003m44660o06231q38833j031914j076889p05223n85899n51129q29372
3207.5B43781853p65820p95498q20522p15141p83844p13024j116429p08256m28485
3216.2B36934834l50800L8300n92480j050587p71599n34153o46610o50978o89983k37389
3225.8B31448555l49598j171684n80921n45788p56340l44715k41452j044921j269398
3234.5B25143738M8218k03667n78346n10807q61054o00605l03593k99263n88989n01118
3244.2B20744514j003246p11250j18809n98335m26293n99994k88258j43089m85973
3252.8B16369267l03631n90363p38239q04463p18402l66536M96r5749j03645k33440
3262.5B12415295q07667o14815m21238j96018m37107m83303k98882p72514n22060j64776
$$ plain form
3198.8 250452003 250007343 249401112 248562279 247530365 246453476 245748253 245162354 244611225 243781853
3207.5 243781853 243016033 242220535 241400013 240684872 239901028 239188004 238071575 237363319 236934834
3216.2 236934834 236584034 236622334 236029854 234979267 234207668 233673515 233026905 232375927 231685944 231448555
3225.8 231448555 231098957 229927273 229346352 228800564 228044224 227699509 227458057 226413136 225143738
3234.5 225143738 225191956 224988289 224409943 223899136 223038082 222437477 222133884 221834621 221245632 220744514
3244.2 220744514 219741268 219030018 218911209 218312874 217886581 217286587 216998329 216855240 216369267
3252.8 216369267 216065636 215475273 214737034 213932571 213214169 212847633 212848129 212752380 212648735 212415295
3262.5 212415295 211607628 210992813 210571575 210375557 209938450 209455147 209156265 208383751 207861691 207696915
3272.1B07696915j65387n49850k25563k49310o77604j26438n14679m08535m17347o66790
3281.8B03695412k11258m51947k84862k18697m76379j88904M8733l77750k88201L2463
3291.4B01278610k76031n10559p96090j67179q3675p06921o20250o6357M78916l67126
3301A98163338m89254r1858p54814r37691n09510O7749M26102l29895j074524Q0413
3310.7A94550056J77098m18720m58718m54025J19114n84545k73648j5812o74057j50833
3320.3A91815910l13129m54693p34081k61688J52607l11738q9149l91979n67055o71043
3330A88173962k58732N131k76394l05443p17487l07179l46451o38714k30007r6683
3339.6A85002003j18695l63006k58351p1678j39065k41012k9850k61116n59654k96555
$$ plain form
3272.1 207696915 207531528 206981678 206756115 206506805 205829201 205702763 205188084 204779549 204362202 203695412
3281.8 203695412 203484154 203032207 202747345 202528648 202052269 201863365 201912098 201534348 201246147 201278610
3291.4 201278610 201002579 200492020 199695930 199528751 199445076 198738155 198117905 198051548 198530464 198163338
3301 198163338 197674084 197582226 196827412 195889721 195380211 195447960 195874062 195544167 194469643 194550056
3310.7 194550056 194727154 194308434 193849716 193395691 193514805 192930260 192656612 192640800 191966743 191815910
3320.3 191815910 191502781 191048088 190314007 190052319 190204926 189893188 189804039 189412060 188845005 188173962
3330 188173962 187915230 187920361 187643967 187338524 186621037 186313858 185967407 185328693 185098686 185002003
3339.6 185002003 184883308 184520302 184261951 184190273 184051208 183810196 183780346 183519230 182959576 182663021
3349.3A82663021o73256n46989j13869k23980j22051k56691o07433p9060k6894n96790
3358.9A79416008J83105j24359p88326j19953O0787j00803o40450m39110n9337j11618
3368.6A77275944m10919r16386M4537N28221k21482n14812k41909j25656m31614r022
3378.2A74976902o1741q38814n0926N46398n07183k90622N97419p7266n40142m02337
3387.8A73351688l25374J36184K84100k31190l71265j20888r8457j43795k63558n67245
3397.5A71650200j16806M70104j16730k4528K48871k65942n10559n14946N66940Q55923
3407.1A72242527k67658q18730m76436L0632L4942J91803P1316L68366L67470k49042
3416.8A71495190j84670q3771M09451J83773J86443J55430l38516O9256l22647J14383
$$ plain form
3349.3 182663021 181989765 181442776 181328907 181104927 180982876 180726185 180118752 180039692 180012798 179416008
3358.9 179416008 179599113 179474754 178686428 178566475 178627262 178526459 177886009 177446899 177387562 177275944
3368.6 177275944 176865025 175948639 175993176 176521397 176299915 175785103 175543194 175417538 174985924 174976902
3378.2 174976902 174915161 174076347 174025421 174571819 174064636 173774014 174371433 174294167 173754025 173351688
3387.8 173351688 173026314 173162498 173446598 173215408 172844143 172723255 172624798 172481003 172217445 171650200
3397.5 171650200 171533394 172003498 171886768 171862240 172111111 171845169 171334610 170819664 171386604 172242527
3407.1 172242527 171974869 171156139 170679703 170710335 170745277 170937080 171008396 171376762 171744232 171495190
3416.8 171495190 171310520 171226749 171636200 171819973 172006416 172161846 171823330 171892586 171569939 171684322
3426.4A71684322M93870k11868n5008J40018J00365j2703O3000J66950Q4057p4616
3436.1A72378387K35424K72217K60868N29194J75591N43480J04103k39678J76869K28596
3445.7A74665051P05013m62761m79717P69023J199627P55578m33903l52803L60604
3454.4A76725712P62405N73445N96714L29246q8234J87931L60813P94945J06697n9242
3464A80290432J97754o8112Q8540K79846J104736O51245L19348N52101L56827N24005
3473.7A84296722N9052J01757M03271M03728K97547M65412J13411j26973R51157R70802
3483.3A87935886P13730R9049M08954R41525k4490m845N63660J329670Q73565L09162
3493A93145866L18966j76773K4586O96068J277580M95586M50345O55384J26552J99127
$$ plain form
3426.4 171684322 172178192 171966324 171911316 172051334 172151699 172138996 172201996 172368946 172453003 172378387
3436.1 172378387 172613811 172886028 173146896 173676090 173851681 174395161 174499264 174259586 174436455 174665051
3445.7 174665051 175370064 174907303 174427586 175196609 176396236 177151814 176717911 176365108 176725712
3454.4 176725712 177488117 178061562 178658276 178987522 178899288 179087219 179448032 180242977 180349674 180290432
3464 180290432 180488186 180420074 180508614 180788460 181893196 182544441 182863789 183415890 183772717 184296722
3473.7 184296722 184355774 184457531 184860802 185264530 185562077 186027489 186140900 186013927 186965084 187935886
3483.3 187935886 188649616 188748665 189157619 190099144 190074654 190069809 190633469 191963139 192836704 193145866
3493 193145866 193464832 193288059 193312645 194008713 195286293 195781879 196232224 196887608 197014160 197213287
3502.6A97213287N37396R16538K37312P96185R04312O21758N92651k08492J083965
3511.3B02694912R30653M14505O38122N13535P88803P55176J084023O03180M03976
3520B08826885N12867O95610M92382k50950R62429J256161Q90122O22902P46307Q97808
3529.6B15652523R21803N74550L43914J308403R82800J110210K89307M9934J482544
3538.3B22715988O53973P77759R50661J494656R75990L54843O07739o23551Q22449
3547B28730507J225624K329483J676044M01192J271763O4812J277084J661320J843891
3555.6B40481720J302490M14162J701984J200390J071301J94015J928806J924763O64044
3564.3B50883675L836403J359424q7471j67980J06907K758026J473713J653004J605834
$$ plain form
3502.6 197213287 197750683 198667221 198904533 199700718 200605030 201226788 201819439 201610947 202694912
3511.3 202694912 203625565 204040070 204678192 205191727 205980530 206735706 207819729 208422909 208826885
3520 208826885 209339752 210035362 210527744 210276794 211239223 212495384 213385506 214008408 214754715 215652523
3529.6 215652523 216574326 217148876 217492790 218801193 219783993 220894203 221183510 221233444 222715988
3538.3 222715988 223369961 224147720 225098381 226593037 227569027 227923870 228531609 227908058 228730507
3547 228730507 229956131 232285614 233961658 234362850 235634613 235699425 236976509 238637829 240481720
3555.6 240481720 241784210 242198372 243900356 245100746 246172047 246366062 248294868 250219631 250883675
3564.3 250883675 254720078 256079502 255992031 255824051 255930958 258688984 260162697 261815701 263421535
3573B63421535K000466J658935J738224K141076N49602K408581K075691P54624J817207
3581.7B78565941K317409J593571J391487M436341K597522q22830L26004j77402L717308
3590.4B93945351L430042K719192J544266J697159L255234r80511K789307L971786
3598.1C12371826R84535L153515J515351J338310K411976K089920K799530L451576
3605.8C30116539K940178k60658L105507j48468L39088P403374J894340o42967L647385
3614.5C48394318K32124M459381M625664J310348J609879j292343K154159M871903
3622.2C66365433K935066K066231L513832L395767K953911O163444p86018r562531
3629.9C77045135N396348N805053N731850J231689j483993L356552L954811K865868
$$ plain form
3573 263421535 265422001 267080936 268819160 270960236 271509838 273918419 275994110 276748734 278565941
3581.7 278565941 280883350 282476921 283868408 288304749 290902271 290079441 290405445 290228043 293945351
3590.4 293945351 297375393 300094585 301638851 303336010 306591244 305610733 308400040 312371826
3598.1 312371826 313356361 316509876 318025227 319363537 321775513 323865433 326664963 330116539
3605.8 330116539 333056717 332796059 335901566 335753098 336092186 343495560 345389900 344746933 348394318
3614.5 348394318 348626442 353085823 357711487 359021835 360631714 359339371 361493530 366365433
3622.2 366365433 369300499 371366730 374880562 378276329 381230240 387393684 386607666 377045135
3629.9 377045135 382441483 388246536 393978386 395210075 393726082 397082634 401037445 403903313
3637.6D03903313N74455J572266L290710K770729J111755J160851L659248M208145
3645.3D22251472N655823r40170l437119O987839L22800l016968N81856O175461N557899
3654D40138893M437943L894767q162002L066902O193771K204209K487259J587982L037796
3662.7D58887520J453590J412010K204209K027740N689354K577248j439514M35829
3670.4D73247986n212212L498459R604492J0568695j018600j9567757M195252R239425
3678.1D84555740O359825j477432k04010L515053K534218R86175R76792J671219N034065
3686.8E03951645O330528j0918503o32362J0109558n771217J060981N882149J270256
3694.5E11283035K497750P40051O4010K034607J521569K833976J706582n741387l25928
$$ plain form
3637.6 403903313 404477768 406050034 409340744 412111473 413223228 414384079 418043327 422251472
3645.3 422251472 427907295 426967125 423530006 430517845 430840645 427823677 428405533 434580994 440138893
3654 440138893 444576836 448471603 440309601 443376503 449570274 451774483 454261742 455849724 458887520
3662.7 458887520 460341110 461753120 463957329 465985069 471674423 474251671 472812157 473247986
3670.4 473247986 468035774 471534233 481138725 491707420 490688820 471121063 475316315 484555740
3678.1 484555740 490915565 489438133 489234123 492749176 495283394 496269569 497246361 498917580 503951645
3686.8 503951645 510282173 499363670 498731308 508840866 503069649 504130630 510012779 511283035
3694.5 511283035 513780785 514520836 514584846 516619453 518141022 520974998 522681580 516940193 516614265
3703.2E16614265O023674K037125L11394P91168L547173N273704p245903L443337L406410
3711.9E34202347j3858910N443382M699555J361427K255478L702049J866150m244041
3719.6E35427437J446838P117615k762566m734077O168327K004280j278343l176308
3727.3E40213203R35822M956856J859398O647148l281899q345527J0183181N1079j1214294
3736E42004967j90277K725219J728936L981628L322105l899002N001603J2968788j3927002
3744.7E53716965j6590882J3437157Q055611O161461n617104j1164207J3077087q439293
3752.4E52636795o943207Q373223N800666L908272n358276L534584O070404r969368
3760.1E58053093o70128N449677R38530J49383M456101l223916m688797N203476N826226
$$ plain form
3703.2 516614265 522637939 524675064 524986458 525777626 529324799 534598503 527352600 530795937 534202347
3711.9 534202347 520343437 525786819 530486374 531847801 534103279 537805328 539671478 535427437
3719.6 535427437 536874275 543991890 541229324 536495247 542663574 544667854 543389511 540213203
3727.3 540213203 541149025 546105881 547965279 554612427 551330528 542985001 553168182 553219261 542004967
3736 542004967 541814690 544539909 546268845 550250473 553572578 549673576 554675179 567643967 553716965
3744.7 553716965 537126083 550563240 558618851 564780312 559163208 547999001 561076088 552636795
3752.4 552636795 545693588 554066811 559867477 563775749 558417473 561952057 568022461 558053093
3760.1 558053093 557382965 562832642 563771172 563920555 568376656 565152740 560463943 565667419 571493645
3768.8E71493645j187744r525719L800812L604469R1553J375923J6098J163368R16748
3777.4E71749153L070030j424522p740593M153137K858505J543236J982002m141616
3785.2E72049332r22776K685624J884117Q59298q9645K22435L40996R26857L61213
3793.8E78317451K057000L728828l946113m005661K320976M808159O771698q324585
3801.5E81727753j0587998M637833L477898O012649O233978j1379699n330468N583764
3809.3E80375710K976379P62291J280174Q71964K144851O521759m009056j5797844
3817E75126228P852288P589035N527610J730271k1978188K248612O879234K956429
3824.7E87931519L898773K19078n663529P03316L369408M898567K085648j0396882
$$ plain form
3768.8 571493645 570305901 560780182 564580994 568185463 568277016 569652939 569669037 570832405 571749153
3777.4 571749153 574819183 573394661 565654068 569807205 572665710 574208946 576190948 572049332
3785.2 572049332 571126556 573812180 575696297 576555595 576465950 576688385 577029381 577956238 578317451
3793.8 578317451 580374451 584103279 580157166 576151505 578472481 583280640 590052338 581727753
3801.5 581727753 571139755 575777588 579255486 585268135 591502113 580122414 574791946 580375710
3809.3 580375710 583352089 584114380 585394554 586266518 588411369 594933128 590924072 575126228
3817 575126228 582978516 590567551 596095161 597825432 575847244 578095856 584975090 587931519
3824.7 587931519 591830292 592049370 586385841 587089157 590458565 595357132 597442780 587045898
3832.4E87045898L818894Q122215q221092K48337J1027527r414025o047478Q765679
3840.1E95345955p011337P20481Q703156m074402m899597L315277K305145R86061J929512
3848.8E97320251j249427L157806P985344p354965l97873j8362618L158532J3733749
3856.5E97990799o93283k747383K597351L692665K962227p119141P71485Q499908p316437
3865.2E98638191o739998N203934O870003P483787j1298790j0488281O240158P505875
3872.9F03414879L719902j1870232J663933N417671N3597K976875N864983p229767
3880.6F04011841r329224P476883J341667J808853O126481j5096856J909562M875145
3888.3F03124352J171951N272903j215820j0064354J586113M965782j025658J118927
$$ plain form
3832.4 587045898 590864792 598987007 590765915 591014252 602041779 592627754 586580276 595345955
3840.1 595345955 588334618 589055099 597758255 593683853 588784256 592099533 594404678 595390739 597320251
3848.8 597320251 596070824 599228630 607213974 599859009 599461136 581098518 584257050 597990799
3856.5 597990799 597297516 594550133 597147484 600840149 603802376 596683235 597454720 605954628 598638191
3865.2 598638191 591898193 597102127 603972130 611455917 600157127 589668846 595909004 603414879
3872.9 603414879 607134781 595264549 596928482 602346153 602399750 605376625 611241608 604011841
3880.6 604011841 594682617 602159500 603501167 605310020 611436501 596339645 598249207 603124352
3888.3 603124352 604296303 609569206 608353386 598289032 599875145 604840927 603815269 604934196
3896.1F04934196K366219L622894R89304j2146454O330948K111282n900078N590821
3903.8F07899132m767761j643830J168633J457252K925797j19591J84250l27149P01828
3912.5F07478561Q30918r03321J071892K619438l859291l823890N198211m30374m708290
3921.1F03473854L233490K765198Q13331k855529k987633K508469K254028J256828
3928.8F10462036p81822o28586J931954k656517k106362K001419O54183k5597M61349
3937.5F09312057L57247O637k99224J342506Q20084l987046m86068J951522J761094
3946.2F10778809J457443l496590M95987J690636k130432J839866J64528p95822P49893
3954.9F10754318P11479N29709j751709k24952Q49113J491432Q06618k161636n30396
$$ plain form
3896.1 604934196 607300415 610923309 611912613 599766159 606097107 608208389 602308311 607899132
3903.8 607899132 603131371 601487541 602656174 604113426 607039223 606919632 607103882 606776733 607478561
3912.5 607478561 608309479 607406158 608478050 611097488 607238197 603414307 608612518 608182144 603473854
3921.1 603473854 606707344 609472542 610285873 607430344 604442711 606951180 609205208 610462036
3928.8 610462036 609680214 609051628 610983582 608327065 606220703 608222122 608876305 608850708 609312057
3937.5 609312057 609669304 609675941 609376717 610719223 611539307 607552261 607066193 609017715 610778809
3946.2 610778809 612236252 608739662 609235649 610926285 608795853 610635719 610800247 610004425 610754318
3954.9 610754318 611465797 611995506 610243797 610018845 610867958 612359390 613166008 611004372 610473976
3963.6F10473976L89176L92799L76091K72102M03672r34258n79529O78711M00696M43039
3973.2F12316475P44934M27094J8424j011009m06570P89909P7858k84195J2322j88790
3982.8F12496452p88726J50337P46460o2332k44599L42636R72557l41835j91307L09906
3992.5F13389549l11699K19269l28941j01166K24419M28695O10733Q7166
4000.2F14218025
$$ plain form
3963.6 610473976 610863152 611255951 611632042 611904144 612307816 611373558 610794029 611472740 611873436 612316475
3973.2 612316475 613061409 613488503 613506927 612495918 612089348 612879257 612957115 612672920 612685242 612496452
3982.8 612496452 611707726 611858063 612604523 612542191 612297592 612640228 613612785 613270950 613079643 613389549
3992.5 613389549 613077850 613297119 612968178 612867012 613091431 613520126 614130859 614218025
4000.2 614218025
##END=$$ End of the data block
