##TITLE=$$ Begin of the data block
##JCAMP-DX=5.00 $$ ACD/SpecManager v 10.08
##SPECTROMETER/DATA SYSTEM=Varian
##DATE=20 Nov 2012 15:39:54
##DATA TYPE=INFRARED SPECTRUM
##DATA CLASS=XYDATA
##ORIGIN=
##OWNER=
##NPOINTS=3735
##FIRSTX=399.26403809
##LASTX=4000.35498047
##MAXX=4000.35498047
##MINX=399.26403809
##MAXY=79.80404663
##MINY=11.27870941
##XFACTOR=1.0000000000
##YFACTOR=0.000000100000000
##FIRSTY=40.73176956
##DELTAX=0.96440572
##XUNITS=1/CM
##YUNITS=TRANSMITTANCE
##XYDATA=(X++(Y..Y))
399.3D07317696j1511460j014328K300797P104072R151917n136681o814918j1737519
$$ 407317696 395806236 394791908 397092705 404196777 413348694 408212013 401397095 389659576
407C89659576p874412J208038P661019P257347m389992k927017k160149q6212K959099
$$ 389659576 381785164 382993202 390654221 397911568 393521576 390594559 388434410 388348198 391307297
415.7C91307297m182549j451645J4984360K965736j704864j008492q798561m120865
$$ 391307297 387124748 385673103 400657463 403623199 401918335 400909843 392111282 387990417
423.4C87990417p04612j0427323m196472O575813M233094n644036n375557R31702L351479
$$ 387990417 387285805 376858482 372662010 379237823 383470917 377826881 372451324 373383026 376734505
432.1C76734505J518020k605819l511200m766045q07381O359826K644538Q75969M564553
$$ 376734505 378252525 375646706 372135506 367369461 366562080 372921906 375566444 376442413 381006966
440.7C81006966j05515l201179K374305K34566k643547J819191P778397L795929N8860
$$ 381006966 380901451 377700272 380074577 380309143 377665596 379484787 387263184 391059113 391117973
449.4C91117973m03976Q45146M001427K718735k551690j184120K031174k2202m584007
$$ 391117973 390713997 391559143 395560570 398279305 395727615 394543495 396574669 396552467 391968460
458.1C91968460J759834M063568l651618p854958Q78296L759689J160431l929100n879059
$$ 391968460 393728294 397791862 394140244 386285286 387163582 390923271 392083702 388154602 382275543
466.8C82275543j789398O19698O98089l827667l821030K596283L401375k260895q703346
$$ 382275543 380486145 381105843 381803932 377976265 374155235 376751518 380152893 377891998 369188652
475.5C69188652n104408j456833K79198J899681k042389k236481l54843K212181m15230
$$ 369188652 364084244 362627411 362906609 364806290 362763901 360527420 360172577 362384758 361969528
484.1C61969528K08092K821236J034622r51119j472053j61171m218140q42476R33342
$$ 361969528 362177620 364998856 366033478 365082359 363610306 363449135 359230995 358388519 359321861
492.8C59321861l193321J656113J766586k78816j969376N39589K011566j220283r41658
$$ 359321861 356128540 357784653 359551239 359272423 357303047 357842636 359854202 358633919 357692261
501.5C57692261l421746l706893l512345j783333M72603j203117m93050Q01392j544304
$$ 357692261 354270515 350563622 347051277 345267944 345740547 344537430 344044380 344845772 343301468
510.2C43301468m349289k534981k550506j544571j293488j887512j772461k945519
$$ 343301468 338952179 336417198 333866692 332322121 331028633 329141121 327368660 324423141
517.9C24423141k82936k964477k379246r09557j542835r09195j336041N22671j982479
$$ 324423141 324140205 321175728 318796482 317886925 316344090 315434895 314098854 314621525 312639046
526.6C12639046q60920j488705l354759j11599K876377M106674N80960n17121J07651
$$ 312639046 311778126 310289421 306934662 306823063 309699440 313806114 314387074 313869953 313977604
535.2C13977604K619591K842159K790146M262161R01527K629586L746338J774482Q92029
$$ 313977604 316597195 319439354 322229500 326491661 327393188 330022774 333769112 335543594 336435623
543.9C36435623L08075L319K13013K459449J315461K25372k931175k458458J366806
$$ 336435623 336743698 336747017 336960030 339419479 340734940 340960312 338029137 335570679 336937485
552.6C36937485j460610r60884o11534j373062j309776k535439j777229j847840l247032
$$ 336937485 335476875 334515991 333904457 332531395 331221619 328686180 326908951 325061111 321814079
561.3C21814079m096985j149578k083568k589455j317768m065800m154415l675861
$$ 321814079 317717094 316567516 314483948 311894493 310576725 306510925 302356510 298680649
569B98680649j210861j636029j964950k356682l099976r09557j529942O93741L01380
$$ 298680649 297469788 295833759 293868809 291512127 288412151 287502594 285972652 286666393 286967773
577.7B86967773J123028K550965L460235M115715J802426L462333L511563L470955
$$ 286967773 288090801 290641766 294102001 298217716 300020142 303482475 306994038 310464993
585.4C10464993J271343Q63151L605271L204689K455902J422462K418480J988144J567955
$$ 310464993 311736336 312599487 316204758 319409447 321865349 323287811 325706291 327694435 329262390
594.1C29262390k28271j455117q35456j874924M55246K33230l3683M78668N30739J144561
$$ 329262390 329034119 327579002 326743546 324868622 325323868 325557098 325523415 326002083 326532822 327677383
603.7C27677383n09872J42975m32129J5869J81465J71700R48448n05753Q54111R10225
$$ 327677383 327167511 327310486 326878357 326894226 327075691 327247391 328195839 327690086 328544197 329454422
613.4C29454422J031380L12996R80987L938675K010880J185073J246109J269227K119827
$$ 329454422 330485802 330798798 331779785 335718460 337729340 338914413 340160522 341429749 343549576
622C43549576J929817P76367J569443K266540J716576L198586J318016M70085K443046
$$ 343549576 345479393 346255760 347825203 350091743 351808319 355006905 356324921 356795006 359238052
630.7C59238052K533303J057663n41191P96165J503563P96776j63574O43539J855240
$$ 359238052 361771355 362829018 362287827 363083992 364587555 365384331 365220757 365864296 367719536
639.4C67719536Q52585J257324J015777J008187J873398J347084Q354J96838J132584
$$ 367719536 368572121 369829445 370845222 371853409 373726807 375073891 375082245 375279083 376411667
648.1C76411667K97088P630K51732K154960K237473K87628P80144O23741O33469m7341
$$ 376411667 376708755 376716385 376968117 379123077 381360550 381648178 382428322 383052063 383685532 383638191
657.7C83638191r80720j074906j072960N66903R09004J56746o66809J012573M149361
$$ 383638191 382657471 381582565 380509605 381076508 381985512 382142258 381475449 382488022 386637383
666.4C86637383Q606338J3705902j1917267o363067j144066J058006J950455N48744
$$ 386637383 395243721 408949623 397032356 390669289 389525223 390583229 392533684 393082428
674.1C93082428q98399J236114K051315J391259J193237R63974R14650K75688N52940
$$ 393082428 392184029 393420143 395471458 396862717 398055954 399019928 399934578 400210266 400763206
682.8D00763206L77312L77007Q86879O24122P42302J19248M24804K213l10593O92902
$$ 400763206 401140518 401517525 402404404 403028526 403770828 403890076 404314880 404317093 404006500 404699402
692.4D04699402n08309r96398j330300j626091j279030j319694m70658j317558k206459
$$ 404699402 404191093 403194695 401864395 400238304 398959274 397639580 397168922 395851364 393644905
701.1C93644905k070503k133293k086716j429710l88298n76172k13356n64041o55213
$$ 393644905 391574402 389441109 387354393 385924683 385536385 384960213 384746857 384182816 383527603
709.8C83527603J65558J070404K409782K578583K713547J430473J874314L639221K619591
$$ 383527603 383693161 384763565 387173347 389751930 392465477 393895950 395770264 399409485 402029076
718.5D02029076L801956M462662J786499J258430K791100M134864L849984L481407
$$ 402029076 405831032 410293694 412080193 413338623 416129723 420264587 424114571 427595978
726.2D27595978K942467K738266L357009K380867K668801K900734J779823J399078
$$ 427595978 430538445 433276711 436633720 439014587 441683388 444584122 446363945 447763023
733.9D47763023J107865J721382J941757J259537R72481J678352J016312O27594J095008
$$ 447763023 448870888 450592270 452534027 453793564 454766045 456444397 457460709 458088303 459183311
742.6D59183311r11827j444015l97797o09779k892876k629432j31035j445771k604942
$$ 459183311 458271484 456827469 456429672 455819893 452927017 450297585 450166550 448720779 446115837
751.3D46115837j716995j186295l683700n408325l126832j998558k738189l006821
$$ 446115837 444398842 443212547 439528847 434120522 430993690 428995132 426256943 423250122
759D23250122k595634k501069j188621n97649j396827j64757N58700J062661J214828
$$ 423250122 420654488 418153419 416964798 416367149 414970322 414805565 415364265 416426926 417641754
767.7D17641754O29196K210007L474007L769645L759690M075126M974671N004616L789215
$$ 417641754 418270950 420480957 423954964 427724609 431484299 435559425 440534096 445538712 449327927
776.4D49327927L938217N502853M729424N023994M669724L349609K893066K132836
$$ 449327927 453266144 458768997 463498421 468522415 473192139 476541748 479434814 481567650
784.1D81567650L518066M169922L317452K383346K449379K107239J583290K475014
$$ 481567650 485085716 489255638 492573090 494956436 497405815 499513054 501096344 503571358
791.8E03571358L196068K780723J858254K700004J416168J981774L385696J459007
$$ 503571358 506767426 509548149 511406403 514106407 515522575 517504349 520890045 522349052
799.5E22349052J841851K111015K433434J518516J301346K363014K042465J874314
$$ 522349052 524190903 526301918 528735352 530253868 531555214 533918228 535960693 537835007
807.2E37835007J061172J559410M97208o06957o20918m2000Q44460M09508K86255J50795
$$ 537835007 538896179 540455589 540952797 540345840 539724922 539682922 540527382 540936890 541223145 541373940
816.9E41373940J106910L10745J09635q39958j991845l51562n50957j14059j493263
$$ 541373940 542480850 542791595 542901230 542061272 540069427 539717865 539166908 539052849 537559586
825.5E37559586j318512j244660k528534j482277k992210k542114l135491m030075
$$ 537559586 536241074 534996414 532467880 530985603 527993393 525451279 522315788 518285713
833.3E18285713k433510k358741k658425l174934l073425k947617j886177j888657
$$ 518285713 515852203 513493462 510835037 507660103 504586678 501639061 499752884 497864227
841D97864227k088127j876640k965660k654610k763901k205658j550674j160812r28154
$$ 497864227 495776100 493899460 490933800 488279190 485515289 483309631 481758957 480598145 479669991
849.6D79669991j631394j365700k666549k990227j956749k187500k657204k800522
$$ 479669991 478038597 476672897 474006348 471016121 469059372 466871872 464214668 461414146
857.4D61414146k149658k376709j785774J95274J371498K415886L092232M154015N622749
$$ 461414146 459264488 456887779 455102005 455297279 456668777 459084663 462176895 466330910 471953659
866D71953659O056442N761948O362915O234741N701485N564041N277138N843277N285682
$$ 471953659 478010101 483772049 490134964 496369705 502071190 507635231 512912369 518755646 524041328
874.7E24041328M664193L385963K319222P17506o52695m55208r55276j468124k742348
$$ 524041328 528705521 532091484 534410706 535128212 534475517 534020309 533065033 531596909 528854561
883.4E28854561k353554l462486m197884l137131l821258l891831l882980k974052
$$ 528854561 526501007 523038521 518840637 515703506 511882248 507990417 504107437 501133385
891.1E01133385m105187n429916l898697k980576l065834l147392k452583k312622
$$ 501133385 497028198 491598282 487699585 484719009 481653175 478505783 476053200 473740578
898.8D73740578k042198k063370k261849k225265l134613l923645m604798l865051
$$ 473740578 471698380 469635010 467373161 465147896 462013283 458089638 453484840 449619789
906.5D49619789l729706n204544n310135m119987l946304m800301n077553n250854
$$ 449619789 445890083 440685539 435375404 431255417 427309113 422508812 417431259 412180405
914.3D12180405n357247o034012o573829n828743m750595l909645l036423k487297
$$ 412180405 406823158 400789146 394215317 388386574 383635979 379726334 376689911 374202614
922C74202614k382927j999092l95470J91651j167412j008492J31264P36046J32522
$$ 374202614 371819687 369820595 369425125 369616776 368449364 367440872 367572136 368308182 368440704
930.7C68440704L61290R76677O75698J211166J587791K289620J652870J744499L362923
$$ 368440704 368801994 369778671 370454369 371665535 373253326 375542946 377195816 378940315 382303238
939.3C82303238K993545J959954J770477K649460K047996J345139P73582o75430j467476
$$ 382303238 385296783 387256737 389027214 391676674 393724670 395069809 395843391 395167961 393700485
948C93700485k969284l622017m167137n305977o121254o753044o367721p792244p727051
$$ 393700485 390731201 387109184 382942047 377636070 371514816 364761772 358394051 350601807 342874756
956.7C42874756o608887p103577p718696q276062p219544q085250q736821q184890
$$ 342874756 336265869 329162292 321443596 313167534 305947990 297862740 289125919 280941029
964.4B80941029q056813q998413r217014p688408q845272q820820q462028q031903
$$ 280941029 272884216 263885803 254668789 246980381 238135109 229314289 220852261 212820358
972.1B12820358q523864q477383p720471q547000o758366p613278o709461n664291
$$ 212820358 204296494 195819111 188098640 179551640 172793274 165179996 158470535 152806244
979.8A52806244n806112n244284n668678l841782l897314k114105k254133k437201
$$ 152806244 147000132 141755848 136087170 132245388 128348074 126233969 123979836 121542635
987.6A21542635j964359j644373K26764j499338m72526q07562j28193J63174j17865
$$ 121542635 119578276 117933903 118160667 116661329 116188803 115381241 115253048 115416222 115298357
996.2A15298357J132689l73698O73714o99244K24963L87201j25628Q13284p52124M35476
$$ 115298357 116431046 116057348 116731062 116031818 116256781 116643982 116518354 117331638 116579514 117014990
1005.9A17014990q70495l64532m34037O5880J15519j851530k20433o68268O37837o17552
$$ 117014990 116144495 115779963 115345926 115411806 115527325 113675795 113455362 112787094 113424931 112807379
1015.5A12807379K30341P89270p39927Q28361l27711J135931p9059Q40330J379232
$$ 112807379 113037720 113826990 113087063 113915424 113587713 114723644 114644585 115484915 116864147
1024.2A16864147N02653J653138M4918J597757L41921J287889J807766J220303J459579
$$ 116864147 117366800 119019938 119064856 120662613 121004534 122292423 124100189 125320492 126780071
1032.9A26780071k18544R43718j37968R98688M94652N44338L97940k05441J583290
$$ 126780071 126561527 127505245 127367277 128365965 128860617 129404955 129802895 129597454 131180744
1041.6A31180744o92577M86765m85869O4297N58214J13058J490050m40560J308785
$$ 131180744 130488167 130974932 130489063 130553360 131111574 131224632 132714682 132274122 133582907
1050.2A33582907N31501J672869J742554J418018K743635K185355L246317O43806K815561
$$ 133582907 134114408 135787277 137529831 138947849 141691484 143876839 147123156 147766962 150582523
1058.9A50582523K877598K824841L632135K694445N174103L707256M082088J858883
$$ 150582523 153460121 156284962 159917097 162611542 167785645 171492901 175574989 177433872
1066.6A77433872J349735J054764q76426m79317l754883l595180m428788l375873l081246
$$ 177433872 178783607 179838371 178961945 178482628 174727745 171132565 166703777 163327904 160246658
1075.3A60246658k797527r29518k273941j17912r64785R15661O32668M81825J735496
$$ 160246658 157449131 156519613 154245672 154127760 153162975 154078636 154711304 155193129 156928625
1084A56928625K93646K442808J377974K892933K719669K974586K061634N40982L369713
$$ 156928625 157222271 159665079 161043053 163935986 166655655 169630241 171691875 172232857 175602570
1092.7A75602570K371940K867718J600265K524529J909656J021862J684475p22618
$$ 175602570 177974510 180842228 182442493 184967022 186876678 187898540 189583015 188860397
1100.4A88860397J352806R0485M55380N63735K11163J031017P3471J641179N08709
$$ 188860397 190213203 190303688 190759068 191322803 191533966 192564983 192638454 194279633 194788342
1109.1A94788342J937732Q80966J334172L083744J889534K496891P82852K822895K238617
$$ 194788342 196726074 197607040 198941212 202024956 203914490 206411381 207194233 210017128 212255745
1117.7B12255745J249351J196175N03902J550732J006184K474003O03885O31981J284161
$$ 212255745 213505096 214701271 215205173 216755905 217762089 220236092 220839977 221471958 222756119
1126.4B22756119J380787K128791J332894K957496J739560J999855J741619J818619
$$ 222756119 224136906 226265697 227598591 230556087 232295647 234295502 236037121 237855740
1134.1B37855740J274166p10831J09463j395226j050567k464333k429352k472286m507446
$$ 237855740 239129906 238419075 238528538 237133312 236082745 233618412 231189060 228716774 224209328
1142.8B24209328l457146m084377j988392k601223l035641k572555k486554j487732
$$ 224209328 220752182 216667805 214679413 212078190 209042549 206469994 203983440 202495708
1150.5B02495708k879962j412602k080269r30137r31702m36382J120987o59676R66797
$$ 202495708 199615746 198203144 196122875 195192738 194261036 193824654 194945641 194285965 195252762
1159.2A95252762L95088J865082K125263J819534K587872K380695L498383K799930
$$ 195252762 195647850 197512932 199638195 201457729 204045601 206426296 209924679 212724609
1166.9B12724609N175381N255528N746212O032695N809880P411689O705723P857609
$$ 212724609 217899990 223155518 228901730 234934425 240744305 248155994 254861717 262719326
1174.6B62719326P251186P131443O950512P031689P277145O344548P205085O985302
$$ 262719326 269970512 277101955 284052467 291084156 298361301 304705849 311910934 318896236
1182.4C18896236P020817O199417O044350N609398N174522N771447M424629L504066
$$ 318896236 325917053 332116470 338160820 343770218 348944740 354716187 359140816 362644882
1190.1C62644882K364311K072831K283783K170448J908493J339798J315231O01578
$$ 362644882 365009193 367082024 369365807 371536255 373444748 374784546 376099777 376701355
1197.8C76701355P75795N69496J78833K95258j22223K8496K66037J307525J405525
$$ 376701355 377477150 378046646 378225479 378520737 378398514 378427010 378693047 380000572 381406097
1206.5C81406097J086846J549263K006569K211685J999512K570991K523003K053451
$$ 381406097 382492943 384042206 386048775 388260460 390259972 392830963 395353966 397407417
1214.2C97407417J775437K021446K051735J562118J396065R70802Q98476N38559M0131
$$ 397407417 399182854 401204300 403256035 404818153 406214218 407185020 408083496 408622055 408662186
1222.9D08662186Q6593L586n11474p21398q61092j378555j044311j069794j274071
$$ 408662186 408748779 408752365 408240891 407519493 406658401 405279846 404235535 403165741 401891670
1231.5D01891670j003189j445770j392746r43642l76510o44112j141586n94368m43611
$$ 401891670 400888481 399442711 398049965 397106323 396729813 396085701 394944115 394349747 393906136
1240.2C93906136j21689j60675l39585j4572O02875N30701k7237O99234J131057J135674
$$ 393906136 393784447 393623772 393284187 393269615 393872490 394403191 394375954 395075188 396206245 397341919
1249.9C97341919Q34503O10275Q44613J043281J177597P09915P20902J036796R16024
$$ 397341919 398176422 398786697 399631310 400674591 401852188 402562103 403283005 404319801 405235825
1258.5D05235825O60400Q19664R63440O07910N15289N83115P55997R83963J156120
$$ 405235825 405896225 406715889 407679329 408287239 408802528 409385643 410141640 411125603 412281723
1267.2D12281723J176224J360588J451111J026001P59391J107522J469039J258164
$$ 412281723 413457947 414818535 416269646 417295647 418055038 419162560 420631599 421889763
1274.9D21889763N94063l89901p6484J9035l36685r4109m34494l96423l72963q0376
$$ 421889763 422483826 422093925 422017441 422036476 421699791 421605682 421171188 420774765 420401802 420321426
1284.6D20321426K58637L93944J52816n31578k77977q06045r54552n94406r64012j154862
$$ 420321426 420580063 420974007 421126823 420595245 420317268 419511223 418556671 417962265 416998253 415843391
1294.2D15843391j104850q19626q55713r64050j195679j183281j077385j143227j095047
$$ 415843391 414738541 413918915 413063202 412099152 410903473 409720192 408642807 407499580 406404533
1302.9D06404533j458015j394348r70841q52623j231613j212539o66886p49855r20868
$$ 406404533 404946518 403552170 402581329 401728706 400497093 399284554 398617668 397867813 396946945
1311.6C96946945j540031j439400q52127j311874j278954j376495j527367j159782
$$ 396946945 395406914 393967514 393115387 391803513 390524559 389148064 387620697 386460915
1319.3C86460915p57904n47905p25518r66148j641274j815948j897469k236976k365303
$$ 386460915 385703011 385155106 384429588 383463440 381822166 380006218 378108749 375871773 373506470
1328C73506470k929764k599526k329063k110748j835785j840744j059990j163941q13064
$$ 373506470 370576706 367977180 365648117 363537369 361701584 359860840 358800850 357636909 356823845
1336.7C56823845q41141p45430m29306j062622l32794K9869L20015j02158J31913K51960
$$ 356823845 355982704 355237274 354807968 353745346 353412552 353442421 353762436 353660278 353792191 354044151
1346.3C54044151L88108N57441j4496Q5717q21076n42412o62384j057586p71981p41844
$$ 354044151 354432259 354989700 354975204 355060921 354239845 353697433 353035049 351977463 351205482 350463638
1355.9C50463638k26669j176567n71289k67143n47219m41398r76715m85840r58824
$$ 350463638 350236969 349060402 348489113 348221970 347674751 347233353 346256638 345770798 344811974
1364.6C44811974n77012r72824m32243k74544o63070J84288j01204R65080M14543Q10471
$$ 344811974 344234962 343262138 342829895 342555351 341892281 342076569 341975365 342940445 343354988 344165459
1374.3C44165459R77134N48363J198845N2261M63448M5242R44519J389427J158181
$$ 344165459 345142593 345690956 346889801 346942062 347405510 347450752 348395271 349784698 350942879
1382.9C50942879J416969J121559K218704J487694K071686J805763J571732J295090
$$ 350942879 352359848 353481407 355700111 357187805 359259491 361065254 362636986 363932076
1390.7C63932076Q65592J021843J23215O40793n24902M21905N35050J03340p76253
$$ 363932076 364797668 365819511 365942726 366583519 366058617 366480522 367015572 367118912 366342659
1399.3C66342659j677666n5351j215210o39152o10657j714783r71832r20067l34244
$$ 366342659 364664993 364609642 363394432 362755280 362144623 360429840 359458008 358537941 358203697
1408C58203697o48575l8871r50814r76982q37745j064225l25088j268730l93105r84459
$$ 358203697 357555122 357516251 356565437 355588455 354750710 353686485 353361397 352092667 351699562 350715103
1417.7C50715103q3084j050987l87116J783448J05934P60536q11997O52504R11332
$$ 350715103 350632019 349581032 349193916 350977364 351083298 351843834 351031837 351684341 352595673
1426.3C52595673m21791Q06579K4262P90367L37753J769028J138572O82869K117615
$$ 352595673 352173882 352980461 353004723 353795090 354132843 355901871 357040443 357723312 359840927
1435C59840927L98293M78325J36718K144890J201935O91490P39746N4932J623611O58074
$$ 359840927 360239220 360717545 360854263 362999153 364201088 364892578 365632324 365687256 367310867 367968941
1444.7C67968941J481552N48744N96008j03416j5831R31473j483269l85704j554298
$$ 367968941 369450493 369999237 370595245 370491829 370475998 371407471 369924202 369538498 367984200
1453.3C67984200K35481L77121o79817N40351m281196L172836q49190J771775K90222
$$ 367984200 368219681 368596802 367916985 368457336 364176140 367348976 366499786 368271561 368561783
1462C68561783N39131K631378k81410L599701J695633M225311L122215M404869N772171
$$ 368561783 369100914 371732292 371450882 375050583 376746216 380971527 384093742 388498611 394270782
1470.7C94270782L407746P103576K538262P433357M310532N430450M856034L779640
$$ 394270782 397678528 404782104 407320366 414753723 419064255 424494705 429350739 433130379
1478.4D33130379N350380L591537N347595L544007N353584M385910L480721M625511
$$ 433130379 438480759 442072296 447419891 450963898 456317482 460703392 464184113 468809624
1486.1D68809624K283516M806213J606483L264351K093697K689209L565521K314873
$$ 468809624 471093140 475899353 477505836 480770187 482863884 485553093 489118614 491433487
1493.8D91433487M351311J811218J753235K443733J917763J500854K483673K885971
$$ 491433487 495784798 497596016 499349251 501792984 503710747 505211601 507695274 510581245
1501.6E10581245L60947K182121J443825J349373l763123O09093P491455Q97713K699852
$$ 510581245 510942192 513124313 514568138 515917511 512154388 512763481 520254936 521152649 523852501
1510.2E23852501J101799K020950P3128J648369J882553l15018J330452k003860N149154
$$ 523852501 524954300 526975250 527048378 528696747 530579300 530264282 531594734 529590874 534740028
1518.9E34740028L712464J118927k46926k096443M930687J782646n04684p5951J637039
$$ 534740028 538452492 539571419 539324493 537228050 542158737 543941383 543436699 543360748 544997787
1527.6E44997787O21033P13768K270699N4779J468468n61257j815338K289123J132851
$$ 544997787 545618820 546332588 548603287 548658066 550126534 549565277 547749939 550039062 551171913
1536.3E51171913J868477J968002p18383j1098710N717812L139534m90913K150497
$$ 551171913 553040390 555008392 554290009 543191299 548909111 552048645 551557732 553708229
1544E53708229q18405j093178J193237J276360O79703j042214k153549J86691R37958
$$ 553708229 552889824 551796646 552989883 554266243 554945946 553903732 551750183 551936874 552874832
1552.7E52874832K7809k765236k84538L137627K767296q647271o910057N81742L003807
$$ 552874832 552902641 550137405 549852867 552990494 555757790 547110519 540200462 540782204 543786011
1561.4E43786011J095009K45094l27911l190690j384620K27928L17879O6299n472259
$$ 543786011 544881020 545126114 544798203 541607513 540222893 540450821 540768700 540834999 535362740
1570E35362740j067124k8839j346436j378707n5619o02188p792549P77397O20842o19316
$$ 535362740 534295616 534266777 532920341 531541634 531486015 530883827 523091278 523868675 524489517 523870201
1579.7E23870201q55942j309929j135482j475602p77206j480789j627274j617851j568184
$$ 523870201 523014259 521704330 520568848 519093246 518316040 516835251 515207977 513590126 512021942
1588.4E12021942q63457j756820j224976j584663p71446j224442k314644j328049j667366
$$ 512021942 511158485 509401665 508176689 506592026 505820580 504596138 502281494 500953445 499286079
1597D99286079j222686k249260j565628j683922k028198j592827k189636j037179j608543
$$ 499286079 498063393 495814133 494248505 492564583 490536385 488943558 486753922 485716743 484108200
1605.7D84108200j252670j956482j252289j802368k784691j090736k123680j134453
$$ 484108200 482855530 480899048 479646759 477844391 475059700 473968964 471845284 470710831
1613.4D70710831j885796k23236o76117p309341R48143k84157k10991j480942l80668
$$ 470710831 468825035 468601799 467925682 460616341 461564484 461280327 461069336 459588394 459207726
1622.1D59207726j290780m227485Q2893l18107O17218k328911j605568j84365o07757
$$ 459207726 457916946 453689461 453772354 453454247 454071465 451742554 450136986 449952621 449344864
1630.8D49344864k77176j054840N42374N22079l247986k206955J387787m32129J5946
$$ 449344864 449067688 448012848 448555222 449077301 445829315 443622360 445010147 444578018 444593964
1639.5D44593964O60820m49028J060104l87001J332703J421051j643486J449356L37104
$$ 444593964 445254784 444805756 445865860 445478859 446811562 448232613 446589127 448038483 448375587
1648.1D48375587K356682J477623L229676L460273J531334m110527L78990L913575
$$ 448375587 450732269 452209892 455439568 458899841 460431175 456320648 456699638 460613213
1655.9D60613213K293396K053566J880226K582359K481842K929153K784501K20375
$$ 460613213 462906609 464960175 466840401 469422760 471904602 474833755 477618256 477838631
1663.6D77838631L150177K881431K911148K906723L013802J357117K211456M014244
$$ 477838631 480988808 483870239 486781387 489688110 492701912 494059029 496270485 500284729
1671.3E00284729K186127M490013M655952K658730N04417L751679M054527K870293
$$ 500284729 502470856 506960869 511616821 514275551 514779968 518531647 522586174 525456467
1679E25456467L275795J951179L328705M405022L592834j073418L337632N749855M434280
$$ 525456467 528732262 530683441 534012146 538417168 542010002 540936584 544274216 550024071 554458351
1687.7E54458351K403031K603912K603493K685814L044357K246361L395385L732911
$$ 554458351 556861382 559465294 562068787 564754601 567798958 570045319 573440704 577173615
1695.4E77173615j389885L071022M438896O216316K381401n608940L780518L011665
$$ 577173615 575783730 578854752 583293648 589509964 591891365 586282425 590062943 593074608
1703.1E93074608J878090M73861K104073o2370J110115K230644J085129P08122J390533
$$ 593074608 594952698 595426559 597530632 597468262 598578377 600809021 601894150 602602272 603992805
1711.8F03992805J862717J215401k00043j677437K208557J109848p093658L307877
$$ 603992805 605855522 607070923 606870880 605193443 607402000 608511848 601418190 604726067
1719.5F04726067L025665J685829R27963L40653O3286Q53080Q03528K60773P04002
$$ 604726067 607751732 609437561 610365524 610706177 610769463 611622543 612426071 612686844 613390846
1728.2F13390846O30455q90045q03146K436409K148208l959770k413940M100876L023452
$$ 613390846 614021301 613131256 612328110 614764519 616912727 612952957 610539017 614639893 617663345
1736.9F17663345M74244J856498N50041j860351L019295J797828m60014Q77190L325767
$$ 617663345 618137589 619994087 620544128 618683777 621703072 623500900 623040886 623918076 627243843
1745.5F27243843K620812J638946K190170L91121L062554L82919L75519L866806K124405
$$ 627243843 629864655 631503601 633693771 634084892 637147446 637530365 637905884 641772690 643897095
1754.2F43897095K570495L028794O66732J612931L198471K753143L129959m5471K4338
$$ 643897095 646467590 649496384 650163116 651776047 654974518 657727661 660857620 660812149 660836487
1762.9F60836487L029861J369629J354599J868668J969833p03964K204971M486466
$$ 660836487 663866348 665235977 666590576 668459244 670429077 669725113 671930084 676416550
1770.6F76416550N90057q23135p26548L163834J620331j042938J717987M53186J242141
$$ 676416550 677006607 676183472 675456924 678620758 680241089 679198151 680916138 681369324 682611465
1779.3F82611465N30777m92553J571274K328567K149658m93622P6523J030808K63977
$$ 682611465 683142242 682649689 684220963 686549530 688699188 688205566 688282089 689312897 689576874
1788F89576874j15204Q29620O82755N9509k236404J26419M401855J625519j36719J100540
$$ 689576874 689461670 690291290 690974045 691033554 688797150 688923569 693325424 694950943 694814224 695914764
1797.6F95914764J272965k8687j972427J177750n81894j94092J321258R04084J548996
$$ 695914764 697187729 697159042 695186615 696364365 695782471 695588379 696909637 697813721 699362717
1806.3F99362717P29141L54996Q69369J704178o78482o25229J16043m15802M64096
$$ 699362717 700091858 700446854 701316223 703020401 702341919 701716690 701832733 701416931 701881027
1815G01881027l68805Q56781N26200P21359J604919R97696J151123p32727P43408J408081
$$ 701881027 701512222 702369003 702895203 703616562 705221481 706219177 707370300 706637573 707380981 708789062
1824.6G08789062k827987j045227J287460J550446K47497k952804P41195K911301J135178
$$ 708789062 705961075 704915848 706203308 707753754 708001251 705048447 705789642 708700943 709836121
1833.3G09836121P98187N34134j5259r45663j665116N78385l76587J47247O65207J438141
$$ 709836121 710634308 711168442 711153183 710207520 708542404 709120789 708744202 708891449 709556656 710994797
1842.9G10994797J633377l442230J847000J679916k93579p09457j30768J20773r10339
$$ 710994797 712628174 709185944 711032944 712712860 712419281 711709824 711579056 711699829 710789490
1851.6G10789490L0288j05438O76041O91299Q46634J119156J19019L61862m33426l95126
$$ 710789490 710819778 710714340 711390381 712081680 712928314 714047470 714166489 714528351 714094925 713699799
1861.3G13699799j275483m96292K5864O87R63897j98135J669159P019q43124J250534
$$ 713699799 712424316 711928024 711953888 711954575 712918472 712720337 714389496 714396515 713553391 714803925
1870.9G14803925N64727L88565n53817l68882p00836P0954j00327r6130J074371P28989
$$ 714803925 715368652 715757217 715203400 714834518 714133682 714204636 714104309 714008179 715082550 715811539
1880.6G15811539J393585M66766M58145k63977q78524j42136l29666Q70285q33206
$$ 715811539 717205124 717671890 718130035 717866058 716987534 716845398 716515732 717386017 716552811
1889.2G16552811j757431J186523J997376O12716L63770O66122n79223N53512m66156
$$ 716552811 714795380 715981903 717979279 718591995 718955765 719621887 719042664 719596176 719130020
1897.9G19130020n12009k11257q38013j25199q2244Q79440M27246Q42438J148300N37796
$$ 719130020 718618011 718406754 717568741 717443542 717361298 718240738 718667984 719510422 720658722 721196518
1907.6G21196518R7351r74121j141434j011810J86615l02277L7155L44925O43387J810532
$$ 721196518 721293869 720319748 719178314 718166504 718353119 718050842 718087997 718432922 719076309 720886841
1917.2G20886841j237793k18735J330414O78177J36871j977692j533432R7352N42678
$$ 720886841 719649048 719430313 720760727 721438904 721575775 719598083 718064651 718162003 718704681
1925.9G18704681k30560N40314Q58383N76248R74503O63757N61371r46655r61380o92597
$$ 718704681 718474121 719014435 719872818 720449066 721423569 722087326 722648697 721702042 720740662 720048065
1935.5G20048065m72717k75040k63977L71094J51062J610870J73722j222153J175842
$$ 720048065 719575348 719300308 719036331 719407425 719558487 721169357 721343079 720120926 721296768
1944.2G21296768O90384l99933p82547l0517o34308m52805J55564k7237M11224N57861
$$ 721296768 721987152 721587219 720804672 720774155 720139847 719687042 719842606 719815369 720226593 720784454
1953.8G20784454J127549O30340P51343J60751n68771m94537p71409l11737p19528
$$ 720784454 721912003 722542343 723293686 723454437 722885666 722391129 721619720 721307983 720588455
1962.5G20588455K2431N54275Q62656J010742o5765P63N47332O67038n80368l62396
$$ 720588455 720610886 721165161 722027817 723038559 722972794 722973557 723520889 724187927 723607559 723245163
1972.2G23245163l63770n73349k7008m09393M32282L01208L94287L46680K41470N83191
$$ 723245163 722881393 722308044 722281036 721871643 722303925 722605133 722999420 723346100 723587570 724170761
1981.8G24170761j20926k3575m93927o79855m65393L30811J58844l33329R70993O68412
$$ 724170761 724049835 724026260 723532333 722852478 722387085 722717896 722876740 722543411 723514404 724182816
1991.5G24182816j58082k77557L89481n0888n69611m88663o56891m4479n15823M11682
$$ 724182816 724024734 723747177 724136658 724085770 723516159 723027496 722370605 722326126 721810303 722221985
2001.1G22221985N84030J60980L76053k17590J76468m23813m3869k53830q24509m25873
$$ 722221985 722806015 722966995 723343048 723125458 723301926 722878113 722834244 722580414 721755905 721330032
2010.7G21330032n37490K12326r6055R4071L89328J42288p5378k87018m93851q86154
$$ 721330032 720792542 721004868 720908813 721002884 721392212 721534500 721459122 721172104 720678253 719792099
2020.4G19792099m55093m99192R003l64685m74930r765p020N77317j42517K21405l18451
$$ 719792099 719337006 718837814 718846817 718482132 718007202 717997437 717990417 718567734 718425217 718646622 718328171
2031G18328171q42667m37546j061325p09839o12182J71585L64914J99280O5689j1139
$$ 718328171 717485504 717047958 715986633 715276794 714664612 714836197 715201111 715400391 715466080 715454941
2040.6G15454941o3019n05295K52381p34406o38199m26712o89621j1673j88217O54984
$$ 715454941 715391922 714886627 715139008 714404602 713766403 713339691 712650070 712638397 712450180 713105164
2050.3G13105164J50985K10953L71246K40479L01285o84738j54343n58624n66101l17688
$$ 713105164 713256149 713467102 713838348 714078827 714380112 713695374 713541031 712982407 712416306 712098618
2059.9G12098618O5078J95313p9575R85031J95542K41546M54331J74408m7760o69632
$$ 712098618 712163696 712359009 712279434 713264465 713460007 713701553 714155884 714330292 714282532 713612900
2069.6G13612900l76282n96008j11466p6599L72315L03115Q1711Q86994J34430J80969
$$ 713612900 713236618 712640610 712529144 712452545 712824860 713127975 713209686 714096680 714231110 714412079
2079.2G14412079r6131k74963l03268l97568m48685p37762M18167L02582L17154O00891
$$ 714412079 714315948 714040985 713737717 713340149 712891464 712153702 712571869 712874451 713191605 713792496
2088.9G13792496L52478j2970Q163L52173m17404p0114n16815k81372K30178k65197
$$ 713792496 714144974 714132004 714140167 714492340 714074936 714004822 713488007 713206635 713436813 713171616
2098.5G13171616M96444L64762N44967L11280l5706r6359p2556L96729j47324l67508
$$ 713171616 713668060 714032822 714577789 714889069 714853363 714757004 714684448 715081177 714933853 714566345
2108.1G14566345m67605J04599J84631n1956M3106K1591L47748p6370K08816J8311
$$ 714566345 714098740 714203339 714387970 714336014 714379120 714400711 714748459 714672089 714880905 714899216
2117.8G14899216J5793R3383l70254q2016l15857o9962j5945K50549M2496j46637N06287
$$ 714899216 714915009 715008392 714638138 714556122 714240265 714170303 714154358 714404907 714447403 714300766 714807053
2128.4G14807053L9138j61972p4463P3014o15006n11474N09414O33088K32009n02472
$$ 714807053 714846191 714684219 714609756 714682770 714067764 713556290 714065704 714698792 714930801 714428329
2138G14428329L7842N5084P3319k4109k57797J14212l2120L73535l48205l42484K45362
$$ 714428329 714466171 714521255 714594574 714570465 714312668 714426880 714394760 714768295 714420090 714077606 714322968
2148.6G14322968K71148n34l21197O09054P2479q5907j21231l01513O2561K5406L29208
$$ 714322968 714594116 714593582 714272385 714881439 714953918 714868011 714746780 714445267 714507828 714533234 714862442
2159.3G14862442o2332K88620K97165M08172J62125j08490N11475j49079R7657k68708
$$ 714862442 714800110 715088730 715385895 715794067 715956192 715847702 716359177 716210098 716307755 716039047
2168.9G16039047J53122P12433J54266N16434K67182N16357J08643K25601L91082J76011
$$ 716039047 716192169 716904602 717058868 717575302 717842484 718358841 718467484 718693085 719084167 719260178
2178.5G19260178K52075n799P20902J51977J1673P9346K27127L62091K0066N72738
$$ 719260178 719512253 719506454 720227356 720379333 720391006 720470352 720697479 721059570 721079636 721652374
2188.2G21652374K4796M19464K5787k09961M51355J89667M37317m1199N17197K59704
$$ 721652374 721677170 722096634 722122421 721912460 722363815 722553482 722990799 722949600 723466797 723726501
2197.8G23726501k35672K57111N00107O55441K5788K43530M883J54419P6980j9760
$$ 723726501 723490829 723747940 724248047 724903488 724929276 725172806 725177689 725332108 725409088 725389328
2207.5G25389328L03116L6774O05316o638J38321J97296Q7128N54886K07443M76608
$$ 725389328 725692444 725729218 726334534 726327896 726466217 726663513 726750641 727305527 727512970 727989578
2217.1G27989578J27716K03247k44979j01471N17501J89362L37448j75247J6632k2202
$$ 727989578 728117294 728320541 728075562 727974091 728491592 728680954 729018402 728843155 728859787 728837585
2226.8G28837585L27759M59900M4098K48795k671K69394k60620l69263j31607M87976
$$ 728837585 729165344 729625244 729669342 729918137 729915466 730184860 729924240 729554977 729423370 729911346
2236.4G29911346N46723l7460N23757j38778J37787J93328L20359M81186l30735J7472
$$ 729911346 730458069 730420609 730944366 730805588 730943375 731136703 731457062 731938248 731607513 731624985
2246G31624985k86026P5073L4332o7291M0665L65295O83060j8997P80105J58386l15322
$$ 731624985 731338959 731414032 731448364 731381073 731421738 731787033 732470093 732451096 733231201 733389587 733074265
2256.7G33074265l50419k49176L97644o0882L16162p7972N57937N13077K14462L01819
$$ 733074265 732723846 732474670 732872314 732811432 733127594 733049622 733607559 734120636 734335098 734636917
2266.3G34636917k94037Q86231J51748N1194m883l29819j75857o17981J24740j17874
$$ 734636917 734342880 735229111 735380859 735432053 735427170 735097351 734921494 734303513 734428253 734310379
2275.9G34310379R17664N25283J2894J89667o50330K69394m54788k28577k66800K3041
$$ 734310379 735228043 735753326 735766220 735955887 735305557 735574951 735120163 734891586 734624786 734647827
2285.6G34647827J142578K65427O37131N38635P93228M56696O27136J271210K02255
$$ 734647827 735790405 736055832 736692963 737231598 738024826 738481522 739108658 740379868 740582123
2294.3G40582123L72009k74200J30691O78253L83149N18493M91257J097259O99845
$$ 740582123 740954132 740679932 740810623 741488876 741872025 742390518 742881775 743979034 744678879
2302.9G44678879P32879P42112J488876J847305N05829O74515L79715P37305R05380
$$ 744678879 745411758 746153870 747642746 749490051 749995880 750670395 751050110 751787415 752692795
2311.6G52692795O51169J022796K83432R94568J741715J718673J735688J716613K505875
$$ 752692795 753343964 754366760 754650192 755644760 757386475 759105148 760840836 762557449 765063324
2320.3G65063324J779327P84607J219788J044693L44086N83419J796341K125550K430191
$$ 765063324 766842651 767627258 768847046 769891739 770235825 770819244 772615585 774741135 777171326
2329G77171326J314392r97315l01513J86996p15179j353684J098099L243484Q0414
$$ 777171326 778485718 777488403 777186890 777373886 776658707 775305023 776403122 779646606 779727020
2337.7G79727020J29471J686325K92816o40564N27497N76858j310119l305207n560302
$$ 779727020 779856491 781542816 781835632 781195068 781722565 782299423 780989304 777684097 772123795
2346.3G72123795o896210o650620N73044P239838M783706M269410M408569L900681
$$ 772123795 765227585 758576965 759150009 766389847 771173553 775442963 779851532 783752213
2354.1G83752213N155792K149734M951859J737594J07193J86081j239624q88061j660767
$$ 783752213 788908005 791057739 796009598 797747192 797854385 798040466 796800842 795912781 794252014
2362.7G94252014J003647k195358k541962k744522l908005m152832n248031l362503
$$ 794252014 795255661 793060303 790518341 787773819 783865814 779712982 774464951 771102448
2370.4G71102448m019089m176560m196472l229141k314682k838135k235489l017425
$$ 771102448 767083359 762906799 758710327 755481186 753166504 750328369 748092880 745075455
2378.2G45075455l030167k705002k521667k410736k499924j917496j573410j091766
$$ 745075455 742045288 739340286 736818619 734407883 731907959 729990463 728417053 727325287
2385.9G27325287j116181n81741L6697J70136N7678n22537k63214j81732Q316l82843
$$ 727325287 726209106 725627365 725664062 725834198 725891876 725369339 725106125 724924393 724932709 724549866
2395.5G24549866p47528l01285k6398J53k31400K12479j29547l9749j06736p39288
$$ 724549866 723802338 723501053 723474655 723474808 723243408 723455887 723326340 723286591 723179855 722440567
2405.2G22440567m50668n60685j58081l45535m26788l02735j27105L17764J8387Q7662
$$ 722440567 721989899 721429214 721271133 720925598 720498810 720196075 720068970 720386734 720405121 720492783
2414.8G20492783n71595n62591l26615k52761l42255j004868n33065o49872n1575L45001
$$ 720492783 719921188 719358597 719031982 718779221 718436966 717432098 716899033 716249161 716197586 716542587
2424.5G16542587J9684j1063n53588o50330q75168k77023l38593o21414k37350n11704
$$ 716542587 716562271 716551208 715997620 715347290 714472122 714195099 713856506 713235092 712997742 712486038
2434.1G12486038k94113r3689j72348m52194l9826k50549p02667n59998o46438p1793
$$ 712486038 712191925 712098236 711925888 711473694 711433868 711183319 710480652 709920654 709274216 709202423
2443.7G09202423o63757p23038m04663o05621j43433k4948L6011o26526m70734r6207
$$ 709202423 708538666 707815628 707410965 706805344 706661911 706636963 706672974 706046448 705575714 705479507
2453.4G05479507m87442m17862m11834n27420n96314l02505l98331j25961j27945l53012
$$ 705479507 704992065 704574203 704162369 703634949 703038635 702736130 702337799 702211838 702083893 701730881
2463G01730881j83945n48248l23868Tk38113n63965r42612k50549k8458k54974n65643
$$ 701730881 701546936 700998688 700674820 700350952 700112839 699548874 698606262 698355713 698327255 698072281 697506638
2473.6F97506638k14997j14364j84861k54211l06854k98615n24215N4855k99301n79682
$$ 697506638 697291641 697177277 696992416 696738205 696431351 696132736 695608521 695663376 695364075 694784393
2483.3F94784393n76858m62265J09939l31039m13818l74146l6545k32391l75824j57623
$$ 694784393 694207535 693745270 693855209 693524170 693110352 692736206 692699661 692467270 692091446 691933823
2492.9F91933823m98963j61209l47519j19552l08915n36575R4605J82800J10016l79486
$$ 691933823 691434860 691273651 690926132 690806580 690497665 689961090 690055695 690238495 690348511 689969025
2502.6F89969025l16162o76575m25034J3504j68762o8512o24084p5455j6403j16349
$$ 689969025 689652863 688976288 688551254 688564758 688395996 688327484 687703400 687627945 687611542 687495193
2512.2F87495193l08074n47181J63346l47672m25567n31998k53830p9269l50800K89764
$$ 687495193 687187119 686639938 686803284 686455612 686030045 685498047 685244217 685164948 684814148 685103912
2521.9F85103912n2948n34134q08410l81546j81275k01492k2736m79354m30298q29468
$$ 685103912 685050964 684516830 683708420 683326874 683145599 682944107 682921371 682442017 682011719 681182251
2531.5F81182251o68182k79847n2414k3117n83114l48664k14920o8969m54178o45065
$$ 681182251 680514069 680234222 680181808 680158691 679575577 679226913 679011993 678943024 678488846 677843781
2541.1F77843781l66440o5155P8430p70722p76519n84870k99377j36872m57458o13098
$$ 677843781 677477341 677412186 677490616 676719894 675943375 675358505 675059128 674922256 674464798 673851700
2550.8F73851700n85022j8082p1487o2638j80587l43857o00662p99256o09665q27942
$$ 673851700 673266678 673248596 673177109 673114471 672933884 672590027 671989365 671190109 670580444 669752502
2560.4F69752502o2332j73950m26025j38550k39639O9732m36401n25665o02570m21600
$$ 669752502 669690170 669516220 669090195 668951645 668712006 668781738 668345337 667819672 667217102 666795502
2570.1F66795502j35804m58221k03018o04401j110916n69611K40784j01471j12915
$$ 666795502 666659698 666201477 665998459 665394058 664283142 663713531 663954315 663852844 663739929
2578.7F63739929j02539o73752m51660n67093k24838m13361n73959m38995o72913j3657
$$ 663739929 663637390 662963638 662511978 661944885 661720047 661306686 660732727 660293732 659620819 659607162
2588.4F59607162p1487j76620l22419p7591r15o33545l68576m97055m47312l27682
$$ 659607162 659535675 659359055 659036636 658959045 658958130 658324585 657956009 657458954 657011642 656683960
2598F56683960j87302k33230l49655j38550l34320q4305m98047n42068j33362l31574
$$ 656683960 656496658 656263428 655913773 655775223 655440903 655356598 654858551 654316483 654183121 653851547
2607.7F53851547m47464n13458l14865o09207m14200j96304n25132n74112l53164n58548
$$ 653851547 653404083 652890625 652575760 651966553 651552353 651356049 650830917 650256805 649903641 649345093
2617.3F49345093j066895l56140n41229r01261l90319m06494m00544n56106n79071
$$ 649345093 648278198 647922058 647380829 646479568 646089249 645682755 645282211 644726105 644147034
2626F44147034p85218n90057m48074r09500q81882m86527l89633j120071j042404n45350
$$ 644147034 643361816 642771759 642323685 641414185 640532303 640045776 639656143 638536072 637493668 636948318
2635.6F36948318n66444p48558q30002l71666k26783n22652r92966j004257j011887
$$ 636948318 636381874 635633316 634803314 634431648 634204865 633682213 632689247 631684990 630673103
2644.3F30673103r33456p90520o69479l40729r49325p08046l78228o55517m92707o55975
$$ 630673103 629739647 628949127 628279648 627938919 626989594 626281548 625903320 625247803 624755096 624099121
2654F24099121o63681o36520n62706j184120j053772k20643m93621n45884n14335m12674
$$ 624099121 623435440 622798920 622236214 621052094 619998322 619777679 619284058 618738174 618223839 617811165
2663.6F17811165n27840p21855q97751o11420l26690q05893o76460r52568p71866o29540
$$ 617811165 617283325 616561470 615663719 615052299 614725609 613919716 613243256 612290688 611518822 610889282
2673.3F10889282o15921P6981l21312m47846n58052n89866n07355p34825n25093l80020
$$ 610889282 610273361 610350342 610029030 609581184 609023132 608433266 607925911 607191086 606665993 606285973
2682.9F06285973n84793r85795m49485m57192o75125l69072l17116J81923k69584q47092
$$ 606285973 605701180 604715385 604265900 603808708 603133583 602764511 602447395 602629318 602359734 601512642
2692.5F01512642n93491m35486j025276j127968n41954p66105o52581l25622L9024
$$ 601512642 600919151 600483665 599458389 598330421 597788467 597022362 596369781 596044159 596083183
2701.2E96083183m44259r79843m72489m63333n80521q76465q84819j012916o98280
$$ 596083183 595638924 594659081 594186592 593723259 593142738 592266273 591381454 590368538 589670258
2709.9E89670258k49978n22728r7961k60506o56471r67789r37728q49801q55255j66206
$$ 589670258 589420280 588897552 588799591 588539085 587882614 586914825 585977097 585127296 584272041 584105835
2719.5E84105835m13094k56843k14501o59942k29531j22451n65148r59091o81496o32629
$$ 584105835 583692741 583435898 583221397 582561455 582331924 582209473 581644325 580685234 580003738 579371109
2729.2E79371109o42166o16875o49757m90380l72314m20494q92525j43547O4850m87938
$$ 579371109 578728943 578112068 577462311 576971931 576599617 576179123 575286598 575143051 575207901 574719963
2738.8E74719963k19459m55704n59502l85933j64261n03959o85883n07851m45098j30768
$$ 574719963 574500504 574044800 573485298 573099365 572935104 572431145 571745262 571237411 570792313 570661545
2748.5E70661545l71552k03438k17857n48973p07092p58591o05087o30913o0120j5525
$$ 570661545 570289993 570086555 569868698 569319725 568612633 567854042 567248955 566618042 566557922 566542397
2758.1E66542397j72921k94532m14391k54822m64821j1329k51160p99637o18553p11060
$$ 566542397 566369476 566074944 565660553 565405731 564940910 564929581 564678421 563878784 563260231 562549171
2767.8E62549171p12623m42658l6125P5836k46620n22651j56632n03349r30443m88930
$$ 562549171 561836548 561393890 561357765 561433601 561186981 560664330 560507698 560004349 559073906 558584976
2777.4E58584976m38881k13623l53699o98356j048699q90808j67007k91176n28946
$$ 558584976 558146095 557932472 557578773 556880417 555831718 554940910 554773903 554482727 553953781
2786.1E53953781n24864l82500p65686q36410j058770j335487n52101q90808r48563
$$ 553953781 553428917 553046417 552280731 551444321 550385551 549050064 548497963 547607155 546658592
2794.8E46658592o22520l76930j75934r51081j049804r67865q31719r63058j360169
$$ 546658592 546036072 545659142 545483208 544532127 543482323 542514458 541682739 540719681 539359512
2803.4E39359512j189766p44819p83272j239014o19468p04194j194572j179619j418495
$$ 539359512 538169746 537424927 536641655 535402641 534783173 534078979 532884407 531704788 530286293
2812.1E30286293j434975j585502j118775p71293r34487j339836j597748j197815j117744
$$ 530286293 528851318 527265816 526147041 525375748 524441261 523101425 521503677 520305862 519188118
2820.8E19188118r17282r52454j343536j753273j809502j316986j213379j351433j543922
$$ 519188118 518270836 517318382 515974846 514221573 512412071 511095085 509881706 508530273 506986351
2829.5E06986351j742897j888580j617318j222305j245613j813507j880531j098366
$$ 506986351 505243454 503354874 501737556 500515251 499269638 497456131 495575600 494477234
2837.2D94477234j501770k057037k174454k106590k114792k695008k271919k178154
$$ 494477234 492975464 490918427 488743973 486637383 484522591 481827583 479555664 477377510
2844.9D77377510k602882k382889k302017k478905k276955k333526l103638k395363
$$ 477377510 474774628 472391739 470089722 467610817 465333862 463000336 459896698 457501335
2852.6D57501335j866150j940994j162338j119805r18350q02307j317940j528663j323052
$$ 457501335 455635185 453694191 452531853 451412048 450493698 449691391 448373451 446844788 445521736
2861.3D45521736j518020k061730j900177k009773k216187k330093k733574k693405
$$ 445521736 444003716 441941986 440041809 438032036 435815849 433485756 430752182 428058777
2869D28058777k456589k508850k429161k042694k269631k969245l341256k913475k275848
$$ 428058777 425602188 423093338 420664177 418621483 416351852 413382607 410041351 407127876 404852028
2877.7D04852028k064972k179146k477798j985169j647835j718254j500702j417732
$$ 404852028 402787056 400607910 398130112 396144943 394497108 392778854 391278152 389860420
2885.4C89860420j225776j423989j456947j196480j063995p51343l52135p3242l52478
$$ 389860420 388634644 387210655 385753708 384557228 383493233 382741890 382389755 382316513 381964035
2894.1C81964035n55878n13229l08189m86107o90232l88145o74439p46917n77050n57594
$$ 381964035 381408157 380894928 380586739 380100632 379410400 379022255 378347816 377600899 377023849 376466255
2903.7C76466255q87337j008033n24712r59816j245270j136589j187553j376915j869087
$$ 376466255 375578918 374570885 374046173 373086357 371841087 370704498 369516945 368140030 366270943
2912.4C66270943k047158k031936j851349k081719k138671j912461k032432j872559
$$ 366270943 364223785 362191849 360340500 358258781 356120110 354207649 352175217 350302658
2920.1C50302658j879768j642533j375045j242447p57370o78749q94852p15790J13564
$$ 350302658 348422890 346780357 345405312 344162865 343405495 342726746 341831894 341116104 341229668
2928.8C41229668M11758M0550M57688J156959J316719J614304J785774J554031J929207
$$ 341229668 341641426 341681976 342139664 343296623 344613342 346227646 348013420 349567451 351496658
2937.5C51496658K406960K376594K421189K236938K118798K986221L206520K910652
$$ 351496658 353903618 356280212 358701401 360938339 363057137 366043358 369249878 372160530
2945.2C72160530K816353K464218L106804K949257K893944L305511K332802K569427
$$ 372160530 374976883 377441101 380547905 383497162 386391106 389696617 392029419 394598846
2952.9C94598846L001061L054848K995453K583618K584419K714882L531952L364868
$$ 394598846 397599907 400654755 403650208 406233826 408818245 411533127 415065079 418429947
2960.6D18429947K705269K690544K428512K125855K035027K660293L117981K626152
$$ 418429947 421135216 423825760 426254272 428380127 430415154 433075447 436193428 438819580
2968.3D38819580K201042K535401K664947K673760K344894J942749K382698K376099
$$ 438819580 441020622 443556023 446220970 448894730 451239624 453182373 455565071 457941170
2976.1D57941170K602272K494316J808662J520729J403542K011337K121964J842079
$$ 457941170 460543442 463037758 464846420 466367149 467770691 469782028 471903992 473746071
2983.8D73746071J698494J507492J558189J391831R57222J282882J876145J318016
$$ 473746071 475444565 476952057 478510246 479902077 480859299 482142181 484018326 485336342
2991.5D85336342R69009O23131P25174J398277R59702L99589M8409R5253M005J48659
$$ 485336342 486305351 486928482 487653656 489051933 490011635 490411224 490459633 490554886 490558891 490707550
3001.1D90707550N13725N22499K77253o92406m14505J61514q8157m47960n61142k35672
$$ 490707550 491221275 491743774 492021027 491328621 490914116 491075630 490987473 490539513 489978371 489742699
3010.8D89742699l22533n75409j100082o61965m73861r30329m13055n42145q64525
$$ 489742699 489420166 488844757 487744675 487082710 486608849 485678520 485265465 484723320 483858795
3019.5D83858795j144790j280327j047669q06236q75320j463738j377563p87201n71251
$$ 483858795 482714005 481433678 480386009 479579773 478704453 477240715 475863152 475075951 474504700
3028.1D74504700j040268j110535j347008j423721r01756j657906j756058j264953
$$ 474504700 473464432 472353897 471006889 469583168 468681412 467023506 465267448 464002495
3035.9D64002495j120148j179619j532669j571159j432381j048927j283646j333046
$$ 464002495 462882347 461702728 460170059 458598900 457166519 456117592 454833946 453500900
3043.6D53500900j431427j542358j349640j599541j233520j556511j767006j335716
$$ 453500900 452069473 450527115 449177475 447577934 446344414 444787903 443020897 441685181
3051.3D41685181j455803j343270j303176j542511j641808j489067j672630j527367
$$ 441685181 440229378 438886108 437582932 436040421 434398613 432909546 431236916 429709549
3059D29709549j469688j219559q83331j519585j496849j774597j618843j271897j629295
$$ 429709549 428239861 427020302 426136971 424617386 423120537 421345940 419727097 418455200 416825905
3067.7D16825905j422272j625671j498108j578140j523858j297187j571656j448326
$$ 416825905 415403633 413777962 412279854 410701714 409177856 407880669 406309013 404860687
3075.4D04860687j410866j016769j221161j855583j861610j328621j243973j689797
$$ 404860687 403449821 402433052 401211891 399356308 397494698 396166077 394922104 393232307
3083.1C93232307j262016j063118j106415j757774k221298j771660j420860j125832
$$ 393232307 391970291 390907173 389800758 388042984 385821686 384050026 382629166 381503334
3090.8C81503334j418266j056175r98993j469956j636352k026749j703301j125221
$$ 381503334 380085068 379028893 378029900 376559944 374923592 372896843 371193542 370068321
3098.5C70068321p62520j680832j982612r09233q96683j430969j813965j604424j593627
$$ 370068321 369305801 367624969 365642357 364733124 363836441 362405472 360591507 358987083 357393456
3107.2C57393456j315270j132050j742324j673851j540261j305046q33092q34426j489525
$$ 357393456 356078186 354946136 353203812 351529961 349989700 348684654 347851562 347017136 345527611
3115.9C45527611j704445j426468j416397j206856j414490j326179r68895j286583
$$ 345527611 343823166 342396698 340980301 339773445 338358955 337032776 336063881 334777298
3123.6C34777298j378250j046105j311073j550865j235390j424370j298751j222344
$$ 334777298 333399048 332352943 331041870 329491005 328255615 326831245 325532494 324310150
3131.3C24310150j197166j117783j515388j445790j193008j155186j567345j165771
$$ 324310150 323112984 321995201 320479813 319034023 317841015 316685829 315118484 313952713
3139C13952713j020374j147538p18441j562881j581535j090393o64711n85404j277103
$$ 313952713 312932339 311784801 311066360 309503479 307921944 306831551 306166840 305581436 304304333
3147.7C04304333j343174j564961j276188j374149j334820q83026n63602k78397j365509
$$ 304304333 302961159 301396198 300120010 298745861 297411041 296528015 295964413 295686016 294320507
3156.4B94320507j623821j427708j115532q92887j057491p34883j329517j319656q15583
$$ 294320507 292696686 291268978 290153446 289260559 288203068 287468185 286138668 284819012 284003429
3165.1B84003429p38105j210022j334439q04481r73110q91133j211414j154079j102162
$$ 284003429 283265324 282055302 280720863 279916382 278943272 278052139 276840725 275686646 274584484
3173.8B74584484j269569q16632p34253n56945j102620j361827j075497o28510l29856
$$ 274584484 273314915 272498283 271764030 271207085 270104465 268742638 267667141 267038631 266708775
3182.4B66708775o93131r46464j449585j014882q28094q08945o25820j040382q76618
$$ 266708775 266015644 265069180 263619595 262604713 261776619 260967674 260341854 259301472 258424854
3191.1B58424854q71448o58665p98817j027546j045818q98590n31197q53881n64423
$$ 258424854 257553406 256894741 256095924 255068378 254022560 253123970 252592773 251738892 251174469
3199.8B51174469p85713j028538q38737p62368n25493q85163p36179o28376o10485
$$ 251174469 250388756 249360218 248521481 247759113 247233620 246348457 245612278 244983902 244373417
3208.5B44373417o70128o49471n72109p93648n00565r23824j066246o13957l45745
$$ 244373417 243703289 243053818 242481709 241688061 241187496 240263672 239197426 238583469 238237724
3217.2B38237724n89618j081887q01410o02322k46639j89553l15303r13849j458969
$$ 238237724 237648106 236566219 235764809 235162487 234915848 234726295 234410992 233497143 232038174
3225.8B32038174r94664l93123L12729m34227j194859j015835q97998o87562m36706
$$ 232038174 231043510 230650387 230963116 230528889 229334030 228318195 227420197 226732635 226295929
3234.5B26295929j98746o86455n63068n10693o26544n45903k91614L01189n57785q38680
$$ 226295929 226097183 225410728 224847660 224336967 223710423 223164520 222872906 223174095 222616310 221777630
3244.2B21777630o43673n47142l51448n78594n35241p94735m40540m53205o34575o18172
$$ 221777630 221133957 220586815 220235367 219656773 219121532 218326797 217886257 217433052 216798477 216180305
3253.8B16180305p24582j10626R1781j32541p90921p62748m88606m62665m89731m52652
$$ 216180305 215455723 215345097 215436878 215304337 214513416 213750668 213262062 212799397 212309666 211857014
3263.4B11857014o3820n26447l72143n13020l42216J27010o49013o05908l65486j5698
$$ 211857014 211793194 211266747 210894604 210381584 210039368 210166378 209517365 208911457 208545971 208530273
3273.1B08530273p30552q27122J96514l62282p98339o16570n4340n16777n02472J72348
$$ 208530273 207799721 206972599 207169113 206806831 206008492 205391922 205337582 204820805 204318333 204490681
3282.7B04490681j48335m23240p90806k42081r0771P7591p9021r39312m22039N1117
$$ 204490681 204342346 203919106 203128300 202886219 202795448 202873039 202794018 201854706 201432667 201483784
3292.4B01483784M3335o71120o78787l86467o12049n19905q9264N59787l90262l53432
$$ 201483784 201527119 200855999 200177212 199790745 199178696 198658791 198569527 199129314 198739052 198385620
3302A98385620O0196n93586n35812o57521l29532j51119l14198k99168J98136j39923
$$ 198385620 198445816 197852230 197316418 196658897 196329365 196178246 195864048 195564880 195763016 195623093
3311.7A95623093r55906j62392P8163l66821p80335l67279N2796m2114r6112q48522
$$ 195623093 194667187 194504795 194582958 194216137 193435802 193068523 193121319 193079205 192983093 192134571
3321.3A92134571o70948l02353L3455m92134q64964P1412j30597K518m49428o19622
$$ 192134571 191463623 191161270 191194725 190702591 189837627 189909039 189778442 189780960 189331532 188711910
3330.9A88711910j69849o64196k73533L1872L7193l51696p72552n94197l08532j67008
$$ 188711910 188542061 187877865 187604332 187636204 187673397 187321701 186549149 185954952 185646420 185479412
3340.6A85479412l07426k16160l93162p2269q2703m26731j56174m00982m63791k29931
$$ 185479412 185171986 184955826 184562664 184490395 184407692 183980961 183824787 183423805 182960014 182730083
3350.2A82730083j73282j82152q1158m84905p74803m03328j05476L02257M9267k9335
$$ 182730083 182556801 182374649 182293491 181808586 181033783 180630455 180524979 180827236 180876503 180847168
3359.9A80847168k23389q07991m11548j21727m44641m37451K10781P1526m56963q17852
$$ 180847168 180623779 179815788 179404240 179282513 178837872 178400421 178611202 178682728 178225765 177407913
3369.5A77407913q91666k26727r9754j29700l7155j05858l42483K3594N56678L8643
$$ 177407913 176516247 176289520 176189766 176060066 176022911 175917053 175574570 175598164 176154842 176193485
3379.2A76193485n42869q24070o1474K8553n30892k9315j09902q6594j91650j78375
$$ 176193485 175650616 174826546 174765072 174793625 174262733 174233418 174123516 174036922 173845272 173666897
3388.8A73666897K27051m05198n97324J07308K13565l27663l79334K5044l3150l45859
$$ 173666897 173893948 173488750 172891426 172998734 173212299 172884636 172505302 172530346 172497196 172151337
3398.4A72151337J602J4686j86996J25103Q2226L36895L42445K9106l03974q54511
$$ 172151337 172152939 172167625 171980629 172105732 172187958 172524853 172867298 172896404 172592430 171737919
3408.1A71737919n79853J15204M84829J78661l8166j7872j27277m0074K41833K4662
$$ 171737919 171158066 171273270 171758099 171936760 171898594 171880722 171753445 171713371 171955204 171979866
3417.7A71979866n34554K05021M60892L02391K37713l26328N6495J45455P0629n86433
$$ 171979866 171445312 171650333 172111225 172413616 172651329 172325001 172381496 172526951 172597580 172011147
3427.4A72011147n06955O50330K37369j3942K54287L45898n3005R708L71056R1858
$$ 172011147 171504192 172154522 172391891 172377949 172632236 172978134 172925129 172934837 173305893 173397751
3437A73397751J26953J63345L70388J20526L30581L46451k24380n1384J77383Q94108
$$ 173397751 173524704 173688049 174058437 174178963 174509544 174855995 174631615 174580231 174757614 175651722
3446.7A75651722R1057r4834M30241K45323Q64544M21314J77193m4784N8212O39744
$$ 175651722 175742779 175647945 176078186 176323509 177188053 177609367 177786560 177741776 177799988 178439732
3456.3A78439732J81427J51481K44827N59083L79467L73878P65152K31075j43051j82419
$$ 178439732 178621159 178772640 179017467 179576550 179956017 180329895 181095047 181326122 181183071 181000652
3466A81000652J64204L73306M68769J73226L61442R99890M91733K45609M56067M23088
$$ 181000652 181164856 181538162 182006931 182180157 182541599 183541489 184033222 184278831 184734898 185157986
3475.6A85157986L88775Q40721M25052l06587L42102P80621M04796l1433O65512O42968
$$ 185157986 185546761 186387482 186812534 186505947 186848049 187628670 188033466 188002033 188667545 189310513
3485.2A89310513K7656O38962J034717P09134K04677O36234O58055L14178J73455L223
$$ 189310513 189338169 189977131 191011848 191720982 191925659 192561893 193219948 193534126 193707581 193710804
3494.9A93710804O75888O40564M70734J87168O50654J313591N26256N07393J81770
$$ 193710804 194386692 195027256 195497990 195685158 196335812 197649403 198175659 198683052 198864822
3503.6A98864822r3917L73477Q84972J404038J311130K58732n00279N15366P35493
$$ 198864822 198770905 199144382 200029354 201433392 202744522 203003254 202502975 203018341 203753834
3512.2B03753834J013508O37035R2659Q05702P77435Q86269N36099M87213J009788
$$ 203753834 204767342 205404377 205497036 206302738 207080173 207966442 208502541 208989754 209999542
3520.9B09999542P90577L90778M49409J176281J083908R38473L94993K15435N48401
$$ 209999542 210790119 211180897 211630306 212806587 213890495 214828968 215223961 215439396 215987797
3529.6B15987797J107101J115589j84879K26936J166382J726704L67489j21765K013168
$$ 215987797 217094898 218210487 218025608 218252544 219418926 221145630 221513119 221391354 223404522
3538.3B23404522J601257M68884l87039Q67881J705208R00822L25680n15156J362839
$$ 223404522 225005779 225474663 225087624 225955505 227660713 228561535 228887215 228372059 229734898
3547B29734898J254882J985455J950779R20868J534061P4978J439247J324234J436386
$$ 229734898 230989780 232975235 234926014 235846882 237380943 237455921 238895168 240219402 241655788
3555.6B41655788J870785K70271J511994J238060Q58040Q38756J820107J390991Q19378
$$ 241655788 243526573 243796844 245308838 246546898 247404938 248243694 250063801 251454792 252274170
3564.3B52274170M028587P6695j241532J229306M88681L138009J897316J460361J714764
$$ 252274170 256302757 256379452 255137920 256367226 256855907 259993916 261891232 263351593 265066357
3573B65066357J767501J652184J685448J719742P76443K541561K104759R50432J524658
$$ 265066357 266833858 268486042 270171490 271891232 272667675 275209236 277313995 278264427 279789085
3581.7B79789085J927205J498889J419983M513512K029324r51882K067166N85651L451977
$$ 279789085 281716290 283215179 284635162 289148674 291177998 290226116 292293282 292878933 296330910
3590.4B96330910L234806K574978J799621J495781L075962p01675K318382L472424
$$ 296330910 299565716 302140694 303940315 305436096 308512058 307810383 310128765 313601189
3598.1C13601189Q06732L178997J990471J870136K882042J829605K092514L612633
$$ 313601189 314407921 317586918 319577389 321447525 324329567 326159172 328251686 331864319
3605.8C31864319L459663n72929K819023J97792O27556P332268Q91990j180267M278526
$$ 331864319 335323982 334751053 337570076 337767868 338395424 345727692 346619682 345439415 349717941
3614.5C49717941N56908M987984N146942o6223J28784o00701K501221M827461L494454
$$ 349717941 350274849 355262833 360409775 360343552 360472336 359871635 362372856 367200317 370694771
3623.1C70694771K811165L448181K521019L404999O555366j217651p724037M793586
$$ 370694771 373505936 376954117 379475136 382880135 389435501 388217850 380493813 385287399
3630.9C85287399N286026N358353J418648r21326L031158L667374K339897R80339K011109
$$ 385287399 390573425 395931778 397350426 396429100 399460258 403127632 405467529 406447868 408458977
3639.5D08458977K756920K684860J486740J419525L504868M725227O148605j149864
$$ 408458977 411215897 413900757 415387497 416807022 420311890 425037117 431185722 430035858
3647.3D30035858k897873N913735j697426k739830K555542O426315N175018M435273
$$ 430035858 427137985 433051720 431354294 428614464 431170006 437596321 442771339 447206612
3655D47206612L880348p034950K891044N407410J732025K317467J602478K998657K090988
$$ 447206612 451086960 444052010 446943054 452350464 454082489 456399956 458002434 461001091 463092079
3663.6D63092079J316033J701774K232628N090981K064704m45289O26755n671502M035302
$$ 463092079 464408112 466109886 468342514 473433495 475498199 475052910 475679665 470008163 474043465
3672.3D74043465R831733J0831910n97611k1786194N370178R818039N242310k028351
$$ 474043465 483875198 494707108 494109497 472323303 477693481 487511520 492753830 490725479
3680D90725479O96983L785248K513733J685105J134033J231270M929809P121086r526252
$$ 490725479 491422462 495207710 497721443 499406548 500540581 501771851 506701660 513822746 504296494
3688.7E04296494l226090Q970871n268097R70001O723404J613083J867409Q24318M09508
$$ 504296494 501070404 510041275 504773178 505743179 512466583 514079666 515947075 516771393 517180901
3697.4E17180901J738739R10263L395195L111953n884323j356582N985450K352982
$$ 517180901 518919640 519829903 523225098 526337051 520452728 519096146 525081596 527434578
3705.1E27434578L45764J167030L733864M801560p356377L765068L939018j4551086
$$ 527434578 527780342 528947372 532681236 537482796 530126419 533891487 537830505 523279419
3712.8E23279419N273285M099617L3913K498512M190483J815491l425942K430649P112808
$$ 523279419 528552704 532652321 532686234 535184746 539375229 541190720 537764778 540195427 547308235
3721.5E47308235l616333m769401N604477J514854m24194k107125J150513M199448
$$ 547308235 543691902 538922501 544526978 546041832 545617638 543510513 544661026 548860474
3729.2E48860474J384964O274337m566459p957459J1339989J687164j0607033p13615
$$ 548860474 550245438 556519775 551953316 543995857 555335846 557023010 546415977 545702362
3736.9E45702362K114868J062279L898201L901215l885498M453582J3009377j4149475
$$ 545702362 547817230 548879509 552777710 556678925 552793427 557247009 570256386 556106911
3744.7E56106911j7020264J2967148P870560P545738l179894j1857567J2209015p081146
$$ 556106911 539086647 552053795 559924355 567470093 564290199 552432632 564641647 557560501
3752.4E57560501p394524O829224N218582L928566n655212L465309O203575r923782
$$ 557560501 550165977 556995201 562213783 566142349 560487137 563952446 570156021 560232239
3760.1E60232239j093521N164108J956863J025582M186668l224640n084572M256630
$$ 560232239 559138718 564302826 566259689 567285271 571471939 568247299 563162727 567419357
3767.8E67419357N660858K69165j0046348K817955M607048R91859J350480q85392Q07877
$$ 567419357 573080215 573349380 563303032 566120987 570728035 571719894 573070374 572184982 572992859
3776.5E72992859J389198L088036j142006q173142L916588L306923K117653K690811
$$ 572992859 574382057 577470093 576328087 568154945 572071533 575378456 577496109 580186920
3784.2E80186920m018936j121597J932335J350631O68145n01290R97582Q40149M78515
$$ 580186920 576167984 575046387 576978722 578329353 578997498 578496208 579493790 580333939 580812454
3792.9E80812454o0806J620750L799591m203910l758316L698844N770569P385903j0429192
$$ 580812454 580751648 582372398 586171989 581968079 578209763 581908607 587679176 595065079 584635887
3801.5E84635887j2904854N990067M284286O415482O437416j2275696m600029O123047
$$ 584635887 571731033 577721100 582005386 588420868 594858284 582582588 577982559 584105606
3809.3E84105606K718811Q09059R34525L48739J464653N145112l051987j3859253O673889
$$ 584105606 586824417 587633476 588568001 588916740 590381393 595526505 592474518 578615265 585289154
3817.9E85289154O781502N834884K432480k3470039L419533Q406181L034973K483597
$$ 585289154 592070656 597905540 600338020 576867981 580287514 588693695 591728668 594212265
3825.7E94212265j247520m738274J665535L578720M303360J982994r174385L215332
$$ 594212265 592964745 588226471 589892006 593470726 597774086 599757080 590582695 593798027
3833.4E93798027Q135452q086548n22422J0174255r577332m375343P605019p372627
$$ 593798027 601933479 593846931 593324509 603498764 593921432 589546089 597151108 589778481
3841.1E89778481J338462Q641625k901268m312172L445816J698875J02082K159195
$$ 589778481 591116943 599758568 596857300 592545128 595990944 597689819 597791901 599951096
3848.8E99951096l98217L574486P959023m934883L050270j9770165k61879J1636124
$$ 599951096 599552879 603127365 611086388 606151505 609201775 589431610 589169731 600805855
3856.5F00805855k013092k335434K885589L868447L748321o712684J56173P671547
$$ 600805855 598792763 596457329 599342918 603211365 606959686 600247002 600403175 608074722
3864.2F08074722o952972o301079M477234O666565P656059r899750j0916214N564881
$$ 608074722 601121750 594820671 599297905 605964470 613620529 603720779 592804565 598369446
3871.9E98369446Q420601L947067j2813644J442947N602570J16882K188034N340538
$$ 598369446 606790047 610737114 597923470 599366417 604968987 605085869 607273903 612614441
3879.7F12614441o215324q286515P153206J010971J975937N598602j6013641K139091
$$ 612614441 606399117 598112602 605265808 606276779 608252716 613851318 597837677 599976768
3887.4E99976768N396576J436730N490379k85072r850044J562118M360047k184754
$$ 599976768 605373344 606810074 612300453 612015381 602165337 603727455 608087502 605902748
3895.1F05902748J054230J851196L131676K544517j0803527O273536J785164o624069
$$ 605902748 606956978 608808174 611939850 614484367 603680840 609954376 611739540 605115471
3902.8F05115471N860901l847122j167832L72200N63202K484474l41568N53093n5122
$$ 605115471 610976372 607129250 605961418 606333618 606896820 609381294 609039726 609592819 609537697
3911.5F09537697J43013L82957k19345J507836K366752m387359l787117O000671k18010
$$ 609537697 609680710 610063667 609844322 611352158 613718910 609331551 605544434 611545105 611327095
3920.2F11327095m267578L403549K379341J083298l466301l889847K157440K707100
$$ 611327095 607059517 610463066 612842407 613925705 610459404 606569557 608726997 611434097
3927.9F11434097K567101r01909j710014J441421k283745j442680J695938L15857P38068
$$ 611434097 614001198 613099289 611389275 612830696 610546951 609104271 610800209 611116066 611854134
3936.6F11854134N05981p26891j04560P1983J974182J947212l859977j133461J783256
$$ 611854134 612360115 611633224 611528664 611600647 613574829 615522041 611662064 610528603 612311859
3945.2F12311859J447296J552925k403526p477Q41484j995086J778869P6447j092339
$$ 612311859 613759155 615312080 612908554 612901077 613742561 611747475 613526344 613602791 612510452
3953.9F12510452Q13027L07884L18108n20821J44386P0839Q48503P38373k419624k69013
$$ 612510452 613323479 613631363 613949471 613428650 613573036 613643875 614492378 615230751 612811127 612542114
3963.6F12542114J095047j16310L01132R70230N01290j298866m54789J334915L26272
$$ 612542114 613637161 613520851 613821983 614792213 615293503 613994637 613539848 614874763 615201035
3972.2F15201035k63329J09100K10801J42059l52402L66745L38898l37944j20430q22067
$$ 615201035 614937706 615046806 615257607 615399666 615047264 615414009 615752907 615414963 615294533 614472466
3981.9F14472466p67632J48811M46129K22244M07677L84178K89803O10657q31948l12500
$$ 614472466 613704834 613853645 614299774 614522018 614929695 615313873 615603676 616214333 615382385 615069885
3991.5F15069885J123238N49393R2430l93563r6740j26076N12276Q59451k82059
$$ 615069885 616193123 616742516 616834946 616441383 616344643 616218567 616730843 617590294 617308235
4000.2F17308235
$$ 617308235
##END=$$ End of the data block
