##TITLE=$$ Begin of the data block
##JCAMP-DX=5.00 $$ ACD/SpecManager v 10.08
##SPECTROMETER/DATA SYSTEM=Varian
##DATE=20 Nov 2012 15:39:50
##DATA TYPE=INFRARED SPECTRUM
##DATA CLASS=XYDATA
##ORIGIN=
##OWNER=
##NPOINTS=3735
##FIRSTX=399.26403809
##LASTX=4000.35498047
##MAXX=4000.35498047
##MINX=399.26403809
##MAXY=79.93948364
##MINY=11.27510738
##XFACTOR=1.0000000000
##YFACTOR=0.000000100000000
##FIRSTY=40.61723709
##DELTAX=0.96440572
##XUNITS=1/CM
##YUNITS=TRANSMITTANCE
##XYDATA=(X++(Y..Y))
399.3D06172371k1348801j081314R788284N831986K520676k384758j1599389l445472
407C84453583J3863640L44276j2792816J049576Q585052K246666r304771o779900P794228
415.7C89459534O673546k895852l085060J5338631j395454j2339135n575943K357636
423.4C88537903l223534m636993k194367L248711M905434j711388l310814l681946
431.1C77933006l144340R96971O43806k833213j846085j362076j784248J65596p1259
439.8C68698158J044617j361313k63290N691185Q703766P273521R6474j420479j489220
448.4C86973419J757164M864006l665275k429734L998032P87849k957916j444588M695855
457.1C92578812L595008K80266J276284k925950m215049j577835j782341k41471n6648
$$ plain form
399.3 406172371 384823570 383742256 393530540 399362526 401883202 399498444 387899055 384453583
407 384453583 398317223 398661499 385868683 386918259 395503311 397749977 388445206 381665306 389459534
415.7 389459534 396133080 393237228 390152168 405490799 404095345 391756210 386180267 388537903
423.4 388537903 385314369 380677376 378483009 381731720 386637154 384925766 381614952 377933006
431.1 377933006 374788666 375785637 376429443 373596230 371750145 370388069 368603821 368769417 368698158
439.8 368698158 369742775 368381462 368118172 373809357 382513123 389786644 389883118 388462639 386973419
448.4 386973419 388730583 393594589 389929314 387499580 391497612 392285461 389327545 387882957 392578812
457.1 392578812 396173820 396454086 397730370 394804420 390589371 389011536 387229195 386987724 386931076
465.8C86931076l186531k928429l649215l786240j262703M254379N073853m158402
473.5C77287788l796730n391655j227150J190606j550293l142357k078553K741051
481.2C64032707k545662k076606L668670K68021l828011j443710J827660M9095N05218
489.9C60457382l881378j206093J639214k295799J680297m27742N63088K819099p03468
498.6C58644600l646660k796745M1733j315308N84183n88875j393356k764931l249016
507.3C43515625P03163j582069j206551q79440k076264l618316l025437j333847k121963
516C28374901l336716m100265K106552j409645n219803j171932J78070O72893k333088
524.6C13760967p61471o82811p34711k5177k652817P3128K585716K989025J325531
$$ plain form
465.8 386931076 383744545 380816116 377166901 373380661 372117958 376372337 381446190 377287788
473.5 377287788 373491058 368099403 366872253 368062859 366512566 363370209 361291656 364032707
481.2 364032707 361487045 359410439 363079109 363347130 359519119 358075409 359903069 359952164 360457382
489.9 360457382 356576004 355369911 357009125 354713326 356393623 355965881 356528969 359348068 358644600
498.6 358644600 354997940 352201195 352242928 350927620 351511803 350922928 349529572 346764641 343515625
507.3 343515625 344218788 342636719 341430168 340550728 338474464 334856148 331830711 330496864 328374901
516 328374901 325038185 320937920 323044472 321634827 316415024 315243092 315421162 316094055 313760967
524.6 313760967 312999496 312316685 311581974 311556797 308903980 308977108 311562824 314551849 315877380
533.3C15877380r14344K63271K932491K768555K423477J927719L13797L441048M608078
542C33641472J791763j84173O32019J753578J406746J541481q00667m70924J82037
550.7C39493332j050911j348457k109833l22228j136322k080574k333793j913491m85916
559.4C26711807j734047r19685l237572m324989k448216k709503k614727l080082k704506
568C02938480k887477k079220l208866k483845k296086l322353m49428k74792K082710
576.7B88019123J637535k02217P56283M201603N080509J786404K724952L323326L449173
585.4C10776691J406403K065182M086342K120399J861420K265510K901154J022873
593.1C28505974M37774M42696m29840l54080q35266R33723J81923j187477p24144m00925
$$ plain form
533.3 315877380 314963036 315226307 318158798 320927353 323350830 325278549 325592346 329033394 333641472
542 333641472 335433235 335249062 335881081 337634659 339041405 340582886 339782219 339311295 339493332
550.7 339493332 338442421 337093964 334984131 334661903 333525581 331445007 329111214 327197723 326711807
559.4 326711807 324977760 324058075 320820503 316495514 314047298 311337795 308723068 305642986 302938480
568 302938480 300051003 297971783 294762917 292279072 289982986 286660633 286211205 285936413 288019123
576.7 288019123 289656658 289454441 290210724 294412327 299492836 301279240 304004192 307327518 310776691
585.4 310776691 312183094 314248276 318334618 320455017 322316437 324581947 327483101 328505974
593.1 328505974 328943748 329386444 328956604 328602524 327767258 328700981 328882904 327695427 326971283 326570358
602.8C26570358K27318j70708R93195P7705p82699J2207K91366M16222O95724J171036
612.4C29501724m88968L59192J036377J252022L648720K925148Q71048J151085J811371
621.1C42067719P82852J962433K920112K004090O08215J97258L196564L389015J937675
629.8C59065933J496430J103325J492347J074753Q80814J31378N5237J249809Q05397
638.4C67355423r2888Q70628K056733J507225R33914Q72307Q73565J241494J865654
647.1C77484055L94783q92029Q26416J621322J094475P72972R56993O67611L97415
655.8C83324013N11970j2665J01967M95949n4512m73633J47934q468m32396P33032
665.4C84333191K649918O209602P709389n711747l016395j147309J58539P47757J920929
$$ plain form
602.8 326570358 326797676 326626968 327620163 327697868 326915169 326927376 327218742 327634964 328330688 329501724
612.4 329501724 329012756 329371948 330408325 331660347 335309067 338234215 339105263 340256348 342067719
621.1 342067719 342850571 344813004 347733116 349737206 350345421 350542679 353739243 357128258 359065933
629.8 359065933 360562363 361665688 363158035 364232788 365113602 365244980 365300217 366550026 367355423
638.4 367355423 367262535 368133163 370189896 371697121 372631035 373503342 374376907 375618401 377484055
647.1 377484055 377878838 376986809 377813225 379434547 380529022 381301994 382258987 382926598 383324013
655.8 383324013 383835983 383823318 383925285 384421234 384366722 383893089 384041023 384032555 383600159 384333191
665.4 384333191 386983109 393192711 400902100 395190353 392173958 391026649 391185188 391932945 393853874
674.1C93853874J527748J951256R32694k48070J574783J318474J98059N7526J270523
682.8D02436867R14993N0964K44370q1825M34570n52101J16501J168251O72111L56751
692.4D05761452j020088q13485j101799q63762j123123k623062j199951j067696j439476
701.1C94509010j771431j635704n46875j543808j616668j186333j247368o17104M0055
709.8C84383774O37817J999359K043610J565437L199768K679139K098846K792702K538948
718.5D03939400M001045L698120J159744K177239L125534L047981L942490L763313
726.2D28854866K942619K856446L874626L296966K047425K294655J640014J458588
733.9D49266205J797676J434021J765213K267342J649780Q40301J58997Q05511J305466
$$ plain form
674.1 393853874 395381622 397332878 398265572 398017502 399592285 400910759 401108818 401166344 402436867
682.8 402436867 403351860 403402824 403647194 403565369 403999939 403447838 403564339 404732590 405404701 405761452
692.4 405761452 404741364 403927879 402826080 401962318 400839195 398216133 397016182 395948486 394509010
701.1 394509010 392737579 391101875 390555000 389011192 387394524 386208191 384960823 384343719 384383774
709.8 384383774 385021591 387020950 389064560 390629997 393829765 396508904 398607750 401400452 403939400
718.5 403939400 407940445 411638565 412798309 414975548 418101082 421149063 425091553 428854866
726.2 428854866 431797485 434653931 438528557 441825523 443872948 446167603 447807617 449266205
733.9 449266205 451063881 452497902 454263115 456530457 458180237 459020538 459179535 459985046 461290512
742.6D61290512p29294j405906r85756j209603j603393j761551j645279j861115k565841
751.3D47522774l060036k117882l481025m385262k000656k637787l538437k031479
759D24270210k353286k351685j076202q35953o40030j64604l1128N17540J751289J495438
768.6D20581589J417351K850875L682557M309806M409905M021263M192963M260063
776.4D49726372M420395N122223N518760N284500M398270L861427L056794K829589
784.1D84218330L030472L299065L587036K277107K161637K225379K489129K227478
791.8E05515633K327652L010025J852035K673531K017288K369156K720947J084976
799.5E23571243K487641K622757K439308K092590K010498J477738J481056K136307
$$ plain form
742.6 461290512 460561218 459155312 458169556 456959953 455356560 453595009 451949730 450088615 447522774
751.3 447522774 444462738 442344856 438863831 434478569 432477913 429840126 426301689 424270210
759 424270210 421916924 419565239 418489037 417653084 417013054 416848450 416817322 417334862 419086151 420581589
768.6 420581589 421998940 424849815 428532372 432842178 437252083 441273346 445466309 449726372
776.4 449726372 454146767 459268990 464787750 470072250 474470520 478331947 481388741 484218330
784.1 484218330 487248802 490547867 494134903 496412010 498573647 500799026 503288155 505515633
791.8 505515633 507843285 510853310 512705345 515378876 517396164 519765320 522486267 523571243
799.5 523571243 526058884 528681641 531120949 533213539 535224037 536701775 538182831 540319138
807.2E40319138Q82606Q79440k69584l16277j45378M26560M62951q28705O04744J000557
816.9E43016052J170693l28026j85280k56500j879883k29874k73018n14373j879883
825.5E38639908j341934q51555k746926k760620k854614j948471k843781l212852l404884
834.2E16674271l294030k528762l263817k105484k546006k050285j748466k913819
841.9D96223602k384529k676163k064895k055779k545814k049446j308785j675720
849.6D79462471k066612j336861k408256k114449j264152k501145k881660k488594
857.4D62400742k479248k032662j121216l20816O07834J966057L877335M168243M355583
866D71421852O278572O480065O113662N609589O102753O442604N531578N728798M812126
$$ plain form
807.2 540319138 541201744 542081184 541811600 541495323 541349945 541776505 542239456 541410751 542015495 543016052
816.9 543016052 544186745 543858719 543673439 543416939 541537056 541307182 541034164 540519791 538639908
825.5 538639908 537297974 536446419 533699493 530938873 528084259 526135788 523292007 520079155 516674271
834.2 516674271 513380241 510851479 507587662 505482178 502936172 500885887 499137421 496223602
841.9 496223602 493839073 491162910 489098015 487042236 484496422 482446976 481138191 479462471
849.6 479462471 477395859 476058998 473650742 471536293 470272141 467770996 464889336 462400742
857.4 462400742 459921494 457888832 456767616 456446800 457054634 459020691 462898026 467066269 471421852
866 471421852 477700424 484180489 490294151 495903740 502006493 508449097 513980675 519709473 524521599
874.7E24521599M514160L546104K562714Q75969m00429p83005k218818j320648k463112
883.4E28834534k961006k869263l940811m130211l691368k554970l563004l864860
891.1E01259041m325791m412193m025383m496803l278771k564392k191353k224159
898.8D73740196k425995k490234k426529k158318l020324l864212m182282l783722
906.5D49388580m238701m313964l930550m943886n158005m748153m996453n619545
914.3D11439323n827903o004868o031837n487023m625358m002686l495483k494202
922C73469963j836471j996346p71408J77994n91736n11055p22580J26839Q65326P04498
931.6C68915024J202316P60841Q88329J301270J724662K014504K421150K415161J602173
$$ plain form
874.7 524521599 529035759 532581863 535144577 536020546 535620117 534837112 532618294 531297646 528834534
883.4 528834534 525873528 523004265 519063454 514933243 511241875 508686905 505123901 501259041
891.1 501259041 496933250 492521057 488495674 483998871 480720100 478155708 475964355 473740196
898.8 473740196 471314201 468823967 466397438 464239120 461218796 457354584 453172302 449388580
906.5 449388580 445149879 440835915 436905365 431961479 426803474 422055321 417058868 411439323
914.3 411439323 405611420 399606552 393574715 388087692 383462334 379459648 375964165 373469963
922 373469963 371633492 369637146 368865738 369043732 368451996 367940941 367218361 367345200 368210526 368915024
931.6 368915024 370117340 370878181 371766510 373067780 374792442 376806946 379228096 381643257 383245430
940.3C83245430K619934L440323K824326J648750N09224L48930J54839j206284k858620
949C90726852l509368m289284n471382o138878o848603o811485o912269p501908p986564
957.7C35257111p777672p573185p583313p501507q550282q284835q072434p732677
965.4B72181206q620034r080276p881794r143963q844662r091587q507499q305054
973.1B02706337q141537o991043q119831p279816p979889o679973n425968n159359
980.8A46928921n216093n758458l482284l971386k403002k633419k184563j411647
988.5A19868069k034874j0109j211844N8823m16308o52828m31957n58748M97598n30262
998.2A14577560J344033Q9311K88496L05672N0735N02978j090374J040316l08161p13225
$$ plain form
940.3 383245430 385865364 389305687 392130013 393778763 394287987 394636917 394791756 393585472 390726852
949 390726852 387217484 382928200 377456818 371317940 364469337 357657852 350745583 343243675 335257111
957.7 335257111 327479439 319906254 312322941 304821434 296271152 287986317 279913883 272181206
965.4 272181206 263561172 254480896 246599102 237455139 228610477 219518890 211011391 202706337
973.1 202706337 194564800 187573757 179453926 172174110 164194221 157514248 152088280 146928921
980.8 146928921 141712828 135954370 132472086 128500700 126097698 123464279 121279716 119868069
988.5 119868069 117833195 117823086 116611242 116670065 116253757 115600929 115168972 114610224 115107822 114577560
998.2 114577560 115921593 116010904 116299400 116605072 116655807 117158785 116068411 117108727 116800566 116087341
1007.8A16087341r12513n99385L3741o45952L88756r09195M36268r24073k03914P85684
1017.5A13536758K0895R17035j097451J092158K92520O21634J198053N97382J567993
1026.1A18746977L40357J871710Q83884J792335N26906J69048J349497j37997J844168
1034.8A27386885P63502J622457n1956J81246J373110q96158L26776o26621R45959
1043.5A31025200K37760M64659M58470k63157J080808j90048J567888L1710J586542
1052.2A35999832J925211Q66385K068243J185169L107414J643047K916689K926379
1059.9A52638369L340311M303169L055077L987388K859936M585838K091351J505584
1067.6A78367023J659375n07622n74169m126625m346123m867363k831059k253303k867003
$$ plain form
1007.8 116087341 115174828 114575443 114609184 113963232 114351988 113442793 113879061 112954988 112751074 113536758
1017.5 113536758 113557653 114474688 113377237 114469395 114761915 115383549 116581602 117178984 118746977
1026.1 118746977 119087334 120959044 121842928 123635263 124162169 124331217 125680714 125542717 127386885
1034.8 127386885 128150387 129772844 129720888 129902134 131275244 130379086 130705862 130079241 131025200
1043.5 131025200 131262960 131727619 132186089 131922932 133003740 132813692 134381580 134413290 135999832
1052.2 135999832 137925043 138791428 140859671 142044840 145152254 146795301 149711990 152638369
1059.9 152638369 155978680 160281849 163336926 167324314 170184250 174770088 176861439 178367023
1067.6 178367023 180026398 179518776 178944607 174817982 170471859 165604496 162773437 160520134 157653131
1076.3A57653131j879997k607794L86687p75023P94249J062250Q25558J368932R45406
1085A57773399L258381Q41561K344551J889248K283134K714901J663818L720951K024460
1093.6A78514404L259507J318645J158829J846790R60255J455459L8433J754208M67319
1102.3A90773849M37069q14857j03054J671829k87189J271381N17120K742787K335357
1111A98544292J790657K353631R93690K780170J315899J875992J120167J391869J942615
1119.7B14108982J228542K010251K12516J336632R10893J810092J896554J039810J818638
1128.4B26372910J282997K503795J156636K260532K192230J641922J544628l97224
1136.1B38558426K61497j399917j194649k074890l192043k902356l242588l014927
$$ plain form
1076.3 157653131 155773134 153165340 153552027 152777004 153571253 154633503 155459061 156827993 157773399
1085 157773399 161031780 161873341 164217892 166107140 168390274 171105175 172768993 176489944 178514404
1093.6 178514404 181773911 183092556 184251385 186098175 187058430 188513889 188552322 190306530 190773849
1102.3 190773849 191210918 190396061 190293007 191964836 191677647 192949028 193466148 196208935 198544292
1111 198544292 200334949 202688580 203682270 206462440 207778339 209654331 210774498 212166367 214108982
1119.7 214108982 215337524 217347775 217560291 218896923 219807816 221617908 223514462 224554272 226372910
1128.4 226372910 227655907 230159702 231316338 233576870 235769100 237411022 238955650 238558426
1136.1 238558426 238819923 237420006 236225357 234150467 230958424 228056068 224813480 221798553
1143.8B21798553m009494k294731l420449k847881k660275l333206j516933k372208
1151.5A99343376p66201j685123j238785r97791r21955L24726j34411J696510L79314
1160.2A95999660J200352J341152K074109L186874K683258M102821L253174M961758
1167.9B18803158M971885N502244N864124O030865P291564O206704P470112P063121
1175.6B69203777P709351P048473O267853P549515O891689P187271O945381P042599
1183.3C25845909O426048O159249N947304N401573N166282L955002L413124K818108
1191C65132599L054275K301026J335487J597099J305199Q51174K7008Q41674J027413
1199.7C77472954J78146L72315N01747N30815J06125Q92677J534767J389923J547928
$$ plain form
1143.8 221798553 217789059 215494328 212073879 209225998 206565723 203232517 201715584 199343376
1151.5 199343376 198577175 196892052 195653267 194655476 193733521 194058247 193923836 195620346 195999660
1160.2 195999660 197200012 198541164 200615273 203802147 206485405 210588226 213841400 218803158
1167.9 218803158 223775043 229277287 235141411 241172276 248463840 254670544 262140656 269203777
1175.6 269203777 276913128 283961601 290229454 297778969 304670658 311857929 318803310 325845909
1183.3 325845909 332271957 338431206 344378510 349780083 354946365 358901367 362314491 365132599
1191 365132599 368186874 370487900 371823387 373420486 374725685 375576859 375603867 376445541 377472954
1199.7 377472954 377651100 378023415 378525162 379055977 379162102 380054779 381589546 382979469 384527397
1208.4C84527397J781044J996994K171593K746048K305794K022781K086601J874199
1216.1D01512451J523209J181068J478081J084518K37503O19851R84573J24702j27868
1224.8D08618088k78321p85064j031380j424217j213989j234627j391602j086082r53293
1233.5C99219513p70035r04465o76307p12815o46591l26996p97386m40254l96004m42466
1243.1C93106194N1994L75824N01098M34037J158142J199989N82314N45540J126365
1251.8C99081497J402130J005249Q59299O79970N94482O48346O50292R50813R09157
1260.5D06781235N15403Q78182P48520N95550J172028J011581R25560R62563J335449
1269.2D14926071J478882J103439J170082J074448R39484O92177P23724K77786k16217
$$ plain form
1208.4 384527397 386308441 388305435 390477028 393223076 395528870 397551651 399638252 401512451
1216.1 401512451 403035660 404216728 405694809 406779327 407016830 407636681 408621254 408745956 408618088
1224.8 408618088 408339767 407554703 406523323 405099106 403885117 402650490 401258888 400172806 399219513
1233.5 399219513 398449478 397545013 396868706 396155891 395509300 395182304 394384918 393944664 393548660 393106194
1243.1 393106194 393158188 393534012 394035110 394469147 395627289 396827278 397409592 397955132 399081497
1251.8 399081497 400483627 401488876 402348175 403028145 403622627 404270973 404921265 405872078 406781235
1260.5 406781235 407296638 408174820 408923340 409518890 410690918 411702499 412628059 413590622 414926071
1269.2 414926071 416404953 417508392 418678474 419752922 420692406 421384583 422108307 422386093 422169876
1277.8D22169876l42026j69220K21177j33820k51846m26407k61650K30674J71013j81617
1287.5D21026154k67907j60217n82313p85599j182251j013985j018944j244278o58454
1296.2D14112206o75889p18803j168022j315842j253357j512718j436424j378479o42395
1304.8D04010277q76007j492462j010399n25093o01807j046791p88536j088562j508370
1313.5C95072250j546287j614685j068917j234703j196327j261368j157455m55399
1321.2C85537109r23462q78601j093444j911774k232132k583351k449646k446633k465858
1329.9C68552208k527390k160224j627961j523132j115646j303864r19571o80885n83115
1338.6C56110420p66983r05571l61709l71514L38593J18446J96152J73721J97182K75192
$$ plain form
1277.8 422169876 421827850 421658630 421879807 421745987 421494141 421067734 420806084 421036758 421207771 421026154
1287.5 421026154 420758247 420598030 420015717 419230118 418047867 417033882 416014938 414770660 414112206
1296.2 414112206 413436317 412717514 411549492 410233650 408980293 407467575 406031151 404652672 404010277
1304.8 404010277 403134270 401641808 400631409 400106316 399504509 398457718 397669182 396580620 395072250
1313.5 395072250 393525963 391911278 390842361 389607658 388411331 387149963 385992508 385537109
1321.2 385537109 384613647 383735046 382641602 380729828 378497696 375914345 373464699 371018066 368552208
1329.9 368552208 366024818 363864594 362236633 360713501 359597855 358293991 357374420 356693535 356110420
1338.6 356110420 355343437 354437866 354076157 353704643 354043236 354161682 354357834 354531555 354728737 355003929
1348.2C55003929k03056K36091l68919n44281r45702o29692m80346j114197l18375
1356.9C50635452p35817m43306m72145m75158q46062j433334n02396o31790M5089r65271
1366.6C44175262q09860q40645j003875N47828K03858J191215L25279M47960R88007
1375.2C45225029N22461R94186J62964J269684N06172Q22220R47990M96712J377411
1383.9C52324829J577454K403259J411591K082634J743087J720352J587677N70527
1391.6C65421410P74231J64604K5177p97081P62977M93508J06354p82471j681557L84407
1401.3C64871559q28056p08580q79593k037239r99451o49261l35999j254310m07982
1409.9C56771088p54433m63638j59455r26208n00946j402245k90413p06443l44773
$$ plain form
1348.2 355003929 354800873 355036964 354668045 354123764 353178062 352548370 352068024 350953827 350635452
1356.9 350635452 349899635 349456329 348984184 348509026 347662964 346229630 345727234 345095444 345140533 344175262
1366.6 344175262 343365402 342524757 341520882 342068710 342272568 343463783 343789062 344237022 345225029
1375.2 345225029 345747490 346741676 346904640 348174324 348680496 349502716 350450706 350947418 352324829
1383.9 352324829 353902283 356305542 357717133 359799767 361542854 363263206 364850883 365421410
1391.6 365421410 366195641 366360245 366385422 365588341 366351318 366844826 366951180 366168709 364487152 364871559
1401.3 364871559 364043503 363334923 362455330 360418091 359418640 358769379 358433380 357179070 356771088
1409.9 356771088 356016655 355553017 355393562 354467354 353966408 352564163 352273750 351567307 351222534
1418.6C51222534j550026k06184J894684R6931O05698q11768P27387J042175j81847
1427.3C52839584P97997j65672P18536N23453J851921J154861O16455J893387O61888
1436C60892410N19562l03764K452163J044388M09813R74007M32358J831703L63769
1444.7C68616409J371918P03697P03583r9182m08096R10186j338615k76070j262359
1453.3C68921471M7340l73039j554566p6332l714637M292831l76549J799660N88722
1462C69554901P12853K685394l47633K863426J443405M272880L174286M168587N834656
1470.7C94362755N145531Q241958J110001O992721L738556N553208N225296L372039
1478.4D33742065N266571L850518N727882L557549M835739M099235L617401M920617
$$ plain form
1418.6 351222534 349672508 349466324 351361008 351457939 352063637 351251869 351979256 353021431 352839584
1427.3 352839584 353637581 353471909 354190445 354713898 356565819 357720680 358337135 360230522 360892410
1436 360892410 361411972 361108208 363560371 364604759 365014572 365988579 366420937 368252640 368616409
1444.7 368616409 369988327 370692024 371395607 371296425 370888329 371798515 370459900 370183830 368921471
1453.3 368921471 368968811 368595772 367041206 366964874 363250237 367543068 367166519 368966179 369554901
1462 369554901 370267754 372953148 372605515 375468941 376912346 381185226 384359512 388528099 394362755
1470.7 394362755 399508286 407750244 408860245 415852966 419591522 425144730 430370026 433742065
1478.4 433742065 439008636 442859154 448587036 452144585 456980324 461079559 464696960 469617577
1486.1D69617577K302169M597512J660347K578201J541176L333130M101638K502099
1493.8D92233849M244422J520539J722488K956047K270241J091614K080841K840500
1501.6E10960541O31256K572517J749192J407775k663879k39677N696373Q21457L230743
1510.2E24166298J797447J817169m02298J883278J643753j068L440819k930565L753815
1518.9E35168648K776832j067657L75938J021767M836616J337700j15242j88865J514015
1527.6E45659752P62749N38177K006836J60713J325836r81941n65414K112655P14875
1536.3E51734238J797981J580276j583786r568100O996651K422066j619721K328263
1544E54087868l21198n03425J249466J174087O08635r18312k677803N8021J300583
$$ plain form
1486.1 469617577 471919746 476517258 478177605 480755806 482296982 485630112 489731750 492233849
1493.8 492233849 496478271 497998810 499721298 502677345 504947586 506039200 508120041 510960541
1501.6 510960541 511591797 514164314 515913506 517321281 514657402 514417725 520114098 520935555 524166298
1510.2 524166298 525963745 527780914 527378616 529261894 530905647 530904579 534345398 531414833 535168648
1518.9 535168648 537945480 536877823 537253761 538275528 543112144 544449844 544334602 544145737 545659752
1527.6 545659752 546422501 546960678 548967514 549128227 550454063 549472122 548906708 551019363 551734238
1536.3 551734238 553532219 555112495 553528709 543960609 550957260 553379326 551759605 554087868
1544 554087868 553766670 553263245 554512711 555686798 556295433 555377121 552699318 552757339 554057922
1552.7E54057922L94364k076149j140061K509957K506370j1243591n769692K837906
1560.4E42077026K845192P38144n874m69551l191109q86688L56750M66843n4932o456871
1570E35418930n39856J62010j250076r66835J23291r84879q215332N23758L79868j58119
1579.7E24492760k63863j131172j092682j652527j343651j732788j287880j411285
1587.4E14576912j639443j003379j720429r81788j428643j005096j241532j724624
1595.1E03831978j314087k002068j383857k206612j486473j742287j986694j762428
1602.8D89947472k192040r67560j413383p79495k187272j561317k055664k852364q28056
1611.5D75110321k171974j063843j757126l98903j073761o621055J261787m53567k91138
$$ plain form
1552.7 554057922 554452286 552376137 551236076 553746033 556252403 545008812 539239120 542077026
1560.4 542077026 544922218 545660362 545654488 545184937 541993828 541107140 541463890 541930733 541875801 535418930
1570 535418930 534879074 535041084 533791008 532824173 532947464 531962585 523747253 524271011 524650879 524492760
1579.7 524492760 524228897 523097725 522005043 520352516 519008865 517276077 515988197 514576912
1587.4 514576912 512937469 511934090 510213661 509231873 507803230 506798134 505556602 503831978
1595.1 503831978 502517891 500515823 499131966 496925354 495438881 493696594 491709900 489947472
1602.8 489947472 487755432 486787872 485374489 484594994 482407722 480846405 478790741 475938377 475110321
1611.5 475110321 472938347 471874504 470117378 469718475 468644714 462023659 463285446 462831879 462540741
1620.2D62540741j534843j58806j359482m820061L76015m26979N57480j940728j884040
1628.9D51349297l29590l46833k39105j090431N89409M62456l005524k197380J377525
1637.5D46569824m05769K53982Q97255p42607R07212l21961J523438J984329j541519
1646.2D49124184M01039k04125K878495J934547L202896L104019p8964l408279J180343
1654.9D58134155M322624K685357K205467J761894K457085K292328K470092K683716
1662.6D79012718J094704L155289K580566K956810K948837K883797J511421K061348
1670.3D98205490M325523K703362L835411M193688L290214P74841L067093L534317
1678E23929939L242646L591728J657715L661117M214287J819458J95389M418792N581360
$$ plain form
1620.2 462540741 461005898 460847092 459487610 454667549 455043564 454616585 455174065 453233337 451349297
1628.9 451349297 451019707 450672874 450433769 449343338 449932747 450395203 447389679 445192299 446569824
1637.5 446569824 446164055 446418037 447315292 446572685 447479897 447157936 448681374 450665703 449124184
1646.2 449124184 449525223 449321098 452199593 454134140 457337036 460441055 460362091 456953812 458134155
1654.9 458134155 462456779 465142136 467347603 469109497 471566582 473858910 476329002 479012718
1662.6 479012718 480107422 483262711 485843277 488800087 491748924 494632721 496144142 498205490
1670.3 498205490 502531013 505234375 509069786 513263474 516553688 517328529 520395622 523929939
1678 523929939 527172585 530764313 532422028 536083145 540297432 542116890 542312279 546731071 552312431
1686.7E52312431M159966K377090K528725K442322K697563L238563K556344L597374
1694.4E75910378L524856k062836L790245M429398N920715R84841o163483N345116
1702.1E91679230L273048J408920N05600J914559l29285J359215K616730J623153P55463
1710.8F04806633R03854J832734J476554r76142k009659K999382K298202o886291K452011
1719.5F06897278K708359J377258P87086N14069K61192J016007P22580k04506N22461
1728.2F14601784Q89282r31091r22776K829018L239861l223610m827538L897820L318405
1736.9F18871155J071472K162209k67716k564278L166123J981697k98233J149902L383751
1745.5F28656082K510071J625748K136612M83551L186264N02319J80435L836746K229386
$$ plain form
1686.7 552312431 556472397 558849487 561378212 563820534 566518097 569756660 572313004 575910378
1694.4 575910378 579435234 577372398 581162643 585592041 591512756 592497597 586334114 591679230
1702.1 591679230 594952278 596361198 596866798 598781357 598452072 599811287 602428017 604051170 604806633
1710.8 604806633 605710487 607543221 609019775 608043633 606033974 609033356 611331558 604445267 606897278
1719.5 606897278 609605637 610982895 611769981 612284050 612545242 613561249 614283829 614079323 614601784
1728.2 614601784 615491066 614559975 613637199 616466217 619706078 616482468 611654930 615552750 618871155
1736.9 618871155 619942627 622104836 621837120 619272842 622438965 624420662 624122429 625272331 628656082
1745.5 628656082 631166153 632791901 634928513 635412064 638598328 639100647 639281082 643117828 645347214
1754.2F45347214K524032L107376P83692J635589L159638K670975L202514k65960k38953
1762.9F61926117L115845J540832J606140K020645J659546o97937K589569M446106
1770.6F78206863J014710o53916j723098L052978J668396r54513J734008L82309J249237
1779.3F83976974P76444l48434J475296K262420J828842m44183K10953O86569L68118
1788F90792999K15683P45163M02832L95279j464996l37219L928222J448059j73340
1796.7F95952682J393281J679458k3422k113342J021270j043090j31989J736984R57337
1805.3F99429169J154175P04269R93805J102829J260147j066208m70505L28598m29535
1814G03006744M17405j41602O70242K09198J058808J746444R51004J102906n51682
$$ plain form
1754.2 645347214 647871246 650978622 651762314 653397903 656557541 659228516 662431030 662165070 661926117
1762.9 661926117 665041962 666582794 668188934 670209579 671869125 671171188 673760757 678206863
1770.6 678206863 679221573 678567657 676844559 679897537 681565933 680611420 682345428 682727737 683976974
1779.3 683976974 684753418 684404984 685880280 688142700 689971542 689527359 689738312 690424881 690792999
1788 690792999 691008682 691753845 692156677 692551956 691086960 690749741 694677963 696126022 695952682
1796.7 695952682 697345963 699025421 699001999 696888657 697909927 696866837 696734848 698471832 699429169
1805.3 699429169 700583344 701287613 702281418 703384247 704644394 703578186 703107681 703436279 703006744
1814 703006744 703424149 703282547 703952789 704161987 705220795 706967239 707918243 709021149 708469467
1822.7G08469467Q09860R40247k938156j254654J335068J770095l78494k571640J546555
1831.4G07728348L083267R16443N84488L09067m94996p49893j153564O85501l83988
1840.1G10524673J93177P12967J184539J334534l308334J830292J451950J22604l34168
1848.7G13712234k39410K49252j372222l43171P325P32498Q41903N66864Q66394K79999
1858.4G15301666P92084j23367n00412j323853n83572N0506J65024J117935k92434
1867.1G14603577J162338K9449o84356J247711Q65097L51944j007767k73743m99115
1875.7G15795135l13415j77231m806J189880J062393J260910K41471N32684n4932o57196
1885.4G18874893k46963p05033P69883m89426j756897Q28247J817398R22165R27734
$$ plain form
1822.7 708469467 709279327 710219574 707281418 706026764 707361832 709131927 708753433 706181793 707728348
1831.4 707728348 710811615 711728058 712312546 712621613 712126617 711376724 710223160 710908661 710524673
1840.1 710524673 710717850 711430817 712615356 713949890 710641556 712471848 713923798 714046402 713712234
1848.7 713712234 713472824 713722076 712349854 712006683 712014008 712746506 713588409 714155273 715021667 715301666
1858.4 715301666 716093750 715970383 715469971 714146118 713562546 713613052 713778076 714896011 714603577
1867.1 714603577 715765915 715795364 715111008 716358719 717223816 717575760 716567993 716294250 715795135
1875.7 715795135 715481720 715304489 715299683 716489563 717551956 718812866 719054337 719587021 719532089 718874893
1885.4 718874893 718627930 717922897 718692780 718203354 716446457 717274704 719092102 720014267 720942001
1894.1G20942001O92902q68301M91104l64228o43997n34515o68106O0882k5253Q89587
1903.7G19972076J69449Q52585J108017L04489J8387q27560q37479j087418R9564l67737
1913.3G19404373J94397Q15506N26505J761779r85183l77655J234131M51126O3018
1922G23087997j644744j394425k84042J76925R9259P66067Q09937P55539P42264M41818
1931.7G23556595Q30536p97806q87375r09653p92617k35138k89078L92532K6169J546478
1941.3G22440643O98014r73511J199798Q10242l76358q65860j87225n79605n60685
1950G21605453o0119m730M73251O20422J086502M32053L93753J51520j3962k91519
1959.6G24392624r88083m78744p09458K61841N88455P83463J098861J18180K75192
$$ plain form
1894.1 720942001 721634903 720766602 721257706 720893478 720249481 719714966 719046860 719107742 719082489 719972076
1903.7 719972076 720141525 720994110 722102127 722406616 722425003 721597443 720759964 719672546 719772110 719404373
1913.3 719404373 719598770 720414276 720940781 722702560 721717377 721339722 722573853 723024979 723087997
1922 723087997 721443253 720048828 719764786 719941711 720040970 720807037 721616974 722372513 723114777 723556595
1931.7 723556595 724387131 723589325 722701950 721792297 720999680 720764542 720475464 720867996 720894165 722440643
1941.3 722440643 723138657 722165146 723364944 724175186 723798828 722932968 722745743 722166138 721605453
1950 721605453 721545334 721540604 722013855 722634277 723720779 724152832 724546585 724698105 724684143 724392624
1959.6 724392624 723404541 722925797 722216339 722478180 723066635 723850098 724948959 725067139 725342331
1968.3G25342331K05307M1809m97513j60827m39835n58624K0370l54156M64248J78986
1978G24242096M45785O60630L36609M97436l54385n09262o09360k96936l35083J60293
1987.6G24237823Q3466j23444J189652K83432l42941J30539L19595k28195n49469k36664
1997.2G24763794m94309q5601j52817N72510L83987K4796K24609k87170P6294m24653
2006.9G24601440p2555l42178o52619k96936n28412K5330j19324M22974J93710j50070
2016.5G23081360j15128l95889l67584q80280m18777n88074k08435J67160J42670K1667
2026.2G20438690l73688M62800k24305k23007k02179p01904n99442p56454k63596n53512
2035.8G17003403n1880K69623K31323M07867L12653l57132r42154N9204p92770p30667
$$ plain form
1968.3 725342331 725547638 725589447 725091934 724931107 724491272 723932648 723953018 723598862 724063110 724242096
1978 724242096 724687881 725348511 725685120 726182556 725828171 725318909 724709549 724412613 724077530 724237823
1987.6 724237823 724321289 724197845 725387497 725670929 725327988 725458527 725778122 725549927 725000458 724763794
1997.2 724763794 724269485 724183884 724031067 724603577 724987564 725012360 725236969 724949799 725026093 724601440
2006.9 724601440 724528885 724186707 723534088 723237152 722708740 722734070 722614746 723037720 723231430 723081360
2016.5 723081360 722966232 722570343 722202759 721322479 720903702 720315628 720107193 720274353 720417023 720438690
2026.2 720438690 720065002 720527802 720303497 720080490 719878311 719176407 718576965 717820511 717556915 717003403
2035.8 717003403 716951523 717221146 717452469 717860336 718172989 717815857 716873703 716932907 716140137 715409470
2045.5G15409470l55683m95300J23672j60369O50787K91748J63498L77426J61057N8975
2055.1G16225281n82047m2572l98788l41645l54156k72522K37427L29208R47037Q5449
2064.7G15832672N3101L34701J78375k25143n89371l15323o65588n8823M9057K20185
2074.4G14813843K07519L89633Q58002J42288J91956j60904n6229n28946p99789m21448
2084G14635925l41339M43726P8277O80237O67801K3651j83410j12229N07202k19803
2093.7G16180038J221k93274l08838k91900m83475P30896M07715L41949L77579L45001
2103.3G17006912o86m18396j08796k10800Q7433j40152J10169J36642O8207K3269l9062
2113.9G16514740L80402j18714K56653R232m4327k0523l85819Q9798q4457J41449j13144
$$ plain form
2045.5 715409470 715053787 714558487 714682159 714521790 715172577 715464325 715627823 716005249 716166306 716225281
2055.1 716225281 715643234 715600662 715201874 714860229 714506073 714233551 714470978 714800186 715747223 715832672
2064.7 715832672 715885773 716220474 716398849 716173706 715584335 715269012 714603424 714544601 714593658 714813843
2074.4 714813843 715021362 715410995 716268997 716411285 716603241 716442337 716386108 715857162 715057373 714635925
2084 714635925 714294586 714738312 714816589 715496826 716164627 716188278 716004868 715892639 716399841 716180038
2093.7 716180038 716181259 715887985 715579147 715287247 714803772 715534668 715942383 716284332 716661911 717006912
2103.3 717006912 717006226 716587830 716479034 716268234 716355667 716215515 716325684 716462326 716530533 716553802 716514740
2113.9 716514740 716895142 716776428 717033081 717042313 716997986 716977463 716591644 716681442 716596985 716738434 716625290
2124.5G16625290K76337J32751l33786J02768j51062J90201j58081j59073l95661m8599
2134.2G16081085P61109j00174k56882M3564M84314j89820j20163P0496k93350L41186
2143.8G16821365j04675k32239n14450L36228O97021j86615j48697j95541O40716j30386
2153.5G16982727j98975L46070l14102O1340K01797J61667Q3390O80389L50189l2577
2163.1G18321915p1869l34854K86026J19171N83725K38342m5090K96250J83563O19888
2172.8G20197067M42505M28925k35062M8523K70615K00424P75299l204O5994R5291
2182.4G22286377J90582J29929L68957N96695K6551M09545j8310K85797J40305l3493
2192G24382935N61447O2790N4245J26495N05753J90429M24423M43650j63498L43551
$$ plain form
2124.5 716625290 716901627 717034378 716700592 716803360 716652298 716842499 716684418 716525345 716129684 716081085
2134.2 716081085 716842194 716742020 716485138 716528702 717013016 716823196 716703033 716773529 716480179 716821365
2143.8 716821365 716716690 716484451 715970001 716306229 717003250 716816635 716667938 716472397 717113113 716982727
2153.5 716982727 716783752 717129822 716815720 716877060 717078857 717240524 717323914 718004303 718354492 718321915
2163.1 718321915 718250046 717915192 718201218 718320389 718904114 719142456 719097366 719393616 719577179 720197067
2172.8 720197067 720639572 721068497 720833435 720881958 721152573 721352997 722128296 722125092 722191086 722286377
2182.4 722286377 722476959 722606888 722975845 723572540 723599091 724008636 723990326 724276123 724416428 724382935
2192 724382935 724944382 725007172 725061417 725187912 725693665 725884094 726308517 726752167 726588669 726932220
2201.7G26932220K06604K12632p7286M4708J8463L03345N10254j71890N00717L54004
2211.3G28833771M30755O7978m6158O06156J43509L25241o104r2010k54059J76620
2221G30185699L80021m6235M70810j7318K57644J45569k2964M03518K42920m8141k37427
2231.6G31714096N06516N1498k56653N3101M74930K07748k20413N66101J12686K32773
2241.2G33442383J24206J45569R3765m09927R6817l79562K3422K49939N01327M47083
2250.9G34335022J20163K94571j21613O11420J31073J80893K212m03289J33361l17764
2260.5G34966049L76587Q5755L52020L60794L28369Q92181k4643K97471m426L8605
2270.2G37668762k53067j28326J22528n50308L09524K20566P98645K76794j2054K4261
$$ plain form
2201.7 726932220 727138824 727351456 727274170 727318878 727337341 727640686 728150940 727979050 728479767 728833771
2211.3 728833771 729264526 729332504 729286346 729892502 730036011 730361252 730355148 730263138 730009079 730185699
2221 730185699 730565720 730519485 730990295 730972977 731230621 731376190 731353226 731756744 731999664 731951523 731714096
2231.6 731714096 732220612 732272110 732015457 732068558 732543488 732751236 732530823 733096924 733209610 733442383
2241.2 733442383 733566589 733712158 733805923 733395996 733492813 733113251 733136673 733386612 733887939 734335022
2250.9 734335022 734455185 734749756 734628143 735239563 735370636 735551529 735553741 735150452 735283813 734966049
2260.5 734966049 735342636 735428391 735780411 736141205 736469574 737361755 737337112 737634583 737630157 737668762
2270.2 737668762 737415695 737287369 737409897 736859589 737169113 737389679 738188324 738465118 738453064 738477325
2279.8G38477325o79550J73722p05872l23257m4022L49426O06232m8294J285782P71866
2289.4G39863358R02862N45044K57111Q03375J10016P21435k38266L3417M92249N43823
2299.1G44034424J041565K93274J052856N94788Q64792J537323J122055J295395P56759
2307.8G52593231P26700J98746O53000Q00399Q42591J322403M9514Q08945J369248
2316.4G59364777J721267K318650K044754K707595J237565J67999J028747J457749
2324.2G72049103Q35571N17883J772766J984711K347565R90753n7754K98843p45773
2332.8G79993668o25153j219101J706467K974014l74908M07333J029968J334992j47248
2341.5G85080032q12072k27356j006623k337112n007629p057648p332306J99890O819077
$$ plain form
2279.8 738477325 737797775 737971497 737265625 736942368 736898346 737247772 737854004 737805710 739091492 739863358
2289.4 739863358 740766220 741311264 741568375 742371750 742481766 743203201 742964935 742998352 743490601 744034424
2299.1 744034424 745075989 745369263 746422119 747016907 747881699 749419022 750541077 751836472 752593231
2307.8 752593231 753319931 753518677 754171677 754972076 755814667 757137070 757186584 757995529 759364777
2316.4 759364777 761086044 763404694 765449448 768157043 769394608 769562607 770591354 772049103
2324.2 772049103 772884674 773402557 775175323 777160034 779507599 780498352 780440598 780739441 779993668
2332.8 779993668 779368515 778149414 779855881 782829895 782454987 782862320 783892288 785227280 785080032
2341.5 785080032 784267960 784040604 783033981 780696869 775689240 768631592 761299286 761499176 768318253
2350.2G68318253N259857N216293L754425L124695M326477K413406N272065J263885
2357.9G98949356l6011M72031R460j202392j748123J401748k464294k998886l373261
2366.6G89009628k865753k731552n131302m184570m289017m317398m156876k646103
2374.3G58687057k791213l439026k156983k232437k456665l144531k849045k674484
2382G36942673k552948j704026j552047q25959r05303q40683j90888J86844Q8654o11878
2391.7G28034439n86929n84488j99280j68762m14887k66418N1422J23444j61896L6087
2401.3G25862732n50232m883L50495n04609m49905m82788m45328o25763j18026k27891
2410.9G22803802k42233L76206l47901k64511j5945j09482m93469p20749p29523l36456
$$ plain form
2350.2 768318253 773578110 778794403 782548828 785673523 790000000 792413406 797685471 798949356
2357.9 798949356 798913345 799385376 799394836 798192444 796444321 797846069 795381775 792382889 789009628
2366.6 789009628 786143875 783412323 778281021 774096451 769807434 765490036 761333160 758687057
2374.3 758687057 755895844 752456818 750299835 748067398 745610733 742466202 739617157 736942673
2382 736942673 734389725 732685699 731133652 730307693 729402390 728561707 728370819 728557663 728646317 728034439
2391.7 728034439 727447510 726863022 726663742 726494980 726080093 725813675 725865097 725988541 725826645 725862732
2401.3 725862732 725312500 725307617 725658112 725153503 724703598 724220810 723775482 723149719 723031693 722803802
2410.9 722803802 722561569 722937775 722589874 722325363 722309418 722199936 721706467 720985718 720256195 719919739
2420.6G19919739J34887m81033j30920l07617l30430j39083m21753l12119p32956k40173
2430.2G16958542n92804o18515k08817m18014k31705p22732l16315k34070j2436k0294
2439.9G13582840o66962l23105m84237o00815q37555l51181m0207n92346n94559l07007
2449.5G08784866J21231j88522k07367o44531r07288k50931l21273m30374l90244j71509
2459.2G05394058r9869j46865m28696j88904m5929n93338n33218q30460n41000k49558
2468.8G01736221m53949j58004k6398m58069o60019j16119k30866p1945l68195l18450
2478.5F98874207N1269o56662k58331n49088n79681l19290k82593N4321m22973n9967
2488.1F95851212k34757m68597l34092o2026p9041n91431m7607m06189n25971k64740
$$ plain form
2420.6 719919739 720054626 719573593 719442673 719135056 718804626 718665543 718243790 717931671 717198715 716958542
2430.2 716958542 716365738 715747223 715538406 715120392 714888687 714165955 713849640 713615570 713603134 713582840
2439.9 713582840 712915878 712592773 712108536 711507721 710670166 710318985 710278778 709686432 709091873 708784866
2449.5 708784866 708906097 708717575 708510208 707865677 706958389 706707458 706386185 705955811 705565567 705394058
2459.2 705394058 705294189 705147324 704718628 704529724 704483795 703890457 703357239 702526779 701985779 701736221
2468.8 701736221 701282272 701124268 701097870 700639801 699979782 699863663 699632797 699560852 699192657 698874207
2478.5 698874207 698925476 698268814 698010483 697461395 696881714 696562424 696279831 696334152 695911179 695851212
2488.1 695851212 695616455 695147858 694813766 694751740 694672699 694081268 694033661 693627472 693101501 692836761
2497.7F92836761k12249n5313J220J61896k56195j96457n47104k91748p5226l95889
2507.4F90969696l84750p42646Q0872J71432J73493r2392o21872k72751m08859K99606
2517F89171829j29776p37915m21600j48316n8975m88968l9673k21862n41535m55475
2526.7F85927734J2589O7749o52619o76116o50940j61057l48816j60904j21994q69140
2536.3F82366486m60663l20816j45798l08075n34668q07190l18909K25983o04172l52249
2546F78739929m26788k63825k81753p54929l22799m29230k63825k41241j40457q4610
2555.6F75530472j16883m04510p93228o66275q42285k13700l42178m43420r8496l17383
2565.2F71292114j74865l99399l4638k11258o47583o82144n11322j60522p67441q03452
$$ plain form
2497.7 692836761 692624512 692569199 692570419 692732315 692476120 692279663 691732559 691440811 691365585 690969696
2507.4 690969696 690584946 689842300 689923172 690094604 690268097 690175705 689553833 689281082 688872223 689171829
2517 689171829 689042053 688304138 687882538 687734222 687675247 687186279 687146606 686924744 686383209 685927734
2526.7 685927734 685940323 686008072 685355453 684679337 684028397 683867340 683518524 683357620 683235626 682366486
2536.3 682366486 681905823 681585007 681439209 681131134 680596466 679789276 679470367 679696350 679092178 678739929
2546 678739929 678313141 678049316 677767563 677012634 676689835 676260605 675996780 675755539 675615082 675530472
2555.6 675530472 675413589 675009079 674215851 673549576 672707291 672493591 672151413 671707993 671609497 671292114
2565.2 671292114 671117249 670717850 670683212 670471954 669824371 669142227 668630905 668470383 667702942 666899490
2574.9F66899490l77807j5335n6382o8969k81754n69382k22015o09894m13894m74701
2584.5F63809357n35813o6833l40805m42658l82232k7924l17306l60489n1957j66702
2594.2F61116638k52685l84751m33807p76291j74332p1487j99432r232m03290m75845
2603.8F57935486p13349n4016l05862m59213j16120r79614n75333l21197o9580j71204
2613.5F54169998o20422j30997m37927j039887p19528p2937o50711r27582p77969o18897
2623.1F48173141j41143l84903o81381j008606m43955l78952q82111p40051p63550
2631.8F42748489n67245q98209n31921l84598r27391r32770j060066o25648j96915
2640.5F36623726k22550q53767r36356n35926p08847r97696j205139p61986o43959
$$ plain form
2574.9 666899490 666521683 666506348 666449966 666380997 666099243 665529861 665307846 664697952 664284058 663809357
2584.5 663809357 663273544 663206711 662865906 662423248 662041016 662013092 661695786 661335297 661283340 661116638
2594.2 661116638 660863953 660479202 660045395 659269104 659094772 659023285 658823853 658814621 658411331 657935486
2603.8 657935486 657222137 657168121 656862259 656403046 656286926 655307312 654731979 654410782 654341202 654169998
2613.5 654169998 653549576 653418579 652980652 651940765 651221237 651148300 650497589 649570007 648792038 648173141
2623.1 648173141 648031998 647647095 646965714 645957108 645513153 645134201 644252090 643512039 642748489
2631.8 642748489 642181244 641283035 640751114 640366516 639439125 638506355 637446289 636820641 636623726
2640.5 636623726 636401176 635547409 634611053 634075127 633366280 632368584 631163445 630401459 629757500
2649.1F29757500m11606k94686o12678n45731o84852q08144p66105n24178r22928r96056
2658.8F23190536n51300o22749n58929m35219m89845q96607n53093m36935n25780p72743
2668.4F17347336j144715k70423p37343p67708l92799o39229R4948o5079k46010m92744
2678.1F12686234p82395r12628j067505o49033m40864n03426q78792n54199l91273
2686.8F06506119m21982j11580l20663m04358m44947n28564q59032p24868p42608p96089
2696.4F01151428o16684o47316J59912m3144n22499p04384q36181m49562o04783q05244
2706E96081543j123505p31506n04417m43802m44489r11827m37012n84793m38194m21944
2715.7E90040054r19876q05702j092987n25551j31416l98369k16980l19977p52334
$$ plain form
2649.1 629757500 629345894 629051208 628438530 627892799 627207947 626399803 625633698 625109520 624186592 623190536
2658.8 623190536 622639236 622016487 621457558 621022339 620532494 619635887 619082794 618645859 618120079 617347336
2668.4 617347336 616202621 615932198 615194855 614427147 614034348 613395119 613490067 613424988 613178978 612686234
2678.1 612686234 611903839 610991211 609923706 609274673 608833809 608330383 607451591 606897392 606506119
2686.8 606506119 606084137 605972557 605651894 605247536 604802589 604274025 603414993 602690125 601947517 601151428
2696.4 601151428 600534744 599887428 600047340 600004196 599481697 598777313 597941132 597491570 596886787 596081543
2706 596081543 594958038 594226532 593722115 593278313 592833824 591921997 591484985 590900192 590461998 590040054
2715.7 590040054 589120178 588314476 587221489 586695938 586564522 586166153 585949173 585629196 584876862
2724.4E84876862m62571j24168o45638o55746n75905p31239o23360l54690o08750o94618
2734E79400177k91786n62973l1319M2458p35054n88379k43149l48969q61663p39670
2743.7E75039673l38555q0833m43916o47240k67601l21121q0757k30065m35676p29180
2753.3E71464729q68339m15573j62278J6709m16985k47993j52931n85137m74052j83449
2762.9E67974701J9531m02565o32629p93991p22275n43327j54229J52512l48053k01263
2772.6E64348412k80800n39208r22470p11975j71471n09910k15988o63834p75185n86090
2782.2E58971481r80110o41708l95890j69563l23524j62621m25949j224098j323166
2790.9E53324852j118011p35741o60210l34511p11860j012268p93648q25195p22733
$$ plain form
2724.4 584876862 584414291 584290123 583644485 582988739 582412834 581681595 581058235 580703545 580094795 579400177
2734 579400177 579108391 578545418 578514099 578556557 577821503 577233124 576989975 576641006 575779343 575039673
2743.7 575039673 574701118 574620285 574176369 573529129 573261528 572940407 572859650 572629585 572193909 571464729
2753.3 571464729 570596390 570180817 570018539 570035248 569618263 569370270 569217339 568632202 568158150 567974701
2762.9 567974701 567994232 567591667 566959038 566165047 565442772 564899445 564745216 564897728 564549675 564348412
2772.6 564348412 564067612 563528404 562605934 561893959 561722488 561212578 560996590 560332756 559557571 558971481
2782.2 558971481 557991371 557349663 556953773 556784210 556460686 556298065 555872116 554648018 553324852
2790.9 553324852 552206841 551471100 550810890 550476379 549764519 548752251 547958603 547133408 546410675
2799.6E46410675j037254o95381q27065j293030j270904j038285o30073r37920q40988
2808.3E37839775r14078j073265j149406j377602j316185j214676j120338j359711
2816E28314514q59947j190758j627731j154175j329079j021576r76943r25599j593933
2824.7E17634773k178573j383362j418648j267776j310387j657677j445923j486549
2832.4E05485878j640854j534233j488876j857148j676559j544456j934433k315178
2840.1D91494141k293473j903610k230415k699700k391357j971779k360840k660980
2847.8D72981987k640457k575569k298508k321701k443466k548027j454544q48465
2855.5D55851250j607094j280823r77478j072388j290969j478157j663132k118263
$$ plain form
2799.6 546410675 545373421 544678040 543850975 542557945 541287041 540248756 539618683 538680763 537839775
2808.3 537839775 536925697 535852432 534703026 533325424 532009239 530794563 529674225 528314514
2816 528314514 527454567 526263809 524636078 523481903 522152824 521131248 520154305 519228706 517634773
2824.7 517634773 515456200 514072838 512654190 511386414 510076027 508418350 506972427 505485878
2832.4 505485878 503845024 502310791 500821915 498964767 497288208 495743752 493809319 491494141
2840.1 491494141 489200668 487297058 485066643 482366943 479975586 478003807 475642967 472981987
2847.8 472981987 470341530 467765961 465467453 463145752 460702286 458154259 456699715 455851250
2855.5 455851250 454244156 452963333 451985855 450913467 449622498 448144341 446481209 444362946
2863.2D44362946j961098k046967k466583k289658k334137k865753k515030k253608
2870.9D25630112k520562k481918k753792k563018k515450k791519k646027k237396
2878.7D05120430k154388k649804k099380j679421j706543j491661j579933j342087
2886.4C90417213j449089j275596q95119p88879o97594j045914n94444p6714m56619
2895.1C83137245m66308l04680n48096n37300l96805k75497n41153j124573q63037
2903.7C78079796o98166p15561o45027n73464r07745j700325j430397j421852j541824
2912.4C68445435j750641k291870k256318k570076k142181j904449k184449j760864
2920.1C51584587j471290j429024j632157j332969j237297j219445n97610Q4572N06477
$$ plain form
2863.2 444362946 442401848 440354881 437888298 435598640 433264503 430398750 427883720 425630112
2870.9 425630112 423109550 420627632 417873840 415310822 412795372 410003853 407357826 405120430
2878.7 405120430 402966042 400316238 398216858 396537437 394830894 393339233 391759300 390417213
2886.4 390417213 388968124 387692528 386797409 386008530 385310936 384265022 383670578 383593864 383137245
2895.1 383137245 382670937 382366257 381818161 381280861 380884056 380608559 380067406 378942833 378079796
2903.7 378079796 377381630 376666069 376021042 375447578 374539833 372839508 371409111 369987259 368445435
2912.4 368445435 366694794 364402924 362146606 359576530 357434349 355529900 353345451 351584587
2920.1 351584587 350113297 348684273 347052116 345719147 344481850 343262405 342664795 342749367 343255844
2928.8C43255844K33612L10745O20041Q64029J099739J508255J814881J516037J969680
2937.5C53192863K455063K131119K081070K543526K728576L025170L271751K913666
2945.2C74342804K660370K321319K764512L240051L007049K651368K395324K767296
2952.9C96150093K818756L202973L267746K789840K844773K947120L021508K667160
2960.6D19709969K692756K960129L010712K634239K216873K504807K893600K764473
2968.3D41387558K221565K366677K331123K755127K956200K318801K222710J525574
2976.1D60085335K118568K890320K205048J624183J910477K353516J676063J907082
2983.8D76770592J747665J327934J762429J611900J294975R54018J237373J167832
$$ plain form
2928.8 343255844 343489456 343800201 344420242 345284271 346384010 347892265 349707146 351223183 353192863
2937.5 353192863 355647926 357779045 359860115 362403641 365132217 368157387 371429138 374342804
2945.2 374342804 377003174 379324493 382089005 385329056 388336105 390987473 393382797 396150093
2952.9 396150093 398968849 402171822 405439568 408229408 411074181 414021301 417042809 419709969
2960.6 419709969 422402725 425362854 428373566 431007805 433224678 435729485 438623085 441387558
2968.3 441387558 443609123 445975800 448306923 451062050 454018250 456337051 458559761 460085335
2976.1 460085335 462203903 465094223 467299271 468923454 470833931 473187447 474863510 476770592
2983.8 476770592 478518257 479846191 481608620 483220520 484515495 485469513 486706886 487874718
2991.5D87874718J328621J457252P08542M48227O27136Q27789K45324M96635O96220
3000.2D94710464O7750K61116N87654J89552q20618l99093m5777k39715k33765o27441
3009.8D93450127k25182j34506p21588r61304k85263m61273j077538p83424j006546
3018.5D87793503o49414p52869j279335r34715o65322j002883j480866j161194q13789
3027.2D79053116q42781j318016j115532j118355j529388r02863j070480j508789j694107
3035.9D67952805j148606j064338j554490r87701j128044j414681j633033j540985
3043.6D57480927j380768j464806j349411j691933j439170j580811j790199j375199
3051.3D45408630j236114j255226j182595j142234j757622j997261j807175j366119
$$ plain form
2991.5 487874718 489203339 490660591 491369133 491817360 492444496 493272285 493517609 494014244 494710464
3000.2 494710464 494778214 495039330 495626984 495816536 494995918 494596825 494551048 494311333 494077568 493450127
3009.8 493450127 493224945 493090439 492368851 491407547 491122284 490661011 489583473 488800049 487793503
3018.5 487793503 487144089 486391220 485111885 484177170 483511848 482508965 481028099 479866905 479053116
3027.2 479053116 478210335 476892319 475776787 474658432 473129044 472226181 471155701 469646912 467952805
3035.9 467952805 466804199 465739861 464185371 463197670 462069626 460654945 459021912 457480927
3043.6 457480927 456100159 454635353 453285942 451594009 450154839 448574028 446783829 445408630
3051.3 445408630 444172516 442917290 441734695 440592461 438834839 436837578 435030403 433664284
3059D33664284j610604j621017p57523j264762j596413j773262j505470j154900j553497
3067.7D20826836j558533j750145j660194j810379j241265q83560j834145j767425
3075.4D08321190r23538p09458j769829k117004j891441j453514j119042j588249j666718
3084.1C95082397j702537j014595j264420j734199j292000j257782j139488j654778
3091.8C84022598j375694j184959j327744j386566j909943j794662j844521j207313
3099.5C71991196j093636j363640j252899j263695j107673j748772j501160j357956
3107.2C61301765j756591j707268j430550j096611j428756j336976j427917j269569
3114.9C49847527q44460r13925j390305j854858j446152j517868j335373j377792j617279
$$ plain form
3059 433664284 432053680 430432663 429675140 428410378 426813965 425040703 423535233 422380333 420826836
3067.7 420826836 419268303 417518158 415857964 414047585 412806320 411922760 410088615 408321190
3075.4 408321190 407397652 406688194 404918365 402801361 400909920 399456406 398337364 396749115 395082397
3084.1 395082397 393379860 392365265 391100845 389366646 388074646 386816864 385677376 384022598
3091.8 384022598 382646904 381461945 380134201 378747635 376837692 375043030 373198509 371991196
3099.5 371991196 370897560 369533920 368281021 367017326 365909653 364160881 362659721 361301765
3107.2 361301765 359545174 357837906 356407356 355310745 353881989 352545013 351117096 349847527
3114.9 349847527 349003067 348089142 346698837 344843979 343397827 341879959 340544586 339166794 337549515
3123.6C37549515j234970j146736j051293j443291j566581j520615j338310j082993
3131.3C27164726q76350r49822j462860j433944j865769j200580p47014j321964j264744
3140C16041679j190204o59733j460915j846141j388283j172238m95090j043472j474152
3148.7C05311451j363049j161422j319504j170082p98054j230240j069469j137047
3156.4B96062584j061897j264229j273899o21567j032906j251964j328221j220130
3164.1B87007771p18022n15404j161174j509514j113510j388283j180802q19034p23572
3172.8B77878456q35705q88176p16362q52775r62200j342125j072998q83217r43451
3181.5B69381447r96895q97026o30550j198388p47089m14524q48389j290474j250915
$$ plain form
3123.6 337549515 336314545 335167809 334116516 332673225 331106644 329586029 328247719 327164726
3131.3 327164726 326288376 325338554 323875694 322441750 320575981 319375401 318628387 317306423 316041679
3140 316041679 314851475 314191742 312730827 310884686 309496403 308324165 307829075 306785603 305311451
3148.7 305311451 303948402 302786980 301467476 300297394 299499340 298269100 297199631 296062584
3156.4 296062584 295000687 293736458 292462559 291840992 290808086 289556122 288227901 287007771
3164.1 287007771 286289749 285774345 284613171 283103657 281990147 280601864 279421062 278602028 277878456
3172.8 277878456 277042751 276154575 275438213 274585438 273623238 272281113 271208115 270324898 269381447
3181.5 269381447 268384552 267487526 266856976 265658588 264911499 264496975 263648586 262358112 261107197
3190.1B61107197n76706q27999p31545p37343q83464r85299j040020r36927j123524
3198.8B53264370k52914k39602q17604r50832p09915n04208r68609j014175j203919
3207.5B46602592o89716q64906r32179k71606o30798l12634r58900r26876m61503j045856
3217.2B39507618l03001l81737j165714p17679k36682q02517r71241o88973m16622
3225.8B33823452j14670p41787r85794r57680n58090k16827m03614l84846r01394r04674
3235.5B27654076m30680m31862p13615m67148m71954p69806l30353l02887n39474p54471
3245.1B22441826j15051j86119j209412p59754j21041l30257j211872p66163n1632
3253.8B17690525m52995l58143n18513n79910m79260k78282j04484k16866o74858q73775
$$ plain form
3190.1 261107197 260530491 259702492 258970947 258233604 257350140 256364841 255324821 254387894 253264370
3198.8 253264370 253011456 252771854 251954250 251003418 250293503 249789295 248820686 247806511 246602592
3207.5 246602592 245912876 245047970 244115791 243844185 243213387 242900753 241941853 241014977 240553474 239507618
3217.2 239507618 239204617 238822880 237657166 236939487 236702805 235900288 234929047 234240074 233823452
3225.8 233823452 233708782 232966995 231981201 231023521 230465431 230248604 229844990 229460144 228558750 227654076
3235.5 227654076 227223396 226791534 226077919 225610771 225138817 224369011 224038658 223735771 223196297 222441826
3245.1 222441826 222326775 222140656 220931244 220171490 220050449 219720192 218508320 217742157 217690525
3253.8 217690525 217237530 216879387 216360874 215780964 215301704 215023422 214918938 214702072 214027214 213153439
3263.4B13153439l57247k97947k43854m76418l41949l38192m71134j85814p03507n70297
3273.1B09167080p67746l77140K87285l00560m17958n79566l76606k21844O6185l17669
3282.7B06161461q76885l48091n10387j66779j83868m45938m34971o37531k34032l09658
3292.4B02013321m51222j86958J26515r0638j48105j93787n80253p18956o32840J31016
3302A99268093r4395l90510n35832n88359O2770m2133j48621p36637n88264j49174
3311.7A96056938K4338j49307j126042k50473N3349k53754l89576m17290l7097n30053
3321.3A92981033R1381j41315p87315m75121o44646k54020j11256l80478m25186j45950
3330.9A89707127m85840m39663J12991l96442m63238q9741K5521m01802o10390n95703
$$ plain form
3263.4 213153439 212796192 212498245 212254391 211777973 211436024 211097832 210626698 210440884 209737377 209167080
3273.1 209167080 208399334 208022194 208309479 208008919 207590961 207011395 206634789 206412945 206479130 206161461
3282.7 206161461 205284576 204936485 204426098 204259319 204075451 203629513 203194542 202557011 202322979 202013321
3292.4 202013321 201562099 201375141 201501656 201411018 201262913 201069126 200488873 199769917 199137077 199268093
3302 199268093 199173698 198783188 198247356 197658997 197721767 197679634 197531013 196794376 196206112 196056938
3311.7 196056938 196081276 195931969 194805927 194555454 194608803 194355049 193965473 193548183 193511086 192981033
3321.3 192981033 193072414 192931099 192143784 191668663 191024017 190769997 190658741 190278263 189853077 189707127
3330.9 189707127 189221287 188781624 188894615 188498173 188034935 187945194 187970715 187568913 186958523 186362820
3340.6A86362820n21927K556K4719l33595p07512q6117P5989n67150l03402k26937
3350.2A83719444o31847o74324K8171L08724J38435m72107n34057j73130p03755k87227
3359.9A80718327k50874j79405o3915l39051J12019n13439q56228n41497J59646K08568
3369.5A78454151l13530j99165m64249k33593l94249O2104K89649m16832k14157m31957
3379.2A76138172k66170J3408L50762k14863r90830l25336l45917o9141J2798J10150
3388.8A74413033K74562j14154m9706p06692p88307J24970K79102k17781K880K6455
3398.4A73244362n46970O828P7514n1536J52874M0951n6649j88846n5771p5150J54725
3409.1A72702332K31761j52893k77347l7861K16007L4733N1804k9374J641K59018r1648
$$ plain form
3340.6 186362820 185840893 185843449 185868168 185534573 184827061 184740944 184816933 184249783 183946381 183719444
3350.2 183719444 183087597 182413273 182441444 182750168 182888603 182416496 181882439 181709309 181005554 180718327
3359.9 180718327 180467453 180288048 180224133 179885082 179997101 179483662 178627434 178085937 178245583 178454151
3369.5 178454151 178140621 177941456 177477207 177243614 176849365 176911469 177201118 176784286 176570129 176138172
3379.2 176138172 175872002 175885410 176236172 176021309 175030479 174705143 174359226 174290085 174302883 174413033
3388.8 174413033 174687595 174573441 174523735 173817043 173028736 173153706 173432808 173215027 173217907 173244362
3398.4 173244362 172697392 172704220 172781734 172730198 172883072 172924023 172867374 172678528 172622757 172547607 172702332
3409.1 172702332 172934093 172781200 172503853 172465992 172681999 172716732 172768536 172739162 172740803 172999821 172908173
3419.7A72908173j93406J74351j67846l86658K24628J45798m6940K27299R2716J05419
3429.3A73083534R4757J86367M17729J83563J21021L3951o8149J2874o1169N06001
3439A74510479O83861L07712n2032m29440N28126M79374k5787p3452m45404P57236
3448.6A76240673R65653N13744K09274K5540L5972r0713P20462L13893m5700N43175
3458.2A79431973M82273K65731Q8444O59390N11551K00405j50605q7890O43463J86253
3467.9A82230988O59961O37169k75020n5314O01941J120834R48677K32487P8926Q33988
3477.5A87014637J48163k27490N16339O24904J098233O25629M54006J41201M6196J008225
3487.2A91450043K98233j53809L61939P77015J081372P45239J97449K12459L53985
$$ plain form
3419.7 172908173 172714767 172889118 172721272 172334614 172559242 172705040 172658100 172885399 172978115 173083534
3429.3 173083534 173178291 173364658 173782387 173965950 174086971 174120922 174052773 174065647 174004478 174510479
3439 174510479 175194340 175502052 175450020 175020580 175548706 176028080 176002293 175928841 175483437 176240673
3448.6 176240673 177206326 177720070 177929344 177954884 177990856 177900143 178620605 178934498 178888798 179431973
3458.2 179431973 179914246 180179977 180268421 180927811 181439362 181639767 181489162 181401272 182044735 182230988
3467.9 182230988 182890949 183528118 183253098 183197784 183799725 184920559 185869236 186101723 186180649 187014637
3477.5 187014637 187162800 186935310 187451649 188076553 189174786 189800415 190254421 190395622 190441818 191450043
3487.2 191450043 191748276 191594467 191956406 192733421 193814793 194560032 194757481 194969940 195323925
3495.8A95323925P3433P20062P68585O8169N77145J048927K83432j08433M49620J014022
3505.5B00218887J243706P51667R23271K58045p04650N11837J345157J345959P18288
3514.2B06612167J019135P62672P0038M31366J47896O81229J214962R37328M90227
3522.9B12367020M76665O61965J024894J345330L56254M67701J35574Q10852J393281
3531.5B19039536J037330J516457K26383P93667M15001k64931J639881J250324Q17948
3540.2B26471596J63383R48315J689949J604366J159058p9403N43671m27971J569938
3548.9B33642902K171402J235390J166058j06221J804524R83486J152229J636391O18382
3557.6B44304543K061977J058636M59785J246853K387505J614723J134357L763275
$$ plain form
3495.8 195323925 195397358 196117420 196886005 196954174 197531319 198580246 198863678 198755245 199204865 200218887
3505.5 200218887 201462593 202214260 203137531 203395576 202690926 203202763 204547920 205893879 206612167
3514.2 206612167 207631302 208393974 208464012 208895378 209043274 209724503 210939465 211876793 212367020
3522.9 212367020 212843685 213505650 214530544 215875874 216232128 216699829 216835403 217646255 219039536
3531.5 219039536 220076866 221593323 221819706 222613373 223028374 222763443 224403324 225653648 226471596
3540.2 226471596 226634979 227583294 229273243 230877609 232036667 231957264 232500935 232072964 233642902
3548.9 233642902 235814304 237049694 238215752 238109531 239914055 240897541 242049770 243686161 244304543
3557.6 244304543 246366520 247425156 247884941 249131794 251519299 253134022 254268379 258031654
3565.3B58031654J142388o40202j79596P32479K744999J274033J461944J780682J771145
3574B68119526J600151J713238J876735J240807K079639J368599J148434K081986K428302
3582.6B83657417J850300J611824L835125K221775P10602K307816l83683J930256K779312
3591.3C00520744K776890J846581J927852L637696n2395K421951L300018L03593K808170
3600C19491100J340885J527939L851586K398719J853714L173523L216820l0098L190499
3608.7C40014687M85229P78465P636986R74808k036629M162483L03154M703064N414658
3617.4C62436905Q85353J335106r08775J891212M700356L112525K573395L403778K821198
3626C82251053L617592O647720k218132q689079O126671N616340N636711J516838j782493
$$ plain form
3565.3 258031654 259174042 258533840 258354244 259086723 261831722 263105755 264567699 266348381 268119526
3574 268119526 269719677 271432915 273309650 274550457 276630096 277998695 279147129 281229115 283657417
3582.6 283657417 285507717 287119541 290954666 293176441 293887043 296194859 295811176 297741432 300520744
3591.3 300520744 303297634 305144215 307072067 310709763 310657368 313079319 316379337 316682930 319491100
3600 319491100 320831985 322359924 326211510 328610229 330463943 333637466 336854286 336824188 340014687
3608.7 340014687 340499916 341278381 348915367 349890175 347853546 352016029 352319183 357022247 362436905
3617.4 362436905 363322258 364657364 363748589 365639801 370340157 373452682 376026077 379429855 382251053
3626 382251053 385868645 392516365 390298233 381609154 387735825 393352165 398988876 400505714 398723221
3634.7C98723221K928619M351082K992745K74887J620788L417969K871399J292381
3642.4D18473091J414337L340798L927078N618324p48482j310806P010498j947021
3650.1D35777817k792397J584778O347504M932518M124641M344483p873612L544731
3657.9D49990463O584587J874848J463547R27047L227234J713944J555290K244110
3665.6D69581070J925735N262070K490311p8430L24249o181374L847428R764900J0612221
3674.3D97548180j956673j9151840O154136R383774M699745k515258M75883L216248
3682D97854195L229980K583161O52961J166802N062370O229820j1527900j975823J0053215
3690.6E13328781n257835J273613O193275J357575K270164O59981J602J725044J692009
$$ plain form
3634.7 398723221 401651840 406002922 408995667 409270554 410891342 414309311 417180710 418473091
3642.4 418473091 419887428 423228226 427155304 432773628 432025146 430714340 437724838 435777817
3650.1 435777817 432985420 434570198 440917702 445850220 449974861 454319344 446445732 449990463
3657.9 449990463 456575050 458449898 459913445 460840492 464067726 465781670 467336960 469581070
3665.6 469581070 471506805 476768875 479259186 479180756 479505005 473323631 477171059 486935959 497548180
3674.3 497548180 495591507 476439667 482593803 491977577 496677322 494162064 494637947 497854195
3682 497854195 501084175 503667336 504320297 505487099 510549469 516779289 505251389 503275566 513328781
3690.6 513328781 508070946 509344559 515537834 516895409 519165573 519825554 519827156 521552200 523244209
3699.3E23244209L482285K508545n321427q98628O148148K221260j36757J017227L584099
3708E35848961M050560p995911M079514L907547j4009667N745736N293121J287002
3715.7E38206863J593399K593117J740875k748718K160340P577133l487129n793610
3723.4E41842270O285820K043877n61829k711144Q74291N090942J836777N979729l951988
3732.1E56728745o870804J0148315j094780r934730N61447K599830J125946L500786
3739.8E56764755L251992m131737M335594J2731934j0867348j7228851J1047592O578369
3747.5E62482300P298622k134857j2163391J2337303o699791p812500O895218N961227
3755.3E66164131M587097o516838K708664O266556r222069q80165N004883J554718
$$ plain form
3699.3 523244209 526726494 529235039 523913612 523014984 529163132 531384392 531247635 532264862 535848961
3708 535848961 539899521 531903610 535983124 539890671 525881004 531626740 536919861 538206863
3715.7 538206863 539800262 542393379 544134254 541385536 543545876 551123009 547635880 541842270
3723.4 541842270 548128090 550171967 549610138 546898994 547773285 552864227 554701004 560680733 556728745
3732.1 556728745 549857941 560006256 558911476 548976746 549538193 552138023 553263969 556764755
3739.8 556764755 560016747 555885010 560220604 572952538 562085190 544856339 555903931 562482300
3747.5 562482300 569780922 567646065 555482674 567819977 561120186 553307686 560202904 566164131
3755.3 566164131 570751228 564234390 566943054 573209610 563987541 563107376 568112259 569666977
3763E69666977P03278M229507l342896m591217M941330N736428k97318j0197410K926063
3771.7E69774742M609833Q56705O43158n97954J505127J135711L348961q14666q786507
3780.3E71675110L605423L122215J666489K195778l741036m90608K422676J434212
3788E81890259P86743l62282K83394L8185K84615O01387K537613M113922m039612m215965
3797.7E81918259K658996N175591P770500q508263j2970504N085907M341468O402588
3805.4E91874542O203232j2162743n098762O012115K728196P12699J331521M80308
3813.1E92081108J936264O020775l921356j4534722P424965O903305M969254L039360
3820.8F03918953k0528603J614113P260704K699852K869225l34282m931030Q68148
$$ plain form
3763 569666977 570370255 574599762 571256866 566665649 571606979 577343407 577046089 566848679 569774742
3771.7 569774742 574384575 575241280 575884438 575286484 576791611 577927322 581276283 580461617 571675110
3780.3 571675110 575280533 578402748 580069237 582265015 578523979 578033371 580456047 581890259
3788 581890259 582677002 582314720 582598114 582636299 582920914 583522301 586059914 590173836 586134224 581918259
3797.7 581918259 584577255 589752846 597523346 589015083 576044579 581130486 585471954 591874542
3805.4 591874542 598077774 585915031 580816269 586828384 589556580 590269279 591600800 592081108
3813.1 592081108 594017372 600038147 596116791 581582069 589007034 595910339 600879593 603918953
3820.8 603918953 583390350 585004463 592265167 594965019 597834244 597499962 592568932 593437080
3828.6E93437080K805291M407196J485786r798355M626274Q663635p917137l49235
3836.3E97360535J0743179r271965o616020P920990n619583J637573Q224678l929978
3844F00449409m823074L110466J796570Q33626K764396j083450K035828P404098m956665
3852.7F07531204k61459j9487496L854447J2370224j541290j810532K643433L371315
3860.4F06669846L589515o182708K60925Q000641p609368p062454N587807P232513
3868.1F10486717P758713j0542374j1533317O092453Q398170L822518j3003044J235046
3875.8F02714882N216598m8332K410584N269470n150337q276177O904831J987648J424866
3884.5F12454033M914513j4719925J739997M604149J149712N780907q08144j0923119
$$ plain form
3828.6 593437080 596242371 600649567 602135353 592336998 596963272 605626907 597709770 597360535
3836.3 597360535 608103714 598831749 592215729 600136719 594517136 596154709 604379387 600449409
3844 600449409 595626335 598736801 600533371 601366997 604131393 603047943 605083771 612487869 607531204
3852.7 607531204 607269745 587782249 591636696 604006920 602465630 600655098 603298531 606669846
3860.4 606669846 610259361 604076653 604337578 612338219 604728851 597666397 603254204 610486717
3868.1 610486717 618245430 607703056 596169739 602262192 610660362 614482880 601479836 602714882
3875.8 602714882 607931480 607883148 610293732 615563202 610412865 602136688 609041519 611029167 612454033
3884.5 612454033 617368546 602648621 604388618 608992767 610142479 615923386 615115242 604192123
3892.2F04192123K044716M731102j693420J528740J928100K889901J932983j0809479
3899.9F06744766O055794J140251o384735O182938l707886j844025K76261J615791
3907.6F10079155K952385n18646M76188r0713L80821M12140j95580K460022L298684
3916.3F19254456m455224n095062M938736o63757m061623M404030K363587K76451k893181
3925F14068413l672829K420311L158684J548309j810837r63325J328049l181191q29887
3933.7F12065697K971611Q25844Q77K66762j59607j46485l51486J660729P80716n026780
3943.3F12887878p5988K408943J714058J801071k718964N98946N67627k783013J957436
3952F16357994L13912j137696N72548Q69331M91601q61359J43585N0201R09119J029015
$$ plain form
3892.2 604192123 606236839 610967941 609274521 610803261 612731361 615621262 617554245 606744766
3899.9 606744766 612800560 613940811 607556076 613739014 610031128 608187103 608463364 610079155
3907.6 610079155 613031540 612512894 612989082 612898369 613279190 613691330 613495750 615955772 619254456
3916.3 619254456 614799232 609704170 614642906 613979149 609917526 614321556 616685143 616961594 614068413
3925 614068413 610395584 612815895 615974579 617522888 615712051 614748726 616076775 612895584 612065697
3933.7 612065697 615037308 615863152 615864029 616130791 615971184 615824699 615473213 617133942 617914658 612887878
3943.3 612887878 612811890 615220833 616934891 618735962 616016998 616615944 617183571 614400558 616357994
3952 616357994 616671906 615534210 616106758 616976089 617467690 616606331 616749916 616800117 617709236 618738251
3961.6F18738251j190529j21346o7863o54564K74773P65609J70823p30019K44789J209412
3971.3F18639336k59095l24592M66347j30082N09491j63574m22439L54118N5580j59683
3980.9F18565407p00951K87476O09436j17226j27640j21345j17722K90299J332435
3989.6F19900169m06875p10259Q96340M44030M71802l78418n82313l14369K07595J093712
3999.2F20621414J59836
4000.2F20781250
$$ plain form
3961.6 618738251 617547722 617426376 617358513 616703949 616978722 617744331 617915154 617185135 617429924 618639336
3971.3 618639336 618380241 618055649 618521996 618391914 618901405 618737831 618315392 618669510 618725090 618565407
3980.9 618565407 617864456 618151932 618761368 618644142 618516502 618395157 618277435 618567734 619900169
3989.6 619900169 619493294 618783035 619679375 620123405 620595207 620216789 619634476 619320107 619527702 620621414
3999.2 620621414 620781250
4000.2 620781250
##END=$$ End of the data block
