##TITLE=$$ Begin of the data block
##JCAMP-DX=5.00 $$ ACD/SpecManager v 10.08
##SPECTROMETER/DATA SYSTEM=Varian
##DATE=20 Nov 2012 15:39:46
##DATA TYPE=INFRARED SPECTRUM
##DATA CLASS=XYDATA
##ORIGIN=
##OWNER=
##NPOINTS=3735
##FIRSTX=399.26403809
##LASTX=4000.35498047
##MAXX=4000.35498047
##MINX=399.26403809
##MAXY=80.20560455
##MINY=11.27267265
##XFACTOR=1.0000000000
##YFACTOR=0.000000100000000
##FIRSTY=40.42220306
##DELTAX=0.96440572
##XUNITS=1/CM
##YUNITS=TRANSMITTANCE
##XYDATA=(X++(Y..Y))
$$ plain form
399.3 404222031 383017578 389069557 389679947 388909492 384703293 383502235 394387016 384336853
407 384336853 385145493 390765533 385164833 385190163 386283722 387001495 383176918 384666862 383666878
415.7 383666878 381974716 384054337 390787125 413716164 403104744 396022453 393278961 388798103
423.4 388798103 385176430 380373306 378611145 382056084 386287842 381277657 376835747 375081749
431.1 375081749 373187103 373400803 373036499 373171539 368555527 366900330 370208511 371732750 374228020
439.8 374228020 375822067 371573372 369564552 378261070 384816399 385424385 387024498 388622017 384850922
448.4 384850922 386020012 393139992 393951340 391863441 390722694 395893250 396138344 388720627 388670731
457.1 388670731 393239594 392624817 384872780 382730827 390122948 389771805 389184608 387345619 382920380
$$ packed form
399.3D04222031k1204453O051979O10390p70455m206199j201058J0884781j0050163
407C84336853Q08640N620040n600700K5330J093559P17773l824577J489944r99984
415.7C83666878j692162K079621O732788K2929039j0611420p082291k743492m480858
423.4C88798103l621673m803124j762161L444939M231758n010185m441910j753998
431.1C75081749j894646K13700l64304J35040m616012j655197L308181J524239K495270
439.8C74228020J594047m248695k008820Q696518O555329O07986J600113J597519l771095
448.4C84850922J169090P119980Q11348k087899j140747N170556K45094p417717m9896
457.1C88670731M568863o14777p752037k141953P392121l51143n87197j838989m425239
$$ plain form
465.8 382920380 381128731 381598091 378726501 373884811 372663383 370295525 370525703 372999573 370617867
474.5 370617867 367110710 366314621 364547997 362229309 361991463 362840805 365384216 363677788 360901604
483.2 360901604 361571999 364840660 364682961 363581848 366876488 366698532 363692627 356995811 352105904
491.8 352105904 354184341 355214920 355959320 355635071 358647194 360339355 360136490 361054382 358557358
500.5 358557358 354801979 349827843 347146835 345298576 345688438 345391197 342181358 341492538 342344284
509.2 342344284 342873840 339755173 337177505 334900208 334978104 334787521 329765701 325010986 321308975
517.9 321308975 320947418 317740440 314870033 313651085 312355747 313828564 314447956 315596294 311208897
526.6 311208897 309379120 311090336 311902466 313656483 312524452 313510933 314703407 314712811 316687145
$$ packed form
465.8C82920380j791649M69360k871590m841690j221428k367858K30178K473870k381706
474.5C70617867l507157p96089j766624k318688k37846Q49342K543411j706428k776184
483.2C60901604O70395L268661j57699j101113L294640j77956l005905o696816m889907
491.8C52105904K078437J030579P44400l24249L012123J692161k02865R17892k497024
500.5C58557358l755379m974136k681008j848259L89862k97241l209839o88820Q51746
509.2C42344284N29556l118667k577668k277297P7896j90583n021820m754715l702011
517.9C21308975l61557l206978k870407j218948j295338J472817O19392J148338m387397
526.6C11208897j829777J711216Q12130J754017j132031R86481J192474R404J974334
$$ plain form
535.2 316687145 320572929 323591347 324973869 327161865 326808243 329176979 333948288 336882019 339558220
543.9 339558220 340492058 340904236 339965782 338825798 338761978 339230499 338264618 335623016 334957809 335138550
553.6 335138550 335804100 335211678 333526802 330979538 328587112 327079697 323882942 322304955 320868912
562.3 320868912 319137897 316558456 312570515 308516598 304646568 303359451 300951138 299130573
570 299130573 295932331 291420326 289240055 288074303 286899891 284532146 286666241 289380131 291810646
578.6 291810646 295027027 298336887 300608387 300499935 302958183 306247292 310434532 313921051 316441097
587.3 316441097 318442554 319167290 322084122 324546280 326599007 329030342 330640678 330042458 328955688
596 328955688 329681969 329446678 328571739 327089348 326234589 326092033 327491341 328095131 326833534 328470039
$$ packed form
535.2C16687145L885784L018418J382522K187996l53622K368736M771309K933731K676201
543.9C39558220R33838M12178r38454j139984o3820M68521r65881k641602o65207J80741
553.6C35138550O65550n92422j684876k547264k392426j507415l196755j577987j436043
562.3C20868912j731015k579441l987941m053917l870030j287117k408313j820565
570B99130573l198242m512005k180271j165752j174412k367745K134095K713890K430515
578.6B91810646L216381L309860K271500j08452K458248L289109M187240L486519K520046
587.3C16441097K001457P24736K916832K462158K052727K431335J610336n98220j086770
596C28955688P26281k35291q74939j482391q54759j42556J399308O03790j261597J636505
$$ plain form
605.6 328470039 328191795 327346191 327299156 327008781 328369827 328815269 329095612 329480476 330749321 331378326
615.3 331378326 333895302 338088722 339023666 339908142 341198730 344211006 346273232 346415596 347921715
624 347921715 349496078 351688766 354430695 357064323 358405342 359334641 361174049 363709869 365148735
632.7 365148735 365205498 366692009 367097092 367039070 368034744 368575096 369073639 369916039 372587929 375299835
642.3 375299835 376328011 376139107 375292015 375346069 377500381 379990463 380843391 381293411 380899048
651 380899048 380918427 382394142 383438644 383810081 384428978 385330009 385150604 384659767 384617805 385165710
660.6 385165710 385459442 385774956 386851616 386127052 386345863 389063454 395269318 409268303 400270157
669.3 400270157 394393806 393070908 393124466 393403587 394338455 395882301 398620567 400021362 400267944
$$ packed form
605.6C28470039k78244q45604m7035k90375J361046M45442K80343L84864J268845O29005
615.3C31378326K516976M193420R34944Q84476J290588L012276K062226J42364J506119
624C47921715J574363K192688K741929K633628J341019R29299J839408K535820J438866
632.7C65148735N6763J486511M05083n8022R95674N40352M98543Q42400K671890K711906
642.3C75299835J028176j88904q47092N4054K154312K490082Q52928M50020l94363
651C80899048J9379J475715J044502L71437O18897R01031j79405m90837m1962N47905
660.6C85165710K93732L15514J076660p24564K18811K717591O205864J3998985q998146
669.3D00270157n876351j322898N3558K79121R34868J543846K738266J400795K46582
$$ plain form
678 400267944 401332703 401897278 402719994 403489265 404331436 404503326 404213142 404914398 405586510 406808853
687.6 406808853 407144012 407690697 408368111 407973099 408186150 407205009 406059494 404962425 403286705
696.3 403286705 401602440 400292282 400664253 399506340 396598816 394594269 393842010 392325783 389763908
705 389763908 388580666 387355728 386460266 386368408 386699257 387647629 389312210 391517601 392748909
713.7 392748909 394484673 396952705 399492836 402306290 405035820 408873329 413050880 414957695
721.4 414957695 416696663 420180626 423945084 428019600 431801109 434895821 438441658 441981277
729.1 441981277 444242973 445915604 448364754 449970207 451029930 452966003 454486923 456139526
736.8 456139526 458030357 459873314 462353935 463520126 463655739 463421173 461880150 460700455 460271492
$$ packed form
678D00267944J064759N64575Q22716P69271Q42171J71890k90184P01256O72112J222343
687.6D06808853L35159N46685O77414l95012K13051r81141j145515j097069j675720
696.3D03286705j684265j310158L71971j157913k907524k004547p52259j516227k561875
705C89763908j183242j224938q95462r1858L30849R48372J664581K205391J231308
713.7C92748909J735764K468032K540131K813454K729530L837509M177551J906815
721.4D14957695J738968L483963L764458M074516L781509L094712L545837L539619
729.1D41981277K261696J672631K449150J605453J059723J936073J520920J652603
736.8D56139526J890831J842957K480621J166191J35613k34566j541023j179695m28963
$$ plain form
745.5 460271492 459390488 456692009 454016075 452676125 451348305 449912567 446794586 443705597 440921707
754.2 440921707 436860313 434916573 433103180 429837074 427363510 423460846 420821457 420643120 419480171
762.8 419480171 418529663 418129234 418876305 420561485 421350632 421716461 423418617 427138290 431913376
771.5 431913376 436633301 440168533 443328667 447619438 452680740 457571831 462325935 467420769
779.2 467420769 472166557 476124573 480301247 483218422 485247078 488666039 492052155 494566383
787 494566383 497528458 501278458 503890457 506238136 508306198 510232086 513608704 516003418 517550201
795.6 517550201 518637962 521046257 524060402 525864334 528838463 531220741 533033142 535099907
803.4 535099907 537554092 539575844 540632286 541678047 542535210 543743896 543555908 543201180 543532715
$$ packed form
745.5D60271492q81004k698479k675934j339950j327820j435738l117981l088989k783890
754.2D40921707m061394j943740j813393l266106k473564l902664k639389j78337j162949
762.8D19480171r50508m00429P47071J685180P89147L65829J702156L719673M775086
771.5D31913376M719925L535232L160134M290771N061302M891091M754104N094834
779.2D67420769M745788L958016M176674K917175K028656L418961L386116K514228
787D94566383K962075L750000K611999K347679K068062J925888L376618K394714J546783
795.6E17550201J087761K408295L014145J803932K974129K382278J812401K066765
803.4E35099907K454185K021752J056442J045761Q57163J208686j87988l54728L31535
$$ plain form
812 543532715 544337120 544570351 543838730 544467583 544866638 545431175 545170631 544260292 543819389 543529968
821.7 543529968 543417511 541963272 541303558 540195198 538303375 536214371 534138985 532774124 530354347
830.4 530354347 527661781 523358688 519959297 517519264 513656464 511013145 508280296 505663185
838.1 505663185 503425293 501010704 498669472 496378212 495523491 493636971 489818840 487059937 485662041
846.8 485662041 484104309 481932564 480103455 478756180 477094307 475095024 473349533 471337090
854.5 471337090 468155098 465722580 464024200 461056938 458241425 456535072 456457672 457926369 460863266
863.1 460863266 464664421 468540726 473763237 479350014 485002747 491253853 497424812 504041901
870.9 504041901 509534988 514229202 519387436 523919945 528119812 531419144 534385605 535518074
$$ packed form
812E43532715Q04405K33231p31621O28853L99055N64537k60544r10339m40903k89421
821.7E43529968j12457j454239o59714j108360j891823k089004k075386j364861k419777
830.4E30354347k692566m303093l399391k440033l862800k643319k732849k617111
838.1E05663185k237892k414589k341232k291260q54721j886520l818131k758903j397896
846.8D85662041j557732k171745j829109j347275j661873j999283j745491k012443
854.5D71337090l181992k432518j698380k967262k815513j706353p7400J468697K936897
863.1D60863266L801155L876305N222511N586777N652733O251106O170959O617089
870.9E04041901N493087M694214N158234M532509M199867L299332K966461J132469
$$ plain form
878.6 535518074 535659180 535469437 533186989 530803452 528027115 525775909 522906723 519063721 516199608
887.3 516199608 513202095 509063187 504717522 500787582 495715141 491357346 487592964 483818436
895 483818436 480870438 477783241 475302773 473435402 471476517 468745155 465877342 463108215 460313492
903.7 460313492 457107162 452702751 448496895 444549217 440677338 436070786 430851059 426190109
911.4 426190109 421784325 416702347 410873032 405261040 399447403 393959351 388242149 382956543
919.1 382956543 379276237 375906754 372860680 370603638 368971939 368159523 368244438 367869759 367588768
927.8 367588768 368009033 368582649 368678780 368594322 369382591 369985886 370920677 372422028 374185524 376584549
937.4 376584549 379157410 381858864 383978653 385827332 388326378 390663490 392303314 394038925
$$ packed form
878.6E35518074J41106j89743k282448k383537k776337k251206k869186l843002k864113
887.3E16199608k997513m138908m345665l929940n072441m357795l764382l774528
895D83818436k947998l087197k480468j867371j958885k731362k867813k769127k794723
903.7D60313492l206330m404411m205856l947678l871879m606552n219727m660950
911.4D26190109m405784n081978n829315n611992n813637n488052n717202n285606
919.1C82956543l680306l369483l046074k257042j631699q12416Q4915l74679k80991
927.8C67588768M20265N73616R6131q4458P88269O03295R34791J501351J763496K399025
937.4C76584549K572861K701454K119789J848679K499046K337112J639824J735611
$$ plain form
945.1 394038925 395032425 394124413 392373619 389955330 386301880 381667252 376210213 369839516 362950745
953.8 362950745 356555786 349692459 342470932 335059357 327648354 320582581 313013840 305161743
961.5 305161743 296616535 288281078 279189873 270271244 262181301 254029408 245994034 236721401
969.2 236721401 228341427 219958668 212028885 203295593 194237843 186993465 178677845 171675663
976.9 171675663 164764614 158524876 152029905 145653172 141134739 136548243 133162794 128938465
984.7 128938465 126445675 123964701 121755219 120414095 118278036 117870102 116751289 116649218 116174564
993.3 116174564 115991488 115616846 115418005 116407862 115529184 116306839 116290274 116634445 116730070 116634073
1003 116634073 117105618 116275368 117191696 116411467 116157932 115379477 115151520 115489845 113805723 113918438
$$ packed form
945.1C94038925R93500r08012j750794k418289l653450m634628n457039o370697o888771
953.8C62950745o394959o863327p221527p411575p411003p065773p568741p852097
961.5C05161743q545208q335457r091205q918629q089943q151893q035374r272633
969.2B36721401q379974q382759p929783q733292r057750p244378q315620p002182
976.9A71675663o911049o239738o494971o376733m518433m586496l385449m224329
984.7A28938465k492790k480974k209482j341124k136059m07934j118813j02071m74654
993.3A16174564j83076l74642j98841R89857q78678P77655j6565L44171R5625r5997
1003A16634073M71545q30250R16328p80229k53535p78455k27957L38325j684122J12715
$$ plain form
1012.6 113918438 112778473 113315210 113447695 113353424 113504763 112726727 114071083 113880892 114404821
1021.3 114404821 114450521 115873423 117181740 117182827 118782740 119556122 121391020 121613655 123051577
1030 123051577 123847628 123694458 125035286 125614700 127263241 127271137 128768950 129424019 129794235 130418291
1039.6 130418291 129773932 131052408 131074524 131832647 130993834 131110268 131402378 131109638 132425594
1048.3 132425594 132120838 134045057 134205980 136037893 138520765 139883528 142094202 142659807 145927134
1057 145927134 147834206 150314350 152694407 155704422 159580526 161985893 166576462 169602184 173392735
1065.7 173392735 175873756 178299866 179650593 178143082 177708855 174669685 171521626 166754608
1073.4 166754608 163276978 160161705 156805153 156109571 153499346 153101883 152983141 153989964 154446459
$$ packed form
1012.6A13918438j139965N36737J32485r4271J51339p78036J344356j90191N23929
1021.3A14404821M5700J422902J308317J087J599913P73382J834898K22635J437922
1030A23051577P96051j53170J340828N79414J648541P896J497813O55069L70216O24056
1039.6A30418291o44359J278476K2116P58123q38813J16434K92110k92740J315956
1048.3A32425594l04756J924219J60923J831913K482872J362763K210674N65605L267327
1057A45927134J907072K480144K380057L010015L876104K405367M590569L025722L790551
1065.7A73392735K481021K426110J350727j507511m34227l039170l148059m767018
1073.4A66754608l477630l115273l356552o95582k610225l97463j18742J006823M56495
$$ plain form
1082.1 154446459 155264254 157394667 158031406 160487328 161555462 164331532 166238728 168633156 171949711
1090.7 171949711 173529015 176381855 177590275 180777626 182769890 184489594 186918106 187851276
1098.5 187851276 188728294 188696976 190053844 189753265 190688229 190713692 190518169 192033482 191694679 193779297
1108.1 193779297 194874821 196516056 198254089 200112286 202927341 204876347 207309132 207981606
1115.8 207981606 210208664 211492805 213047485 215038776 215463963 216983891 217620602 219663353 220733356
1124.5 220733356 221914768 223462849 224780216 226401463 227292919 230330849 231881580 234066849
1132.2 234066849 236231804 237402000 238821087 238814087 238707523 236530170 234974823 232714443 230055275
1140.9 230055275 227909107 224813118 222160625 218076382 215643921 212425690 208949966 206199780
$$ packed form
1082.1A54446459Q17795K130413O36739K455922J068134K776070J907196K394428L316555
1090.7A71949711J579304K852840J208420L187351J992264J719704K428512R33170
1098.5A87851276Q77018l1318J356868l00579R34964K5463j95523J515313l38803K084618
1108.1A93779297J095524J641235J738033J858197K815055J949006K432785O72474
1115.8B07981606K227058J284141J554680J991291M25187J519928O36711K042751J070003
1124.5B20733356J181412J548081J317367J621247Q91456L037930J550731K185269
1132.2B34066849K164955J170196J419087p000j06564k177353j555347k260380k659168
1140.9B30055275k146168l095989k652493m084243k432461l218231l475724k750186
$$ plain form
1148.6 206199780 203420849 201750050 199278412 198507500 196580505 195462532 194681377 194219151 195101166
1157.3 195101166 194571953 195637493 196099968 198170185 199840736 201176205 204173546 206551781 210395584
1166 210395584 214188557 218983727 223621273 229364986 235367794 241323452 248617306 254978485 262257652
1174.6 262257652 268902664 276574326 284372692 291334057 298269615 304409142 311645050 318850784
1182.4 318850784 325857620 331870346 338023987 344357681 349870949 354706612 358538742 362409325
1190.1 362409325 365192223 367634201 369559860 371271019 373216705 374304886 375695839 376370544
1197.8 376370544 377013168 377809715 378251038 378515167 378014336 378353882 379102478 380205002 381622467
1206.5 381622467 383192940 385049896 386478996 388378181 390737953 393421288 395969276 397655106
$$ packed form
1148.6B06199780k778931j670799k471638p70912j926995j117973p81155m62226Q82015
1157.3A95101166n29213J065540M62475K070217J670551J335469K997341K378235L843803
1166B10395584L792973M795170M637546N743713O002808N955658P293854O361179P279167
1174.6B62257652O645012P671662P798366O961365O935558O139527P235908P205734
1182.4C18850784P006836O012726O153641O333694N513268M835663L832130L870583
1190.1C62409325K782898K441978J925659J711159J945686J088181J390953O74705
1197.8C76370544O42624P96547M41323K64129n00831L39546P48596J102524J417465
1206.5C81622467J570473J856956J429100J899185K359772K683335K547988J685830
$$ plain form
1214.2 397655106 399252815 401719055 403820152 404721184 405510597 406487808 407148323 407381287 407990913
1222.9 407990913 408392296 408172913 407998619 407453308 406431007 405062904 403601036 402085419 400767059
1231.5 400767059 399973259 399110985 398060989 396930466 396554604 396335869 395836411 395518265 394715958
1240.2 394715958 394339485 393987312 393526077 393328781 393317947 394030342 394638138 395608063 396705666 397342110
1249.9 397342110 398264542 399481201 400485497 401214523 402017670 402726631 403547134 404622345 405376244
1258.5 405376244 405822220 406645126 407784958 408763580 409416885 410061226 411105728 412062721 412833481
1267.2 412833481 413920364 415461159 416437607 417077370 418310318 419509392 420491066 421195946 422016220
1275.9 422016220 422614136 422640610 422264442 421750603 421950035 422260056 421826706 421333199 421555214 421592636
$$ packed form
1214.2C97655106J597709K466240K101097R01032P89413R77211O60515K32964O09626
1222.9D07990913M01383k19383j74294n45311j022301j368103j461868j515617j318360
1231.5D00767059p93800q62274j049996j130523l75862k18735m99458l18146q02307
1240.2C94715958l76473l52173m61235j97296j0834P12395O07796R69925J097603O36444
1249.9C97342110R22432J216659J004296P29026Q03147P08961Q20503J075211P53899
1258.5D05376244M45976Q22906J139832R78622O53305O44341J044502R56993P70760
1267.2D12833481J086883J540795R76448O39763J232948J199074R81674P04880Q20274
1275.9D22016220N97916K6474l76168n13839J99432L10021m33350m93507K22015L7422
$$ plain form
1285.5 421592636 421417732 421384697 421046066 420586929 419956474 419439240 418551559 417421722 416353111
1294.2 416353111 415342064 414621429 413500099 412344398 411329803 410546494 409865150 408435974 406601906
1302.9 406601906 405268784 404508858 403733749 403038673 401787376 400271339 399575157 398772659 397731018
1311.6 397731018 396437912 395075569 393832588 392408447 391212654 389706726 388396339 387493286
1319.3 387493286 386376343 385634117 384752235 383822441 382701607 380959015 378858261 376344833 373821831
1328 373821831 371097794 368655548 366522369 364537430 363168602 361694489 360162964 358754730 357989998
1336.7 357989998 357267532 356414490 355743523 355060501 354478302 354117432 354421883 354274940 354521103 354735985
1346.3 354735985 354997787 355783920 355876160 355931931 355156021 354536095 353882484 353031616 352558327 351700134
$$ packed form
1285.5D21592636j74904l3035l38631m59137o30455n17234q87681j129837j068611
1294.2D16353111j011047p20635j121330j155701j014595p83309o81344j429176j834068
1302.9D06601906j333122p59926p75109o95076j251297j516037o96182q02498j041641
1311.6C97731018j293106j362343j242981j424141j195793j505928j310387r03053
1319.3C87493286j116943p42226q81882r29794j120834j742592k100754k513428k523002
1328C73821831k724037k442246k133179j984939j368828j474113j531525j408234p64732
1336.7C57989998p22466q53042o70967o83022n82199l60870L04451j46943K46163K14882
1346.3C54735985K61802P86133R2240N5771p75910o19926o53611q50868m73289q58193
$$ plain form
1355.9 351700134 351118927 350049477 349521408 349382210 349006920 348295135 347436371 346332054 345018654
1364.6 345018654 345027084 344242592 343632584 343025970 342422562 343225822 343210297 343934402 344314079 345004997
1374.3 345004997 345686073 346113091 347274895 347569466 348435440 348377686 349233398 350666695 351720047
1382.9 351720047 353110466 354222221 356373062 357852364 360245171 361845551 363247833 364809151
1390.7 364809151 365370407 366183510 366492310 366687927 365956345 366452789 366805534 366635628 365702095 364457664
1400.3 364457664 364772644 363803062 363328247 362865219 361262932 360024109 359151001 359041977 358029976
1409 358029976 357560196 356564827 355558434 355055313 354381523 353953171 352658005 352571259 351780090 351548080
1418.6 351548080 349536896 349414635 351631851 351705208 352575073 352028656 352438278 353290825 353457069
$$ packed form
1355.9C51700134n81207j069450n28069j39198l75290p11785q58764j104317j313400
1364.6C45018654Q430p84492o10008o06614o03408Q03260j5525P24105L79677O90918
1374.3C45004997O81076M27018J161804K94571Q65974n7754Q55712J433297J053352
1382.9C51720047J390419J111755K150841J479302K392807J600380J402282J561318
1390.7C64809151N61256Q13103L08800J95617p31582M96444L52745j69906r33533j244431
1400.3C64457664L14980r69582m74815m63028j602287j238823q73108j09024j012001
1409C58029976m69780r95369j006393n03121o73790m28352j295166q6746p91169k32010
1418.6C51548080k011184j22261K217216P3357Q69865n46417M09622Q52547J66244
$$ plain form
1427.3 353457069 354714012 354679031 355438728 355431290 356672211 357597580 358354568 360420227 360329285 360400810
1437 360400810 361427040 364062042 365300255 366029205 366843567 367129555 369133224 369692116 371243858
1445.6 371243858 371790009 371905556 371582489 371155357 372059402 370817146 370398750 369399757 370230980
1454.3 370230980 370570412 369239082 367561073 362595596 367700005 367916260 369898529 370416946 370985985
1463 370985985 373546219 372815971 376220093 377950668 381998634 385330315 389600372 394696236 397468071
1471.7 397468071 404473686 408570442 416798744 421060715 426266441 430891609 434692802 439986839
1479.4 439986839 443484459 448985252 452538757 457902260 462348709 465707283 470434647 472719116
1487.1 472719116 477174339 478839188 481912880 483998413 486845016 490512314 493144760 497598038
$$ packed form
1427.3C53457069J256943l4981P59697p438J240921R25369P56988K065659r0942P1525
1437C60400810J026230K635002J238213P28950Q14362K85988K003669N58892J551742
1445.6C71243858N46151J15547l23067m27132R04045j242256m18396r98993Q31223
1454.3C70230980L39432j331330j678009m965477N104409K16255J982269N18417N69039
1463C70985985K560234p30248L404122J730575M047966L331681M270057N095864K771835
1471.7C97468071P005615M096756Q228302M261971N205726M625168L801193N294037
1479.4D39986839L497620N500793L553505N363503M446449L358574M727364K284469
1487.1D72719116M455223J664849L073692K085533K846603L667298K632446M453278
$$ plain form
1494.8 497598038 499116898 500536194 503370819 505575829 506804466 509282799 512116585 512250099
1502.5 512250099 514403954 516156845 517883377 513473587 513873482 521658897 522823334 525672951
1510.2 525672951 526990242 528790359 528428879 530253296 532027740 531987915 534077377 531481667 536225624
1518.9 536225624 539470482 539907036 539986725 539282990 543819466 545270996 545481453 545001945 546467628
1527.6 546467628 547086449 547772179 550303497 550740585 552155647 550240326 549297714 552352676 553138542
1536.3 553138542 554411888 555628586 555657387 546638298 551889305 553993797 552891045 555430145 555131645
1545 555131645 554719162 555748520 556807137 557515259 556551018 553984718 554160843 555350647 555468025
1553.6 555468025 552914276 552152061 555158768 558047256 548142700 540373840 542353821 546555214
$$ packed form
1494.8D97598038J518860J419296K834625K205010J228637K478333K833786J33514
1502.5E12250099K153855J752891J726532m409790L99895P785415J164437K849617
1510.2E25672951J317291J800117l61480J824417J774444l9825K089462k595710M743957
1518.9E36225624L244858M36554P9689p03735M536476J451530K10457m79508J465683
1527.6E46467628O18821O85730K531318M37088J415062j915321r42612L054962P85866
1536.3E53138542J273346J216698K8801r019089N251007K104492j102752K539100k98500
1545E55131645m12483J029358J058617P08122r64241k566300J76125J189804J17378
1553.6E55468025k553749p62215L006707K888488r904556p768860J979981M201393
$$ plain form
1561.4 546555214 547577553 547175560 546536407 543709221 542738876 542806396 542597542 541164474 535332565
1570 535332565 535943451 536262054 534943275 533672333 533355064 532092590 525298386 526170692 526429024
1578.7 526429024 525924492 525310287 524103622 523045807 521638908 520540924 518790321 517409401 516075745
1587.4 516075745 514480057 513406715 511672707 510481415 508655548 507540550 506499176 504705353
1595.1 504705353 503369217 501617737 500193100 497934113 496361580 494508629 492883492 491394768
1602.8 491394768 488926277 487812042 486285667 485430870 483599243 481951561 479982109 477397346
1610.5 477397346 476235695 474141655 473341255 471777649 471497955 469999428 463042297 464686317 464485016
1619.2 464485016 463973465 461996155 461550522 460296021 456221466 456757164 456456070 456854057 454753532
$$ packed form
1561.4E46555214J022339m01993o39153k827186r70345O7520k08854j433068n831909
1570E35332565O10886L18603j318779j270942l17269j262474o794204Q72306K58332
1578.7E26429024n04532o14205j206665j057815j406899j097984j750603j380920j333656
1587.4E16075745j595688j073342j734008j191292j825867j114998j041374j793823
1595.1E04705353j336136j751480j424637k258987j572533j852951j625137j488724
1602.8D91394768k468491j114235j526375q54797j831627j647682j969452k584763
1610.5D77397346j161651k094040q00400j563606k79694j498527o957131J644020k01301
1619.2D64485016n11551j977310m45633j254501m074555N35698l01094L97987k100525
$$ plain form
1627.9 454753532 453317299 453250237 452814407 452281418 451095238 451669044 451700058 447207832 445921783
1636.6 445921783 447803345 447420731 447594147 448748970 448758354 449634705 449163208 450728188 452061996
1645.3 452061996 450521698 451945496 451552734 453995132 455877991 459297867 462063980 457676849
1653 457676849 457104111 460350494 464409866 466923065 469526062 471542892 474101562 476701546 479540558
1661.6 479540558 481821060 482340622 485805779 488524361 491535645 494567680 497090759 498403702
1669.4 498403702 501139641 505450401 507956429 511795387 516099968 519649811 520422707 523574905
1677.1 523574905 527084770 530091934 533330727 534885139 538730659 542866516 542775574 541812325 548840561
1685.8 548840561 554932175 559167519 561497993 563693390 566271362 569049644 571814461 573949051
$$ packed form
1627.9D54753532j436233o7062m35830n32989j186180N73806L1014m492226j286049
1636.6D45921783J881562l82614J73416J154823R384Q76351m71497J564980J333808
1645.3D52061996j540298J423798l92762K442398J882859L419876K766113m387131
1653D57676849n72738L246383M059372K513199K602997K016830K558670K599984K839012
1661.6D79540558K280502N19562L465157K718582L011284L032035K523079J312943
1669.4D98403702K735939M310760K506028L838958M304581L549843P72896L152198
1677.1E23574905L509865L007164L238793J554412L845520M135857r0942r63249P028236
1685.8E48840561O091614M235344K330474K195397K577972K778282K764817K134590
$$ plain form
1693.5 573949051 577404060 581063080 579693146 583404541 587568474 592876244 593755341 589250488
1701.2 589250488 594147720 597519836 599251862 599452705 600813751 600209770 602016563 604785538 605856094
1709.9 605856094 606493988 607869415 609823799 611180878 610629272 608767128 610577698 611456718 605678368
1718.5 605678368 608671036 611604004 613051910 613559761 613824348 613892937 615034943 616036186 616027374
1727.2 616027374 616599693 617313690 616144104 615155067 618164101 621172981 616754684 612487755 616889610
1735.9 616889610 620418358 621362648 623539009 623695679 621000748 624143791 626189156 626026535 627033157
1744.6 627033157 630039825 632199097 633630104 635556374 635969162 639783516 640838928 641057587 644976578
1753.3 644976578 647121964 649602585 652451477 652874756 654636459 657902832 660813675 664305649
$$ packed form
1693.5E73949051L455009L659020j369934L711395M163933N307770Q79097m504853
1701.2E89250488M897232L372116J732026K00843J361046o03981J806793K768975J070556
1709.9F05856094O37894J375427J954384J357079n51606j862144J810570Q79020n778350
1718.5F05678368K992668K932968J447906N07851K64587O8589J142006J001243q812
1727.2F16027374N72319P13997j169586r89037L009034L008880m418297m266929M401855
1735.9F16889610L528748R44290K176361J56670k694931L143043K045365j62621J006622
1744.6F27033157L006668K159272J431007J926270M12788L814354J055412K18659L918991
1753.3F44976578K145386K480621K848892M23279J761703L266373K910843L491974
$$ plain form
1761 664305649 664330750 663929977 666820374 668318710 669748383 671541367 673337708 672737274 675232697
1769.7 675232697 679598007 679944458 678988037 678044128 681510239 683351517 682036743 683606110 684234619
1778.3 684234619 685838394 686697311 686197510 687642975 689720001 691616898 691434784 691757584 692587585
1787 692587585 692686844 692588196 693368225 693599014 693473663 692457352 692801743 696472244 697801666 697803802
1796.7 697803802 699273834 700825882 700334396 698312988 699658051 699029083 698882217 699967270 700772095
1805.3 700772095 702241821 703104477 703820038 704750290 706513214 705709305 705232010 705442429 704771423
1814 704771423 705239487 704984283 705725327 706126862 707202454 708936157 709551697 710721817 710448914
1822.7 710448914 711112976 711763687 708450851 707449417 708891602 710563126 710886002 708666611 709293518
$$ packed form
1761F64305649K5101m00773K890397J498336J429673J792984J796341o00434K495423
1769.7F75232697M365310L46451r56421r43909L466111J841278j314774J569367O28509
1778.3F84234619J603775Q58917m99801J445465K077026J896897j82114L22800Q30001
1787F92587585R9259r8648P80029K30789j25351j016311L44391L670501J329422K136
1796.7F97803802J470032J552048m91486k021408J345063o28968j46866J085053Q04825
1805.3G00772095J469726Q62656P15561R30252J762924q03909m77295K10419o71006
1814G04771423M68064k55204P41044M01535J075592J733703O15540J170120k72903
1822.7G10448914O64062O50711l312836j001434J442185J671524L22876k219391O26907
$$ plain form
1831.4 709293518 711950302 713096313 713887787 714255676 713958588 713265686 711867294 712340775 712102203
1840.1 712102203 712424240 713082047 714458618 715896378 712158508 714333267 716500320 716520844 715744019
1848.7 715744019 715304565 714991302 713787842 713836823 713647537 714419022 715458145 716249924 717037888
1857.4 717037888 717033768 717658005 717493591 717258682 716177750 715702820 715609512 715431519 716345139 716163177
1867.1 716163177 717526093 717739944 717538452 718674774 719257965 719680710 718894882 718625565 717772369
1875.7 717772369 717321472 717261047 717542572 718532257 719032669 720627441 721063690 721343384 721198730 720447693
1885.4 720447693 720397568 719756317 720329666 719885025 718569870 719441833 720926819 721838837 722697678
1894.1 722697678 723245392 722604599 722950745 722354584 721724472 721296539 720898895 721203766 721264877 722034073
$$ packed form
1831.4G09293518K656784J146011P91474L67889k97088o92902j398392M73481k38572
1840.1G12102203L22037O57807J376571J437760l737870K174759K167053K0524p76825
1848.7G15744019m39454l13263j203460M8981j89286P71485J039123P91779P87964
1857.4G17037888m120O24237j64414k34909j080932m74930r3308j77993R13620j81962
1867.1G16163177J362916K13851k01492J136322N83191M22745p85828k69317q53196
1875.7G17772369m50897o0425K81525R89685N00412J594772M36249K79694j44654p51037
1885.4G20447693n0125o41251N73349m44641j315155Q71963J484986R12018Q58841
1894.1G22697678N47714o40793L46146n96161o30112m27933l97644L04871O1111P69196
$$ plain form
1903.7 722034073 722208710 722961731 723646469 723857880 724049225 723290558 722338028 721415787 721693268 721098938
1913.3 721098938 721201935 721751022 722302704 724593430 723866425 723312912 724116821 724561005 724899445
1922 724899445 723245850 721778183 721526794 722036285 722117004 722636795 723418503 724144135 725090561 725533905
1931.7 725533905 725903015 725037537 724657364 724034958 723107071 722682190 722299728 722549896 722794037 724871063
1941.3 724871063 725392151 724137268 725380707 725893631 725273285 724438553 724441223 723944778 723445282 723300781
1951 723300781 723125000 723817749 724684525 725778885 726041794 726520386 726844330 726639252 726279831 725465240
1960.6 725465240 725105438 724321671 724342804 724811783 725841904 727134476 727228470 727353363 727384415 727635727
1970.2 727635727 726951065 726483002 726303864 725750427 725837936 725639725 726077576 726241760 726531372 727272263
$$ packed form
1903.7G22034073J74637P53021O84738K11411J91345p58667r52530r22241K77481n94330
1913.3G21098938J02997N49087N51682K290726p27005n53513Q03909M44184L38440
1922G24899445j653595j467667k51389N09491Q0719N19791P81708P25632R46426M43344
1931.7G25533905L69110q65478l80173o22406r27887m24881l82462K50168K44141K077026
1941.3G24871063N21088j254883J243439N12924o20346q34732K670m96445m99496j44501
1951G23300781j75781O92749Q66776J094360K62909M78592L23944k05078l59421q14591
1960.6G25465240l59802p83767K1133M68979J030121J292572R3994J24893L1052K51312
1970.2G27635727o84662m68063j79138n53437Q7509j98211M37851J64184K89612P40891
$$ plain form
1979.9 727272263 727920303 728280106 727695236 727556763 727083740 726593094 726283722 726272049 726345978 726227417
1989.5 726227417 727267990 728023605 727944717 727520905 727806320 727890320 727350235 727117310 726641159 726486435
1999.2 726486435 726056442 726321564 726839752 727046432 727252579 726986771 727235718 726897278 726735382 726460342
2008.8 726460342 725633926 725039444 724524078 724652252 724731674 725110016 725468140 725721512 725155945 724460373
2018.5 724460373 724331055 723595505 723090210 722283783 722258987 722143402 721770706 722233276 722387695 723039932
2028.1 723039932 722790604 722400742 722169724 721647568 721327286 720321426 719492798 718792801 718725586 718782425
2037.7 718782425 719110107 719617233 719588089 719669037 719375839 719207611 718508987 718034439 717417145 716683273
2047.4 716683273 716836777 716680450 717012177 717230377 717586899 717972794 718332825 718650055 718075409 717629700
$$ packed form
1979.9G27272263O48040L59803n84870j38473m73023m90646l09372j1673P3929j18561
1989.5G26227417J040573P55615p8888m23812K85415Q4000n40085k32925m76151j54724
1999.2G26486435m29993K65122N18188K06680K06147k65808K48947l38440j61896k75040
2008.8G26460342q26416n94482n15366J28174P9422L78342L58124K53372n65567o95572
2018.5G24460373j29318p35550n05295q06427k4796j15585l72696M62570J54419O52237
2028.1G23039932k49328l89862k31018n22156l20282j005860q28628o99997o7215N6839
2037.7G18782425L27682N07126k9144Q0948k93198j68228o98624m74548o17294p33872
2047.4G16683273J53504j56327L31727K18200L56522L85895L60031L17230n74646m45709
$$ plain form
2057 717629700 716776733 716328735 715827637 715610809 716221848 716934586 718051910 718207626 718371277 718660278
2066.7 718660278 718905640 718468246 717484818 717262268 716893311 716898270 716814499 717305756 717670364 717793732
2076.3 717793732 718541031 718788452 718933640 718235931 718116226 717966919 717546539 717529221 717053223 717440567
2086 717440567 717496414 717725296 718095016 718442383 718730240 718658600 719096146 718571396 718292389 717930908
2095.6 717930908 717711029 717708588 717249756 717915802 718360291 718815079 719128113 719251328 719224854 719143600
2105.2 719143600 719506073 719218216 719132385 718722610 718529968 718758087 718937607 719279480 719327927 719597702
2114.9 719597702 719362488 719303055 719310379 719423141 719481506 719015961 719181290 719206085 719147034 718974686 719219437
2125.5 719219437 719425888 719335556 719540558 719233017 719272537 719197998 719125137 718879852 718685532 718940887
$$ packed form
2057G17629700q52967m47998n01098k16828O11039P12738J117324J55716J63651K89001
2066.7G18660278K45362m37394r83428k22550l68957M959q3771M91257L64608J23368
2076.3G17793732P47299K47421J45188o97709j19705j49307m20380j7318m75998L87344
2086G17440567N5847K28882L69720L47367K87857p1640M37546n24750k79007l61481
2095.6G17930908k19879k441m58832O66046M44489M54788L13034J23215k6474q1254
2105.2G19143600L62473k87857q5831m09775j92642K28119J79520L41873M8447K69775
2114.9G19597702k35214n9433P324J12762N8365m65545J65329K4795n9051j72348K44751
2125.5G19219437K06451r0332K05002l07541L9520p4539p2861k45285j94320K55355
$$ plain form
2135.1 718940887 718848267 719220047 719396057 719444351 719278564 719238815 719256897 719056091 719460449 719581985
2144.8 719581985 719681015 719195862 718999100 719531250 719681931 719360657 718897858 719566116 719487381 719082489
2154.4 719082489 719251251 719104156 719290314 719633942 719943771 719982986 720359268 720312271 720250244 720643158
2164.1 720643158 720843658 721142044 721089706 721504974 721501465 721755600 722475052 722333603 722422562 722926941
2173.7 722926941 723569946 723459320 723767242 724113007 724192657 724565353 724063950 724172516 724692459 725179596
2183.4 725179596 725144196 725262299 725993652 726095123 726518784 726835251 727188263 727225800 727311935 727511597
2193 727511597 727432785 727940826 727864532 727974319 728153229 728374557 728793182 728998260 729234924 729177322
2202.6 729177322 729853058 730313797 730369186 730339279 730814514 731263275 730879059 731353455 731364975 731482697
$$ packed form
2135.1G18940887r2620L71780J76010M8294j65787l9749J8082k00806M04358J21536
2144.8G19581985R9030m85153j96762N32150J50681l21274m62799O68258p8735m04892
2154.4G19082489J68762j47095J86158L43628L09829L9215L76282m6997o2027L92914
2164.1G20643158K00500K98386n2338M15268l509K54135P19452j41449Q8959N04379
2173.7G22926941O43005j10626L07922L45765P9650L72696n01403J08566N19943M87137
2183.4G25179596l5400J18103P31353J01471M23661L16467L53012L7537Q6135J99662
2193G27511597p8812N08041p6294J09787J78910K21328M18625K05078K36664n7602
2202.6G29177322O75736M60739N5389k9907M75235M48761l84216M74396J1520J17722
$$ plain form
2212.3 731482697 731962128 732272491 732423401 732063828 732562637 733069687 733404007 733029404 732671280 732999420
2221.9 732999420 733272476 733578262 733318024 733783112 734126205 734142532 734222260 734323273 734739609 734503021
2231.6 734503021 734869919 735129166 734800491 734698257 735106201 735118484 734764557 735495605 735779419 735836716
2241.2 735836716 735811539 736380386 737046432 736825638 736847610 736219940 736179276 736234970 736225052 736676636 737083206
2251.8 737083206 737652512 737723999 738246155 738448105 738491592 738089600 737773285 738221436 738133698 738627777
2261.5 738627777 738381577 738286743 738749008 739299316 740031357 739856339 740130310 740259171 740730057 740586700
2271.1 740586700 739997253 739850616 739436569 739823074 739871750 740609207 741014481 740877609 740818405 740184097
2280.8 740184097 740364761 739958420 739902573 739900589 740110703 740676575 740787506 741911774 742424088 743226700
$$ packed form
2212.3G31482697M79431L10363J50910l59573M98809N07050L34320l74603l58124L28140
2221.9G32999420K73056L05786k60238M65088L43093J6327P9728J01013M16336k36588
2231.6G34503021L66898K59247l28675j02234M07944J2283l53927P31048K83814N7297
2241.2G35836716k5177N68847O66046k20794K1972o27670m0664N5694r918M51584M06570
2251.8G37083206N69306P1487N22156K01950M3487m01992l16315M48151q7738M94079
2261.5G38627777k46200r4834M62265N50308P32041j75018K73971J28861M70886j43357
2271.1G40586700n89447j46637m14047L86505M8676P37457M05274j36872n9204o34308
2280.8G40184097J80664m06341n5847j984K10114N65872J10931J124268N12314Q02612
$$ plain form
2290.4 743226700 744137497 744901886 745480728 745172577 746025925 746239319 746269150 746308670 746219330 747092209
2300 747092209 748040619 749389114 750044556 750720901 751790543 752932892 754197540 754832077 755868530
2308.7 755868530 756724243 757637405 758464890 759141541 759922180 759772415 760583191 762549515 764767685
2317.4 764767685 766956711 768987656 771548233 773087234 774044342 775369720 775686188 775659866 776422577
2326.1 776422577 778195953 779992599 781599426 782402725 782149734 782304153 781613846 780725937 781059113
2334.8 781059113 783115845 785272369 784555054 784459839 786200409 787262192 786881409 787304535 787617645
2343.4 787617645 786032028 782630081 776975098 770962448 765204544 765353165 771602402 776643143
2351.2 776643143 782144165 786650772 789841080 794324646 795965195 800054321 801234512 801589203
$$ packed form
2290.4G43226700R10797P64389N78842l08151Q53348K13394K9831L9520q9340Q72879
2300G47092209R48410J348495O55442O76345J069642J142349J264648O34537J036453
2308.7G55868530Q55713R13162Q27485O76651P80639j49765Q10776J966324K218170
2317.4G64767685K189026K030945K560577J539001R57108J325378L16468k6322P62711
2326.1G76422577J773376J796646J606827Q03299k52991J54419o90307q87909L33176
2334.8G81059113K056732K156524p17315r5215J740570J061783l80783M23126L13110
2343.4G87617645j585617l401947n654983o012650n757904J48621O249237N040741
2351.2G76643143N501022M506607L190308M483566J640549M089126J180191L54691
$$ plain form
2358.9 801589203 802056046 801717224 801675339 800274277 800695648 797455521 794385071 791426849 789089127
2367.6 789089127 786499176 779969254 775457611 771568832 767277145 763980331 761946640 759374924
2375.3 759374924 756169739 753771591 750830765 748268967 745527267 742952347 740441666 737578278
2383 737578278 735452423 733547897 732650833 732154770 731660461 731595535 731550751 731277237 730678406 730577698
2392.6 730577698 730412903 730252609 729773331 728906403 728699265 728840866 728970337 728976212 729091034 728574295
2402.3 728574295 728319550 728620453 728201828 727567139 726976547 726554031 726127548 726088867 725873184 725606537
2411.9 725606537 725892105 725825958 725698166 725336685 724917297 724410706 724147720 723780899 722931442 722571869
2421.6 722571869 721997681 721723328 721582108 721560440 721785278 721510239 721092758 720311432 719780807 719166183
$$ packed form
2358.9H01589203M66843l38822m1885j401062M21371l240127l070450k958222k337722
2367.6G89089127k589951o529922m511643l888779m291687l296814k033691k571716
2375.3G59374924l205185k398148k940826k561798k741700k574920k510681k863388
2383G37578278k125855j904526q97064m96063m94309o4926m4784k73514n98831j00708
2392.6G30577698j64795j60294m79278q66928k07138J41601J29471N875J14822n16739
2402.3G28574295k54745L00903m18625o34689n90592m22516m26483l8681k15683k66647
2411.9G25606537K85568o6147j27792l61481m19388n06591k62986l66821q49457l59573
2421.6G22571869n74188k74353j41220k1668K24838k75039m17481p81326n30625o14624
$$ plain form
2431.2 719166183 718529358 718289642 718148041 717909622 717406998 717288666 717035294 716777649 716295013 715837250
2440.8 715837250 715532837 715041962 714966888 714325180 713703308 713077545 712598419 712419662 711919937 711932983
2450.5 711932983 711717148 711544724 711098709 710209656 709524918 709085083 709091797 708729935 708398743 708047028
2460.1 708047028 707659225 707306900 707176819 707099533 706667175 706566620 705945816 705399246 704776077 704143906
2469.8 704143906 704185791 703787079 703553619 703365707 703183670 702883911 702372360 701959686 701647110 701544724
2479.4 701544724 701211929 700988846 700493469 700138397 699871445 699575500 699507904 699099731 698964310 698741379
2489.1 698741379 698551559 697934799 697616501 697714767 697068024 697215576 697011795 696401672 696167831 695937500
2498.7 695937500 695856323 695839310 695888748 695275574 694997025 694395828 693673019 693789673 693670883 693594208
$$ packed form
2431.2G19166183o36825k39716j41601k38419n02624j18332k53372k57645m82636m57763
2440.8G15837250l04413m90875p5074o41708o21872o25763m79126j78757m99725J3046
2450.5G11932983k15835j72424m46015q89053o84738m39835O714l61862l31192l51715
2460.1G08047028l87803l52325j30081p7286m32358j00555o20804n46570o23169o32171
2469.8G04143906M1885l98712k33460j87912j82037k99759n11551m12674l12576j02386
2479.4G01544724l32795k23083m95377l55072k66952k95945o7596m08173j35421k22931
2489.1F98741379j89820o16760l18298R8266o46743J47552k03781o10123k33841k30331
2498.7F95937500q1177j7013M9438o13174k78549o01197p22809J16654j18790p6675
$$ plain form
2508.3 693594208 693317261 693362274 693568039 693730469 693539429 692728348 692485352 692584763 692801819 692399673
2518 692399673 691824646 691454926 690968704 690651779 690363083 690406723 689967728 689338684 688977737 688889236
2527.6 688889236 688883133 688425827 687834396 687084045 686867142 686512604 686060944 685923157 685506134 685412140
2537.3 685412140 685346222 685088196 684598312 684081955 683509827 683099747 682753601 682296143 682152100 681484604
2546.9 681484604 681140747 681061478 680479584 679658508 679010620 678947678 678748779 678766251 678555450 678311768
2556.6 678311768 678055267 677398987 676777725 675930786 675826645 675634918 675187378 674784622 674325409 674290237
2566.2 674290237 673789062 673358078 673057175 673030777 672841873 672267761 671998825 671280823 670550385 670294418
2575.9 670294418 670420532 670126877 669929810 669886627 669183044 668605652 668071365 667762299 667016449 666555634
$$ packed form
2508.3F93594208k76947M5013K05765J62430j91040q11081k42996R9411K17056m02146
2518F92399673n75027l69720m86222l16925k88696M3640m38995o29044l60947q8501
2527.6F88889236o103m57306n91431p50351k16903l54538m51660j37787m17023r3994
2537.3F85412140o5918k58026m89884n16357n72128m10080l46146m57458j44043o67496
2546.9F81484604l43857p9269n81894q21076o47888o2942j98899J7472k10801k43682
2556.6F78311768k56501o56280o21262q46939j04141j91727m47540m02756m59213l5172
2566.2F74290237n01175m30984l00903k6398j88904n74112k68936p18002p30438k55967
2575.9F70294418J26114k93655j97067m3183p03583n77392n34287l09066p45850m60815
$$ plain form
2585.5 666555634 666526108 665900574 665912628 666076736 665730896 665012817 664890060 665123291 664812012 664380569
2595.1 664380569 663841171 663369293 662553558 662088547 661933441 661810226 661833267 661803970 661820526 661053162
2604.8 661053162 660645218 660393372 659953003 659466400 658492737 658065491 657568588 657509308 657746201 657493668
2614.4 657493668 657248230 656723709 655687180 654542923 654097214 653500519 652997589 652533569 651785812
2623.1 651785812 651512375 651164169 650809021 649924850 648893204 648313217 647681046 646878357 646166077
2631.8 646166077 645512543 644428406 643797760 643259811 642780533 642339096 641480484 640874252 640219421
2640.5 640219421 639496689 638302956 637562332 637200127 636362457 635548668 634373932 633875198 633742104
2649.1 633742104 633264999 632574844 631704483 631113091 630751915 630409813 629329720 628111496 626992111
$$ packed form
2585.5F66555634k9526o25534J2054J64108l45840p18079j22757K33231l11279m31443
2595.1F64380569n39398m71878q15735m65011j55106j23215K3041k9297J6556p67364
2604.8F61053162m07944k51846m40369m86603r73663m27246m96903n9280K36893k52533
2614.4F57493668k45438n24521j036529j144257m45709n96695n02930m64020p47757
2623.1F51785812k73437l48206l55148q84171j031646n79987o32171q02689p12280
2631.8F46166077o53534j084137o30646n37949m79278m41437q58612o06232o54831
2640.5F40219421p22732j193733p40624l62205q37670q13789j174736m98734j33094
2649.1F33742104m77105o90155q70361n91392l61176l42102j080093j218224j119385
$$ plain form
2657.8 626992111 626268654 626081314 625530014 624889755 624534721 624523659 623837814 622994919 622229919 621420975
2667.5 621420975 620937843 620135765 619721947 618715134 617608261 617046928 616407318 616430244 616292801
2676.1 616292801 616286850 616014404 615247993 614670715 613824768 612789879 612111053 612018318 611339340 610633926
2685.8 610633926 610440331 610147171 609752579 609271278 608838348 608166008 607659683 606865997 606022453 605463715
2695.4 605463715 604753838 604318123 603880196 603681641 603474693 603044434 602219505 601287537 600585632 599791489
2705.1 599791489 599569016 599057655 598314934 597668266 596797943 596009674 595322456 595075684 594647903 594230843
2714.7 594230843 593680229 592837410 591916542 590911865 590442505 589831200 589475822 589574051 589536819 589258766
2724.4 589258766 588856239 588195686 587069550 586604576 586191101 585595512 584922562 584116936 583793716
$$ packed form
2657.8F26992111p23457j87340n51300o40259l55034j1062o85845q42895p65000q08944
2667.5F21420975m83132q02078m13818j006813j106873n61333o39610K2926j37443
2676.1F16292801n951k72446p66411n77278q45947j034889o78826r2735o78978p05414
2685.8F10633926j93595k93160l94592m81301m32930o72340n06325p93686q43544n58738
2695.4F05463715p09877m35715m37927j98555k06948m30259q24929r31968p01905p94143
2705.1E99791489k22473n11361p42721o46668q70323p88269o87218k46772m27781m17060
2714.7E94230843n50614q42819r20868j004677m69360o11305l55378R8229l7232k78053
2724.4E89258766m02527o60553j126136m64974m13475n95589o72950q05626l23220
$$ plain form
2733 583793716 583279266 582710457 581967850 581706009 581775970 581349297 581137772 580578346 580169640 580025826
2742.7 580025826 579482460 579006348 578545876 578014908 577474289 577157059 577086601 576762428 576429749 576160507
2752.3 576160507 575142288 574404449 574225006 573875008 573636055 573218994 573092384 572837296 572409019
2761 572409019 572149963 571644020 571218376 570598412 570032387 569440269 569058228 568923111 568724556 568766403
2770.7 568766403 568593407 568236809 567459106 566971130 566626511 565968628 565529900 564780426 564331322 563796387
2780.3 563796387 563081703 562465820 561673508 561360207 561211052 560857468 560136414 559471359 558795204 557986259
2789.9 557986259 557367783 556721382 555756302 554374237 553552017 553063126 552706032 552219353 551214867
2798.6 551214867 550247002 549129066 548309860 547313004 546134224 545070686 543881149 542761154 541396408
$$ packed form
2733E83793716n14450n68809p42607k61841O9961m26673k11525n59426m08706j43814
2742.7E80025826n43366m76112m60472n30968n40619l17230p0458l24173l32679k69242
2752.3E76160507j018219p37839j79443l49998k38953m17061j26610k55088m28277
2761E72409019k59056n05943m25644o19964n66025n92118l82041j35117j98555M1847
2770.7E68766403j72996l56598p77703m87976l44619o57883m38728p49474m49104n34935
2780.3E63796387p14684o15883p92312l13301j49155l53584p21054o65055o76155q08945
2789.9E57986259o18476o46401r65080j382065q22220m88891l57094m86679j004486
2798.6E51214867r67865j117936q19206r96856j178780j063538j189537j119995j364746
$$ plain form
2807.3 541396408 540715332 540350304 539405098 538125458 537021599 536002274 534258728 532936134 532200089
2816 532200089 531131325 529882545 528524094 527083244 526084137 525054207 523498039 522622070 521484680
2824.7 521484680 519561081 517945518 516551208 515078735 513167458 511380463 509982224 508681297
2832.4 508681297 507292633 505920143 504384079 502786942 501547623 499323387 496508255 494378166
2840.1 494378166 492695847 490608902 488101654 486045990 483736191 481220169 478886414 476581383
2847.8 476581383 473987007 471099167 468689651 466408882 463978348 461650696 460258522 459016228
2855.5 459016228 457258034 456215286 455518341 454670296 453183022 451401939 449832191 447873383 445475922
2864.2 445475922 443307877 441465454 438960419 436306114 433638840 431002769 428663406 426085281
$$ packed form
2807.3E41396408o81076l65028r45206j279640j103859j019325j743546j322594p36045
2816E32200089j068764j248780j358451j440850r99107j029930j556168q75969j137390
2824.7E21484680j923599j615563j394310j472473j911277j786995j398239j300927
2832.4E08681297j388664j372490j536064j597137j239319k224236k815132k130089
2840.1D94378166j682319k086945k507248k055664k309799k516022k333755k305031
2847.8D76581383k594376k887840k409516k280769k430534k327652j392174j242294
2855.5D59016228j758194j042748o96945q48045j487274j781083j569748j958808k397461
2864.2D45475922k168045j842423k505035k654305k667274k636071k339363k578125
$$ plain form
2871.9 426085281 423540688 420828819 418185043 415351143 412599220 410267754 407593689 405053596
2879.6 405053596 402835083 400923309 398791809 397078857 395766487 393931961 392747650 391438370
2887.3 391438370 389951363 388751869 387491341 387021103 386851463 386350403 385875282 385685539 384924316
2896 384924316 383769150 383147736 383022919 383126411 382625465 381731529 380785027 380065269 379565392 378940125
2905.7 378940125 378439217 377528038 376190834 374767303 373474236 372413635 370966148 368709984 366367264
2914.3 366367264 364175644 361798553 360108185 358408203 356092339 353836555 351858368 350450325
2922.1 350450325 348965302 347561073 346614990 345969887 345450096 344797897 344392395 344645882 345514107
2930.7 345514107 346180954 347281876 349046822 350366631 351514053 352960777 354689255 356593857
$$ packed form
2871.9D26085281k544593k711869k643776k833900k751923k331466k674065k540093
2879.6D05053596k218513j911774k131500j712952j312370j834526j184311j309280
2887.3C91438370j487007j199494j260528m70238j69640n01060m75121j89743p61223
2896C84924316j155166o21414j24817J03492n00946q93936r46502p19758m99877o25267
2905.7C78940125n00908r11179j337204j423531j293067j060601j447487k256164k342720
2914.3C66367264k191620k377091j690368j699982k315864k255784j978187j408043
2922.1C50450325j485023j404229r46083o45103n19791o52199m05502K53487Q68225
2930.7C45514107O66847J100922J764946J319809J147422J446724J728478J904602
$$ plain form
2938.5 356593857 359235268 362063255 364317932 367018013 370424004 373550224 376090355 378602257
2946.2 378602257 381244850 384220963 387206459 390087204 392983665 395922966 399148941 402182350
2953.9 402182350 405222130 407837639 410200920 412873840 415904198 419456940 422418861 425335655
2961.6 425335655 428368187 430865288 433183937 435427933 437952957 441019325 444054413 446406517
2969.3 446406517 448935814 451472321 453949013 456645660 459195213 461498756 463236465 465550232
2977 465550232 468049049 470539093 472795982 474144707 475950012 477915306 479917870 481529770 483262596
2985.7 483262596 485512085 487012901 488344688 489669838 491173058 492393570 493111305 494000969 495403137
2994.4 495403137 496553154 496780624 497593193 498283615 498461456 498749390 499109955 499541397 499686966
$$ packed form
2938.5C56593857K641411K827987K254677K700081L405991L126220K540131K511902
2946.2C78602257K642593K976113K985496K880745K896461K939301L225975L033409
2953.9D02182350L039780K615509K363281K672920L030358L552742K961921K916794
2961.6D25335655L032532K497101K318649K243996K525024L066368L035088K352104
2969.3D46406517K529297K536507K476692K696647K549553K303543J737709K313767
2977D65550232K498817K490044K256889J348725J805305J965294K002564J611900J732826
2985.7D83262596K249489J500816J331787J325150J503220J220512P17735Q89664J402168
2994.4D95403137J150017K27470Q12569O90422J77841K87934L60565M31442J45569
$$ plain form
3003.1 499686966 499773827 499142113 498693924 498728523 498570900 498493614 498144646 497822952 497265930 496440735
3012.7 496440735 495770073 495732880 495694809 494748268 493465500 492297707 491665764 490830193 489931221 489007645
3022.4 489007645 487922325 487160492 485804939 484354019 483543434 482876930 481800232 480847893 479721336
3031 479721336 478230705 477343216 475889626 474332466 473166924 471800919 470290413 468894272 467952690
3039.7 467952690 466594048 465132523 463678093 462161522 460696182 459206467 457874184 456366768
3047.4 456366768 455150299 453676109 451916771 450288544 448807106 447472763 445956688 444791565
3055.1 444791565 443196526 441319466 439964752 438864555 437463722 435785065 434722328 433479118
3062.9 433479118 431820679 429841232 428177605 426943512 425296860 423936920 422592850 421162605
$$ packed form
3003.1D99686966Q6861o31714m48189L4599j57623p7286l48968l21694n57022q25195
3012.7D96440735o70662l7193l8071r46541j282768j167793o31943q35571q98972r23576
3022.4D89007645j085320p61833j355553j450920q10585o66504j076698r52339j126557
3031D79721336j490631q87489j453590j557160j165542j366005j510506j396141r41582
3039.7D67952690j358642j461525j454430j516571j465340j489715j332283j507416
3047.4D56366768j216469j474190j759338j628227j481438j334343j516075j165123
3055.1D44791565j595039j877060j354714j100197j400833j678657j062737j243210
3062.9D33479118j658439j979447j663627j234093j646652j359940j344070j430245
$$ plain form
3070.6 421162605 419585915 417789040 415868759 414287834 413513565 412213783 410510445 408808327
3078.3 408808327 407072372 405508842 404267426 403159943 401468506 399790611 398340149 396872444
3086 396872444 395177002 393941383 392970772 391388359 389919205 388205376 386674232 385507240 384292641
3094.7 384292641 382946358 381391602 380041962 378156586 376495590 375106850 373310242 371735992
3102.4 371735992 370397530 369242401 367744331 366310654 365139465 363827972 362232895 360488358
3110.1 360488358 359122429 357934036 356863213 355748138 354459648 352774429 351339035 350286865
3117.8 350286865 348432541 346538658 345644531 345019341 343234558 341386566 340431671 339282112 338157082
3126.5 338157082 336855240 335201378 333775597 332568626 331050568 329728813 328833237 327668800
$$ packed form
3070.6D21162605j576690j796875j920281j580925p74269j299782j703338j702118
3078.3D08808327j735955j563530j241416j107483j691437j677895j450462j467705
3086C96872444j695442j235619r70611j582413j469154j713829j531144j166992j214599
3094.7C84292641j346283j554756j349640j885376j660996j388740j796608j574250
3102.4C71735992j338462j155129j498070j433677j171189j311493j595077j744537
3110.1C60488358j365929j188393j070823j115075j288490j685219j435394j052170
3117.8C50286865j854324j893883q94127o25190j784783j847992r54895j149559j125030
3126.5C38157082j301842j653862j425781j206971j518058j321755q95576j164437
$$ plain form
3134.2 327668800 326315269 324721222 323491364 322375526 321133003 319661102 317921104 316685104
3141.9 316685104 315289421 314281616 313452301 312381554 311547318 310240421 308687859 307384109 306519547
3150.6 306519547 305125542 303571014 302561684 301563244 300608196 299320049 298258209 297190647 296164398
3159.3 296164398 295132484 293847637 293067627 291888771 290358772 289151688 288384800 287536144 286557064
3168 286557064 285342026 283474312 282525921 282078094 281002369 279817867 279233532 278588066 277432632
3176.6 277432632 276596394 275684929 274708710 273528252 272599525 271588135 270358677 269567680 268413544
3185.3 268413544 267650738 266636791 265660095 264864902 263623390 262819672 261752701 261213951 260526791
3194 260526791 259449139 258720779 258068447 257704315 256448708 255456429 254832916 254018269 253191929 252060375
$$ packed form
3134.2C27668800j353531j594047j229858j115838j242523j471901j739998j236000
3141.9C16685104j395683j007805q29315j070747q34236j306897j552562j303750q64562
3150.6C06519547j394005j554528j009330r98440r55048j288147j061840j067562j026249
3159.3B96164398j031914j284847p80010j178856j529999j207084p66888q48656r79080
3168B86557064j215038j867714r48391m47827j075725j184502n84335o45466j155434
3176.6B77432632q36238r11465r76219j180458r28727j011390j229458p90997j154136
3185.3B68413544p62806j013947r76696p95193j241512q03718j066971n38750o87160
3194B60526791j077652p28360o52332l64132j255607r92279o23513q14647q26340j131554
$$ plain form
3203.6 252060375 251496525 250968418 250042553 249105778 248676662 247752247 246535549 246030388 245523167
3212.3 245523167 244955521 243571854 242809734 242307968 241385021 241246109 240323906 239386711 239102383
3221 239102383 238650379 237926674 237200737 236741028 236012859 235239334 234482021 234131546 233600998 232656193
3230.7 232656193 232154083 231656342 230774746 229841957 229462357 229062786 228679466 228404636 227819176 227081871
3240.3 227081871 226368427 225871887 225114021 224742851 224387608 223622894 223237686 222598877 221667137 220795708
3249.9 220795708 220654411 220797729 220279636 219636822 219313984 218831863 217963314 217488174 217319050 217005978
3259.6 217005978 216214657 215540028 215326233 215197105 215054989 214336128 213832474 213318558 212739773 212384014
3269.2 212384014 212002392 211925755 211423702 211206646 210973091 210469131 209892063 209020958 208974724 208567963
$$ packed form
3203.6B52060375n63850n28107r25865r36775m29116r24415j216698n05161n07221
3212.3B45523167n67646j383667p62120n01766r22947j38912r22203r37195k84328
3221B39102383m52004p23705p25937m59709p28169p73525p57313l50475n30548r44805
3230.7B32656193n02110m97741q81596r32789l79600l99571l83320k74830n85460p37305
3240.3B27081871p13444m96540p57866l71170l55243p64714l85208o38809r31740q71429
3249.9B20795708j41297J43318n18093o42814l22838m82121q68549m75140j69124l13072
3259.6B17005978p91321o74629k13795j29128j42116p18861n03654n13916n78785l55759
3269.2B12384014l81622p6637n02053k17056k33555n03960n77068q71105m6234m06761
$$ plain form
3278.9 208567963 207714729 207155018 207118359 207336502 206945210 206481266 206117115 206062698 205578976 205112782
3288.5 205112782 205170383 204752159 204244499 203668861 203362293 203280602 203142109 202746563 202350826 202373810
3298.2 202373810 201992187 201614151 201531925 201086102 199912033 198947926 198783436 198980713 199432831 199242611
3307.8 199242611 198177586 197460117 197701912 197271786 196736565 196752853 196031857 195753937 195454254 195343113
3317.4 195343113 195522404 195059433 194805241 194244308 193658237 193421116 193481827 193068428 192214680 191891060
3327.1 191891060 191382561 191267452 191424103 191384106 190684471 189661026 189562149 189631500 189719296 189348412
3336.7 189348412 188402100 187733669 187586861 187536449 187060413 186624222 186232471 186121578 186009960 185716896
3346.4 185716896 185346279 185018959 184866219 184261284 184018650 183773613 183309212 183377361 183205051 182893753
$$ packed form
3278.9B08567963q53234n59711l6659K18143l91292m63944l64151n4417m83722m66194
3288.5B05112782N7601m18224n07660n75638l06568q1691j38493l95546l95737K2984
3298.2B02373810l81623l78036q2226m45823j174069r64107j64490J97277M52118j90220
3307.8A99242611j065025p17469K41795m30126n35221J6288p20996k77920k99683j11141
3317.4A95343113J79291m62971k54192n60933n86071k37121O0711m13399q53748l23620
3327.1A91891060n08499j15109J56651l9997o99635j023445r8877O9351Q7796l70884
3336.7A89348412r46312o68431j46808n0412m76036m36191l91751j10893j11618k93064
3346.4A85716896l70617l27320j52740o04935k42634k45037m64401O8149j72310l11298
$$ plain form
3356 182893753 182889977 182972393 182527599 181937752 181585274 181152515 180987339 180984917 180767498 180272732 179708939
3366.6 179708939 179250908 179360561 179446754 178930302 178270779 177937832 178533020 178468189 177724075 177593212
3376.3 177593212 177391567 177469673 177631035 177438221 177056313 176782932 176484509 175443039 174939041 175389595
3385.9 175389595 175434799 175236530 174978142 174578915 174657249 175001335 174984207 174380894 174026642 174270630
3395.6 174270630 174260788 174261627 174137154 173973446 174038429 173849468 173873558 173753357 173393440 173345795 173244228
3406.2 173244228 172911415 173051052 173497715 173427944 173450394 173291512 172950592 173237152 173564548 173466949
3415.8 173466949 173539982 173911819 173711662 173352623 173055401 173206387 173730927 173193207 172792244 173264942
3425.5 173264942 173623505 173636799 173544292 173659172 174005642 174278984 174221535 174064140 173947296 174176235
$$ packed form
3356A82893753l776Q2416m44794n89847l52478m32759j65176k422k17419m94766n63793
3366.6A79708939m58031J09653Q6193n16452o59523l32947N95188o4831p44114j30863
3376.3A77593212k01645P8106J61362j92814l81908k73381k98423j041470n03998M50554
3385.9A75389595M5204j98269k58388l99227P8334L44086j7128o03313l54252K43988
3395.6A74270630r842Q39j24473j63708O4983j88961K4090j20201l59917m7645j01567
3406.2A73244228l32813J39637M46663o9771K2450j58882l40920K86560L27396r7599
3415.8A73466949P3033L71837k00157l59039k97222J50986N24540n37720m00963M72698
3425.5A73264942L58563J3294r2507J14880L46470K73342n7449j57395j16844K28939
$$ plain form
3435.1 174176235 174331703 174402218 174788055 175100498 175387974 175700054 176312370 176382256 176313000 176848869
3444.7 176848869 177204170 177431850 176826515 177030334 177829533 178060570 178579006 178727169 178900146 179088364
3454.4 179088364 179147053 179441090 179695301 179995670 180090446 180498505 180953407 181222248 181610889 181905766
3464 181905766 182357712 182742634 182695389 182738533 183359489 183958168 184453735 184902534 185240040 185341263
3473.7 185341263 185352345 186063805 186888618 187313957 187311401 187870541 188914032 189532280 190069561 189869919
3483.3 189869919 190271950 190820961 190636177 191352654 192466125 193382931 193860893 193820629 193826141 194334259
3493 194334259 195144196 196178646 196812668 196137505 196185188 197133827 198050079 198793049 199082890 199921513
3502.6 199921513 200952854 201193638 201233387 201916313 203126888 204233723 203946648 203416996 204829769
$$ packed form
3435.1A74176235J55468P0515L85837L12443K87476L12080O12316O9886o9256N35869
3444.7A76848869L55301K27680o05335K03819P99199K31037N18436J48163J72977J88218
3454.4A79088364N8689K94037K54211L00369R4776M08059M54902K68841L88641K94877
3464A81905766M51946L84922m7245M3144O20956N98679M95567M48799L37506J01223
3473.7A85341263J1082P11460Q24813M25339k556N59140J043491O18248N37281j99642
3483.3A89869919M02031N49011j84784P16477J113471R16806M77962m0264N512N08118
3493A94334259Q09937J034450O34022o75163M7683R48639R16252P42970K89841Q38623
3502.6A99921513J031341K40784L9749O82926J210575J106835k87075n29652J412773
$$ plain form
3511.3 204829769 205798378 206125870 206840096 207769165 208576832 209094105 210070190 210740528 210998726 211542263
3520.9 211542263 212637062 213262386 213470364 214871159 216240845 217132835 217396088 217747803 217715931
3529.6 217715931 218033714 219395332 220312176 221788826 222666035 222956409 223180923 223579731 225361538
3538.3 225361538 226709404 227452583 227982273 229246140 230424576 231140156 232021618 232542591 233787079
3547 233787079 233846493 235584698 237599525 238691921 240598774 240245495 241170025 242584362 244072208
3555.6 244072208 245857944 246302395 248421955 249916248 249832306 250570278 253379402 255117130 255925159
3564.3 255925159 259949760 260577564 259505787 259503746 260082817 263716545 265490932 266827183 268765717
3573 268765717 270750713 272120094 273854885 275681839 276137733 278938847 280622730 281029377 283456268
$$ packed form
3511.3B04829769R68609L27492P14226R29069Q07667N17273R76085O70338K58198N43537
3520.9B11542263J094799O25324K07978J400795J369686Q91990K63253L51715l1872
3529.6B17715931L17783J361618R16844J476650Q77209K90374K24514L98808J781807
3538.3B25361538J347866P43179N29690J263867J178436P15580Q81462N20973J244488
3547B33787079N9414J738205K014827J092396J906853l53279R24530J414337J487846
3555.6B44072208J785736M44451K119560J494293q3942P37972K809124J737728Q08029
3564.3B55925159M024601O27804j071777k041N79071L633728J774387J336251J938534
3573B68765717J984996J369381J734791J826954M55894K801114J683883M06647K426891
$$ plain form
3581.7 283456268 286262226 288304176 289232311 292602539 295017643 295358887 296721077 296538086 300240211
3590.4 300240211 303401833 306005230 308410950 310240459 313357830 312324486 314802971 318985519
3598.1 318985519 319919090 322512665 324026031 325637932 328088608 330530968 333836517 337481956
3605.8 337481956 340204430 339807701 343268433 343781967 344243469 350941505 351852951 351458321 355154037
3614.5 355154037 354425964 358849068 364352417 365605087 366794548 366410789 368758583 373264046 376369514
3623.1 376369514 379176941 383053169 386380615 389847679 396669273 396674995 387008781 391326447 396974258
3631.8 396974258 402933998 403891640 402250633 405500717 409410210 412460022 413100510 414502792 417521629
3640.5 417521629 420519142 421986160 423091660 426532936 430644798 436492271 435839043 433269348
$$ packed form
3581.7B83456268K805958K041950R28135L370228K415104L41244J362190j82991L702125
3590.4C00240211L161622K603397K405720J829509L117371j033344K478485M182548
3598.1C18985519R33571K593575J513366J611901K450676K442360L305549L645439
3605.8C37481956K722474l96729L460732N13534M61502O698036R11446l94630L695716
3614.5C55154037p28073M423104N503349J252670J189461l83759K347794M505463L105468
3623.1C76369514K807427L876228L327446L467064O821594N722r666214M317666N647811
3631.8C96974258N959740R57642j641007L250084L909493L049812O40488J402282L018837
3640.5D17521629K997513J467018J105500L441276M111862N847473o53228k569695
$$ plain form
3648.2 433269348 439995079 438552322 435738220 437344246 443779716 448868027 453158951 457931633
3655.9 457931633 450169830 452845840 458664284 460742912 463541107 464886513 467570038 469418564
3663.6 469418564 471132088 473213692 474946518 479934616 482282333 482526588 483388214 476420021 480156593
3672.3 480156593 490241356 500820045 499780121 481170731 485801125 494292183 499263382 497650223
3680 497650223 498510323 502081490 504153252 505382309 506510658 507989044 512899284 519118423 508215828
3688.7 508215828 506256332 515868568 511197624 512651215 519315033 521147079 523205032 523668556
3696.4 523668556 523668060 525831909 527131577 529982567 533325272 528513718 526802177 532325935 534220428
3705.1 534220428 534312820 535604858 539342728 543545609 535511589 539779778 544989891 531123047
$$ packed form
3648.2D33269348O725731j442757k814102J606026O435470N088311M290924M772682
3655.9D57931633p761803K676010N818444K078628K798195J345406K683525J848526
3663.6D69418564J713524K081604J732826M988098K347717K44255Q61626o968193L736572
3672.3D80156593J0084763J0578689j039924j8609390M630394Q491058M971199j613159
3680D97650223Q60100L571167K071762J229057J128349J478386M910240O219139j0902595
3688.7E08215828j959496R612236m670944J453591O663818J832046K057953M63524
3696.4E23668556m96K163849J299668K850990L342705m811554j711541N523758J894493
3705.1E34220428R2392J292038L737870M202881q034020M268189N210113j3866844
$$ plain form
3712.8 531123047 536061058 540710258 540880928 542628860 546820030 549311333 545278664 546279182
3720.5 546279182 553454514 550085220 545373344 552233200 553485107 552171822 549954758 551052551
3728.3 551052551 556071053 557846947 563757362 558494301 551412926 563993187 564597092 553840904
3736 553840904 554162292 555895958 557000084 560697517 563852730 559410744 563321304 575966492 564959641
3744.7 564959641 547915840 559264183 566120186 573258018 570195656 558263283 571130333 564313011
3752.4 564313011 555932846 563176498 569713821 574291725 567654991 570528793 576617699 567073555
3760.1 567073555 566263466 571319885 573547974 575158882 579711380 576244507 570441971 574735107
3767.8 574735107 580982742 581157341 570892372 573616753 577913895 578935471 579810600 579236946 580617714
$$ packed form
3712.8E31123047M938011M649200J70670J747932M191170K491303m032669J000518
3720.5E46279182P175332l369294m711876O859856J251907j313285k217064J097793
3728.3E51052551N018502J775894N910415n263061p081375J2580261O03905j0756188
3736E53840904L21388J733666J104126L697433L155213m441986L910560J2645188j1006851
3744.7E64959641j7043801J1348343O856003P137832l062362j1932373J2867050o817322
3752.4E64313011q380165P243652O537323M577904o636734K873802O088906r544144
3760.1E67073555q10089N056419K228089J610908M552498l466873n802536M293136
3767.8E74735107O247635J74599j0264969K724381M297142J021576Q75129n73654J380768
$$ plain form
3776.5 580617714 581710701 585580330 584644737 575370750 579307594 582239151 583714409 586495132
3784.2 586495132 583101044 581692276 583262520 584523087 585606308 585691185 586161919 586735687 587626190
3792.9 587626190 587972603 589516220 593355789 590573845 586076088 588711472 594562302 601512222
3800.6 601512222 592167244 580477524 585498505 589699707 596344948 602620277 589863129 584899025
3808.3 584899025 591377296 594205093 594185791 595122948 595740280 597273979 603331680 600161324 585821877
3817 585821877 593148956 599685669 604836197 606982536 584799995 588036575 595723076 598612404
3824.7 598612404 601338425 600753326 596323547 596753731 599526329 604348488 606271400 597092171 600935440
3833.4 600935440 608684158 601370811 602245636 612368698 601439514 595612564 603808136 598239212
$$ packed form
3776.5E80617714J092987L869629r35593r273987L936844K931557J475258K780723
3784.2E86495132l394088j408768J570244J260567J083221Q4877M70734N73768Q90503
3792.9E87626190L46413J543617L839569k781944m497757K635384N850830O949920
3800.6F01512222r344978j1689720N020981M201202O645241O275329j2757148m964104
3808.3E84899025O478271K827797j9302R37157O17332J533699O057701l170356j4339447
3817E85821877P327079O536713N150528K146339k2182541L236580P686501K889328
3824.7E98612404K726021n85099m429779M30184K772598M822159J922912r179229L843269
3833.4F00935440P748718p313347Q74825J0123062j0929184n826950Q195572n568924
$$ plain form
3841.1 598239212 599474487 607387314 603231735 598207474 601951561 604191780 605235977 608248672
3848.8 608248672 607568054 610602417 617844048 609722290 610014763 592203064 594993286 607797203
3856.5 607797203 606335411 604136543 606929398 610211792 613536224 607012329 607204895 614766960
3864.2 614766960 607233467 601715202 607457314 614415665 621782188 610455093 600037804 606560173
3871.9 606560173 614262466 617781181 605123978 606290970 612306480 612734413 614967651 620230789
3879.7 620230789 613817902 605276108 612428436 613972015 615604897 621453247 606575050 607637062
3887.4 607637062 612899437 614966469 620360260 618583717 607736320 609701385 614743958 613532600
3895.1 613532600 615016060 617573853 620480957 621528549 611104507 617542763 619341927 612787971
$$ packed form
3841.1E98239212J235275P912827m155579n024261L744087K240219J044197L012695
3848.8F08248672o80618L034363P241631q121758K92473j7811699K790222J2803917
3856.5F07797203j461792k198868K792855L282394L324432o523895J92566P562065
3864.2F14766960p533493n518265N742112O958351P366523j1327095j0417289O522369
3871.9F06560173P702293L518715j2657203J166992O015510M27933K233238N263138
3879.7F20230789o412887q541794P152328J543579J632882N848350j4878197J062012
3887.4F07637062N262375K067032N393791j776543j0847397J965065N042573j211358
3895.1F13532600J483460K557793K907104J047592j0424042O438256J799164o553956
$$ plain form
3902.8 612787971 618147163 613743019 612169533 613104744 614233894 617535057 617542610 616895676 616265602
3911.5 616265602 617016602 617472878 616869316 618782768 621415291 616885185 612950935 618602753 619054298
3920.2 619054298 614679108 617342224 619675255 620839767 618461494 615349960 617246933 619443321
3927.9 619443321 620980225 619462585 618532410 620247536 617111855 616043510 618461342 619088669 619881439
3936.6 619881439 620126190 619499817 619353256 619407959 621998520 623189735 617394333 616608543 618966331
3945.2 618966331 620337448 621560364 619237137 620387115 621165085 618707275 620690536 621095276 620632057
3953.9 620632057 621041412 621299629 621811676 620521469 620551910 621084633 622288361 623201485 621136589
3962.6 621136589 620526962 621109352 621432457 621712265 621834068 621719017 621134834 621138344 622025681 622131805
$$ packed form
3902.8F12787971N359192m404144j573486R35211J129150L301163P553o46934o30074
3911.5F16265602P51000M56276o03562J913452K632523m530106l934250N651818M51545
3920.2F19054298m375190K663116K333031J164512k378273l111534J896973K196388
3927.9F19443321J536904j517640r30175J715126l135681j068345K417832O27327P92770
3936.6F19881439K44751o26373j46561N4703K590561J191215n795402p85790K357788
3945.2F18966331J371117J222916k323227J149978P77970k457810J983261M04740m63219
3953.9F20632057M09355K58217N12047j290207L0441N32723J203728R13124k064896
3962.6F21136589o09627N82390L23105K79808J21803j15051n84183L510Q87337J06124
$$ plain form
3972.2 622131805 621820030 622417030 622382622 622479553 622950325 623306618 623553391 623173599 623180656 622713470
3981.9 622713470 621795807 621327934 621971855 622938461 623027229 622983322 622908211 623480988 623078346 622628098
3991.5 622628098 623286552 623653717 624207230 623680382 623989220 624590797 624489365 625340233 624898643
4000.2 624898643
$$ packed form
3972.2F22131805l11775N97000l4408R6931M70772L56293K46773l79792P057m67186
3981.9F22713470r17663m67873O43921R66606Q8768m3907p5111N72777m02642m50248
3991.5F22628098O58454L67165N53513n26848L08838O01577j01432Q50868m41590
4000.2F24898643
##END=$$ End of the data block
