##TITLE=$$ Begin of the data block
##JCAMP-DX=5.00 $$ ACD/SpecManager v 10.08
##SPECTROMETER/DATA SYSTEM=Varian
##DATE=20 Nov 2012 15:26:54
##DATA TYPE=INFRARED SPECTRUM
##DATA CLASS=XYDATA
##ORIGIN=
##OWNER=
##NPOINTS=3735
##FIRSTX=399.26403809
##LASTX=4000.35498047
##MAXX=4000.35498047
##MINX=399.26403809
##MAXY=72.21777344
##MINY=20.53805542
##XFACTOR=1.0000000000
##YFACTOR=0.000000100000000
##FIRSTY=50.35292816
##DELTAX=0.96440572
##XUNITS=1/CM
##YUNITS=TRANSMITTANCE
##XYDATA=(X++(Y..Y))
399.3E03529282N707702k4783096L218460q297043J2447930N354690j759109L975715
407D99394531r523010l829002o820946J1695061O151580l385582o812591K008438Q929710
415.7D97808189j6786003q257560k013360P699547k092972P871857J4882546j1435089
423.4D87677155o829606l036651P273788l447456n414810p97043o669960M056702k705231
432.1D70106888K053757j21918O97708p19452o299324K514877n114669M172782j917305
440.7D65373344r00917O444664k061882M808731J648903P014923j925239L363533K224197
449.4D85990257o727981K445488j471405N241050j745300j790199L891258K008934
457.1D87842102O52695l901444K289887m885445N47257K203559O55976K14805n235481
$$ plain form
399.3 503529282 509236984 484453888 487672348 479375305 491823235 497177925 495418816 499394531
407 499394531 489871521 486042519 479221573 490916634 497068214 493682632 486870041 488878479 497808189
415.7 497808189 481022186 472764626 470751266 478450813 476357841 484229698 499112244 487677155
423.4 487677155 480847549 477810898 485084686 481637230 476222420 475425377 468755417 472812119 470106888
432.1 470106888 472160645 472038727 472736435 472016983 465717659 468232536 463117867 467290649 465373344
440.7 465373344 464472427 470917091 468855209 473663940 475312843 482327766 480402527 483766060 485990257
449.4 485990257 479262276 481707764 480236359 485477409 483732109 481941910 485833168 487842102
457.1 487842102 488494797 484593353 486883240 481997795 482545052 484748611 485404587 485619392 480383911
465.8D80383911k944412m727211N282822l145829o223678L57704k695961k756767l250084
474.5D60280495J202621l338508L71856P23458M96559P13615m529419K868996l070564
483.2D55719109k619286K089348J048889K189903O20041q9989l124427J625137o83060
491.8D56775665r31358j722794j795463j254959m822808L116188M81949n83305j565476
500.5D47697639l073654K488785p49092o71921K75116J885681n665245l851738L93143
509.2D38728714m30565Q69484n906448j980324k239800l447876j901207m508819j325455
517.9D17857704j086655M24004k407455j010933j154290l214187k15302J29128J584396
526.6D10906410j743126k137794p02667J584625K765579R2545k15149m24767J725006
$$ plain form
465.8 480383911 477439499 472712288 477995110 474849281 468625603 468983307 466287346 463530579 460280495
474.5 460280495 461483116 458144608 458516464 459239922 459736481 460450096 455920677 458789673 455719109
483.2 455719109 453099823 455189171 456238060 458427963 459048004 458958015 455833588 457458725 456775665
491.8 456775665 455844307 454121513 452326050 451071091 446248283 449364471 449846420 449263115 447697639
500.5 447697639 444623985 447112770 446363678 445691757 445966873 447852554 442187309 438335571 438728714
509.2 438728714 438298149 439167633 433261185 431280861 429041061 425593185 423691978 419183159 417857704
517.9 417857704 416771049 417195053 414787598 413776665 412622375 409408188 409192886 409322014 410906410
526.6 410906410 409163284 407025490 406322823 407907448 410673027 410765572 410550423 410125656 411850662
535.2D11850662Q00781J375542J839180P00798M098625L101311L745346N854645K070503
543.9D35437393l371010p98416J454392j120644Q50144k35329l1662j442070j438255
552.6D29304543j240426k280616Q23745j438484k024383k276192p96547j311569m130478
561.3D14629593k037392j536941j173859m539413m347420k177162k385979l815422
569C92616005m021072q84285k460938j319847k96555l30772m91180n61791K637558
577.7C84887123J911545Q78181Q74787L398819L706512K517815L751716K569657L572273
586.4D08068428L477287K602311J679534O66619J833877O07186J267280J181031M61387
595D21844940k33154j99700r61189j886825J380005L73687o34079m76875K2621K87361
$$ plain form
535.2 411850662 412651443 414026985 415866165 416566963 420665588 423766899 427512245 433366890 435437393
543.9 435437393 432066383 431267967 432722359 431601715 432451859 432216530 432184868 430742798 429304543
552.6 429304543 428064117 425783501 426607246 425168762 423144379 420868187 420071640 418760071 414629593
561.3 414629593 412592201 411055260 409881401 405341988 400994568 398817406 396431427 392616005
569 392616005 388594933 387710648 385249710 383929863 383633308 383302536 382811356 382249565 384887123
577.7 384887123 386798668 387676849 388551636 391950455 395656967 398174782 401926498 404496155 408068428
586.4 408068428 411545715 414148026 415827560 416494179 418328056 418935242 420202522 421383553 421844940
595 421844940 421611786 421412086 420450897 418564072 419944077 420317764 419683685 419206810 419229431 419516792
604.7D19516792o77147P22733K02827l3950n54276K53410l24516o98624J816178J889496
614.3D22112923K202224k68402O69060J800423O77643K837905J701775M95110J139564
623D33368225K810822J587982J331367K396012P90863J306266Q84514K125473R95484
631.7D47597008J16539J521988L33290M83742L24478J742363M28428K77596J496124
640.4D54321556L75710N75561k17094J743660J107826J95427O78863N11437J140900
649D60433846j71814m883k95868J250343N65453O637Q71811k36702J163368L57476
658.7D63939667p210n08537J014099P50961j255760M120l87459K175446M316406J3363495
668.3D83405228m874001p554359j611710J81198J357727Q34542J162376J145020N73234
$$ plain form
604.7 419516792 418839645 419562378 419765205 419731255 419176979 419430389 419105873 418407249 420223427 422112923
614.3 422112923 424315147 424046745 424715805 426516228 427193871 430031776 431733551 432228661 433368225
623 433368225 436179047 437767029 439098396 441494408 442285271 443591537 444476051 446601524 447597008
631.7 447597008 447713547 449235535 449568825 450052567 450377045 452119408 452547836 452825432 454321556
640.4 454321556 454697266 455272827 455055733 456799393 457907219 458102646 458781509 459292946 460433846
649 460433846 460262032 460257149 459961281 461211624 461777077 461783714 462655525 462418823 463582191 463939667
658.7 463939667 463932457 463423920 464438019 465188980 463933220 463937340 463549881 465725327 470041733 483405228
668.3 483405228 478531227 470976868 469365158 469546356 470904083 471738625 472901001 474046021 474619255
677D74619255J106911n75600Q83331l33252P71103J529847R73777J363182p62596O78635
686.7D80254593n19219J49193J57357j446152r64623j429290K72407p9765K6970j297608
696.3D75123863k331047j726723j061286o97670k156601m40751j507949j907921j068764
705D62225151j181450p08847j522941L76167M62341K71225L3302O50216J873741J321296
714.6D63800201K191544J362534J052818J148682L596496L656273J150627K175751
722.3D80134926K237892M282112K797585K598686L123512J230316K583962J342354
730.1E00331345J637687J627503K276115K066460P97767P56684o25687K338753J577454
738.7E12784081J00669M6654J51024J052780j210441p33338q78601m69055m23851j049385
$$ plain form
677 474619255 475726166 475150566 476033897 475700645 476471748 478001595 478975372 480338554 479575958 480254593
686.7 480254593 479735374 479884567 480041924 478595772 477631149 476201859 476474266 476394501 476421471 475123863
696.3 475123863 472792816 471066093 470004807 469307137 467150536 466709785 465201836 463293915 462225151
705 462225151 461043701 460334854 458811913 459188080 459650421 459921646 459954948 460605164 462478905 463800201
714.6 463800201 465991745 467354279 468407097 469555779 473152275 476808548 477959175 480134926
722.3 480134926 482372818 486654930 489452515 492051201 495174713 496405029 498988991 500331345
730.1 500331345 501969032 503596535 505872650 507939110 508736877 509493561 508867874 511206627 512784081
738.7 512784081 512884750 512931404 513082428 514135208 512924767 512191429 511312828 510843773 510419922 509370537
748.4E09370537j700287k107582j811066l800278j986274j624375j434822k035751
756.1D92870102l219795k083283k867584j059418j698341k031098j916885j120491
763.8D76873207J193161K07749R81597J35460J286240K854690J812630K661286L940239
772.5D91946259M271583K558479L680802M218445M491653L592720K079964L516502
780.2E20356407K935600M173317K521325J730079K594414K230835K434006O5307K571678
788.9E41612968K569237O98052J248893J951828K176934O03523J536713J492424K733650
797.6E56624222J582794J527138K141380L05367K201957J236992K656822K733879J532250
806.2E72542801Q76045p00111P55234N24368J520119m69857K17438J317596L13416
$$ plain form
748.4 509370537 507670250 505562668 503751602 499951324 497965050 496340675 494905853 492870102
756.1 492870102 489650307 487567024 484699440 483640022 481941681 479910583 477993698 476873207
763.8 476873207 478066368 478274117 479255714 479391174 480677414 483532104 485344734 488006020 491946259
772.5 491946259 496217842 498776321 502457123 506675568 511167221 514759941 516839905 520356407
780.2 520356407 523292007 527465324 529986649 531716728 534311142 536541977 538975983 539041290 541612968
788.9 541612968 544182205 544880257 546129150 548080978 550257912 550861435 552398148 553890572 556624222
797.6 556624222 558207016 559734154 561875534 562180901 564382858 565619850 568276672 571010551 572542801
806.2 572542801 573418846 572718735 573473969 573998337 575518456 575048599 575266037 576583633 576897049
814.9E76897049Q45680n21583J505355p28797o67801N42373n41839M29458q04329p75337
824.6E76180229k051658q77037j389962j256103o48613j632805k44980l314094k738991
833.3E62025986k844048k938385k299309k825660j079979k779923j815605k024231
841E43418846j842499j351967j861495j517716k207603k32048j868363j733894j211014
849.6E29592247j595039j165657k130890j142617k820358j418609j139527k591514
857.4E15588036j669579k048378j938133k024765L39927J979218L591309L946991L395805
866E21160431M803886M681931M834137M186630N785141M871140L743324M758453K668953
874.7E61494026L164444K053528J540070K30217q01964l52173j144905j111717l100853
$$ plain form
814.9 576897049 577742729 577221146 578726501 577997704 577329903 577872276 577330437 577759895 576955566 576180229
824.6 576180229 574128571 573251534 571861572 570605469 569956856 568324051 568079071 564764977 562025986
833.3 562025986 559181938 556243553 553944244 551118584 550038605 547258682 545443077 543418846
841 543418846 541576347 540224380 538362885 536845169 534637566 534405518 532537155 530803261 529592247
849.6 529592247 527997208 526831551 524700661 523558044 520737686 519319077 518179550 515588036
857.4 515588036 513918457 511870079 509931946 507907181 508247108 510226326 513817635 517764626 521160431
866 521160431 525964317 530646248 535480385 539667015 545452156 550323296 554066620 558825073 561494026
874.7 561494026 564658470 566711998 568252068 568482285 567680321 567328148 566183243 565071526 561970673
883.4E61970673k405587l507690l244286j922874k446671j647949k775116j488113
891.1E42532387j799927j913528j630402k040520j550979k050705r47495j373405j033821
899.8E28191605j800461j921730j704407l427429k144203k329255l342399m204559
907.5E07317162l315049l005561l573990l212052m168739m068260n139237m695472
915.2D76138802m513359n244065m311294l467255k849693l181572k591324k658920
922.9D47321320k154427j760788j536064l4561N05447p7972j284828M89807J438560
931.6D42906494N93567Q24623J226158J471215J097641K489318K342186K074585K558442
940.3D57584229K494583K842521J205559J291962J124573K69088r24644k267304k225723
$$ plain form
883.4 561970673 559565086 556057396 552813110 550890236 548443565 546795616 544020500 542532387
891.1 542532387 540732460 538818932 537188530 535148010 533597031 531546326 530598831 529225426 528191605
899.8 528191605 526391144 524469414 522765007 519337578 517193375 514864120 511521721 507317162
907.5 507317162 504002113 500996552 497422562 494210510 490041771 485973511 480834274 476138802
915.2 476138802 471625443 466381378 462070084 458602829 455753136 452571564 449980240 447321320
922.9 447321320 445166893 443406105 441870041 441835480 442340927 442262955 440978127 441467934 442906494
931.6 442906494 443500061 444324684 445550842 447022057 448119698 450609016 452951202 455025787 457584229
940.3 457584229 460078812 462921333 464126892 465418854 466543427 466812515 465887871 463620567 461394844
949D61394844l859901m368248n202904n492478n587005n341492n108452o879348p119599
957.7D12435417p257194p105866p266540o577416p162247p677497p188950p838478
965.4C54361229o629295q022042q446235p864724p796917p187252p926731p835521
973.1B92652512p795773p722607q419017p246495o577549o988296o544724n824527
980.8B35533524m896603n395336m064255l358860k562866k623024j975270r68723j618099
989.5B08070488o42471j712895l34568L17822J93901J97754o23417J298752M36382
998.2B07201748P41520K21634K40307R11350k76680O13880N8212O83480q5965m58145
1007.8B09851341Q5907n55782n35908q41522J46275l03021K59819n26638o0730R69086
$$ plain form
949 461394844 457534943 453166695 447963791 442471313 436884308 431542816 426434364 419555016 412435417
957.7 412435417 405178223 398072357 390805817 384228401 377066154 369388657 362199707 354361229
965.4 354361229 347731934 339709892 331263657 323398933 315602016 308414764 300488033 292652512
973.1 292652512 284856739 277134132 268715115 261468620 254891071 247902775 241358051 235533524
980.8 235533524 230636921 225241585 221177330 217818470 215255604 212632580 210657310 209688587 208070488
989.5 208070488 207428017 205715122 205380554 205698376 205892277 206090031 205466614 206765366 207201748
998.2 207201748 207943268 208164902 208405209 209316559 209039879 209653759 209711971 210395451 210309486 209851341
1007.8 209851341 209937248 209381466 208845558 208004036 208150311 207847290 208107109 207580471 207519741 208488827
1017.5B08488827k08931R10892Q4477J056175J020718R49726O08024N5809K096920
1026.1B15062637J170864K442952J066208J0585J286049J492138J994915O61469J925621
1034.8B27113438R76238J138115J047077k51198O39668l48282M47845l71551L17707
1043.5B30709057J112575O12107N11474J34545J169758M9037J484223J178989J04637
1052.2B37066402O79455J816063L849163K590142K801818K235623K661037L244648
1059.9B56944351L588352L836747K958068M684887L708115M377060M506645L037968
1067.6B87642193K142849n46437k241687m734001m477101m953270m891414l747082
1075.3B64194050m134770k577724k124329j75686p14912M16145J094113q9245P12795
$$ plain form
1017.5 208488827 208279896 209190788 209275265 210331440 211352158 212301884 212909908 212965717 215062637
1026.1 215062637 216233501 218676453 219742661 219753246 221039295 222531433 224526348 225187817 227113438
1034.8 227113438 228089676 229227791 230274868 230023670 230663338 230315056 230762901 230391350 230709057
1043.5 230709057 231821632 232433739 232945213 233079758 234249516 234298553 235782776 236961765 237066402
1052.2 237066402 237745857 239561920 243411083 246001225 248803043 251038666 253699703 256944351
1059.9 256944351 260532703 264369450 267327518 272012405 275720520 280097580 284604225 287642193
1067.6 287642193 289785042 289238605 286996918 282262917 277785816 272832546 267941132 264194050
1075.3 264194050 260059280 257481556 255357227 255181541 254466629 254882774 255976887 255887642 256600437
1084B56600437P94544K463284J038532J840382J977501K215709L181763R46770K589207
1092.7B73648129K354469K432823K638321K518196K249661J322803J196480o20651
1100.4B87740231J132297N54562K59552N55057l63331J454659M79259N27878K80285
1109.1B92620449J954651K266293Q03394K173557J538353K106361J816578K212525
1116.8C07492161J426124K68250J306248Q66584J194706O32325J844654J318798K5024
1125.5C16374874M30527M85954K280007K358722K810173K034035J762772J806221J027565
1134.1C31370850K033500P80220j8768r69238j837845k541847k837258k446060l781586
1142.8C19751968l486633l668861k885781l539333l705788k554779k781353j729011
$$ plain form
1084 256600437 257394981 259858265 260896797 262737179 264714680 266930389 270112152 271058922 273648129
1092.7 273648129 276002598 278435421 281073742 283591938 285841599 287164402 288360882 287740231
1100.4 287740231 288872528 289427090 289686642 290241699 289878368 291333027 291812286 292340164 292620449
1109.1 292620449 294575100 296841393 297644787 299818344 301356697 303463058 305279636 307492161
1116.8 307492161 308918285 309186535 310492783 311359367 312554073 313186398 315031052 316349850 316374874
1125.5 316374874 316805401 317291355 319571362 321930084 324740257 326774292 328537064 330343285 331370850
1134.1 331370850 333404350 334184570 334165802 333196564 331358719 328816872 325979614 323533554 319751968
1142.8 319751968 316265335 312596474 309710693 306171360 302465572 299910793 297129440 295400429
1150.5B95400429k578202j311702j858521j934337m65107r16386R174n96046M63715
1159.2B86213017M86640L16620M99363J178055K649422K186966L067474L131428L776531
1167.9C03505516L304501L953514N131855M377479N140915N003624O155472N978546
1175.6C42551422N516663N918007N283966N722236N824128O038780N415191N357018
1183.3C87627411N545616N137215N321693M507637M256325L486023L016739L601532
1191D22500191K838554K650719K032013J548309J492653R69238O28510J83372J113510
1199.7D35957069J131554K95372J94588P13196J077270P67174R75761Q49037J330224
1208.4D43291245J785087J654282J521568J716461K551613K356834J848679J249123
$$ plain form
1150.5 295400429 292822227 291510525 289652004 287717667 287252560 286336174 286345348 285749302 286213017
1159.2 286213017 286699657 287016277 287515640 288693695 291343117 293530083 296597557 299728985 303505516
1167.9 303505516 306810017 310763531 315895386 320272865 325413780 330417404 336572876 342551422
1175.6 342551422 348068085 353986092 359270058 364992294 370816422 376855202 382270393 387627411
1183.3 387627411 393173027 398310242 403631935 408139572 412395897 415881920 418898659 422500191
1191 422500191 425338745 427989464 430021477 431569786 433062439 434031677 434660187 434843559 435957069
1199.7 435957069 437088623 437383995 437578583 438291779 439369049 440136223 441111984 441961021 443291245
1208.4 443291245 445076332 446730614 448252182 449968643 452520256 454877090 456725769 457974892
1216.1D57974892J889496K610206J603584J313019R45893O98814N70869N83039O6986
1224.8D68256798l47824o2752r04617o64864n88913m86221p24488j428222q81500n41230
1234.4D61626167l25660q70438q48351p88307o17866o80657q84781J64223j55411m7874
1244.1D56571045J63689P0724L86353N99632R22775M71192R69085J084213R22623Q55866
1253.7D63017197N36842J106415O92901L47290L84522Q16078Q50029L07198M49485
1262.4D68507957K72141L38592M95911J180267R77402P44057J001472M95606Q79478
1271.1D74892883Q14896J034431R18427P07588N99938n0011K31514l86048l41949m94537
1280.7D77927132m73557k05154p88880j97029m41131k88926j91268m44260n55229p04079
$$ plain form
1216.1 457974892 459864388 462474594 464078178 465391197 466337090 467035904 467606773 468189812 468256798
1224.8 468256798 467908974 467846222 466941605 466276741 465687828 465201607 464477119 463048897 462167397 461626167
1234.4 461626167 461300507 460430069 459581718 458793411 458175545 457494888 456610107 456774330 456618919 456571045
1244.1 456571045 456734734 456805458 457191811 457791443 458714218 459185410 460154495 461238708 462161331 463017197
1253.7 463017197 463554039 464660454 465353355 465700645 466085167 466901245 467751274 468058472 468507957
1262.4 468507957 468780098 469118690 469614601 470794868 471772270 472516327 473517799 474013405 474892883
1271.1 474892883 475707779 476742210 477660637 478368225 478968163 478918152 479149666 478763618 478421669 477927132
1280.7 477927132 477453575 477248421 476459541 476262512 475821381 475532455 475341187 474896927 474341698 473637619
1290.4D73637619m08096p27845k43301l81813o58569r77097j247215q59604r40704
1299D67193375n69954r40056j090965r84879o11687n00869p15218o18706r59358l96538
1308.7D59805145p47757q18824q58384j003646m40407p79114n8098m73709q40912n80444
1318.3D53203850p41234o6338n18264j120911j190147q88100j556206k051353k002678
1327D43068619k148361k084656k562943k214660j911545j777191j764374j626892j573296
1335.7D25404701j701507j365090q29086j14975k42958M60701K98729K28729K96555
1344.4D22435799N4206J60103k71072J94664M3831l1738J24244k51770j42746l43132
1354D21972389o4277l66173l26271m76685p23038k70385r22051q11844r77096q47702
$$ plain form
1290.4 473637619 473229523 472501678 472258377 471876564 471217995 470240898 468993683 468134079 467193375
1299 467193375 466623421 465683365 464592400 463607521 462995834 462494965 461779747 461161041 460201683 459805145
1308.7 459805145 459057388 458238564 457380180 456376534 455936127 455157013 455098915 454625206 453784294 453203850
1318.3 453203850 452462616 452396278 451878014 450757103 449566956 448678856 447122650 445071297 443068619
1327 443068619 440920258 438835602 436272659 434057999 432146454 430369263 428604889 426977997 425404701
1335.7 425404701 423703194 422338104 421509018 421394043 421151085 421611786 421910515 422139244 422435799
1344.4 422435799 422490005 422650108 422379036 422573700 422617531 422585793 422710037 422458267 422315521 421972389
1354 421972389 421908112 421541939 421215668 420738983 420015945 419745560 418823509 418011665 417034569 416186867
1363.7D16186867M32129J86500p32078l03231J54229n53208O6681k07062K35253j00212
1373.3D15365868p09343J127433P07627O88934Q1215K97890O59713N00489P73468Q10737
1382.9D20304031J244622R15451J471252J268540J198883K373314K215080J969108
1390.7D32960281J266938Q85887J75476r13048j43967J102639J11389q48999q57964
1399.3D33738632j38321N28450l89709q48885o73065j678162p31048m5777o92977r93309
1409D28075829o81992j148300j080170m58031l74603l87497j027031q33091m41285
1417.7D21643829R3041j870423k68440J713219M62570N0621j112366O79856J448059
1426.3D22839966K4376P01828K58293M9400K93808Q77915Q92410P21245J140594k04010
$$ plain form
1363.7 416186867 416618996 416805496 416073418 415770187 415924416 415371208 415437889 415230827 415466080 415365868
1373.3 415365868 414656525 415783958 416491585 417180519 417261734 417559624 418219337 418719826 419493294 420304031
1382.9 420304031 421548653 422464104 423935356 425203896 426402779 428776093 430991173 432960281
1390.7 432960281 434227219 435113106 435288582 434375534 434231567 435334206 435445595 434596596 433738632
1399.3 433738632 433600311 434128761 433739052 432890167 432217102 430538940 429807892 429762115 429069138 428075829
1409 428075829 427393837 426245537 425165367 424707336 424332733 423945236 422918205 422085114 421643829
1417.7 421643829 421736870 419866447 419598007 421311226 421773796 421824417 420712051 421391907 422839966
1426.3 422839966 422864342 423566170 423824463 423873863 424167671 425045586 425937996 426659241 427799835 427595825
1436D27595825q10051J357308K670364J291580J86768N60264L29400J336784K69394
1444.7D34787636L88794J05133k15988j48354j90849N03921j022644o02264p13844
1453.3D32891541l5630o04095k464752j960679k835502L288422J056251J708336K76680
1462D31320572J0872J671676l82614K741814J448479K600784K364387K664643L192940
1470.7D47633553P13005M297599L393593N436821L759766M074631M365310L540764
1478.4D77215042M116364K650413L390923K702141L688583K717171J744461K695503
1486.1E00920601J119957K753715J152535R23271K627144L594780L627663J909370
1493.8E18629036K251472O06118m98696K146950J955872J250496J871032K171936O52771
$$ plain form
1436 427595825 426785774 428143082 430813446 432105026 432291794 432852058 433181458 434518242 434787636
1444.7 434787636 435176430 435281563 435065575 434917221 434726372 435230293 434207649 433605385 432891541
1453.3 432891541 432855911 432251816 429787064 427826385 424990883 428279305 429335556 431043892 431320572
1462 431320572 431331444 433003120 432620506 435362320 436810799 439411583 441775970 444440613 447633553
1470.7 447633553 448346558 452644157 456037750 461474571 465234337 469308968 473674278 477215042
1478.4 477215042 481331406 483981819 487372742 490074883 493763466 496480637 498225098 500920601
1486.1 500920601 502040558 504794273 505946808 506870079 509497223 513092003 516719666 518629036
1493.8 518629036 520880508 521486626 520987930 523134880 525090752 526341248 528212280 530384216 531036987
1502.5E31036987J420403J278953M69399p816010j900634Q214759L585320L152504
1510.2E39441681Q64448O31714o6681J455536P96967o16341J600495j904946K864533
1518.9E45067406J440353l441315J213570L46565K863388J531830k68707L62968J309586
1527.6E50425644o5689L37677J997528l85742l97873j455956j374130K529297N60303
1536.3E52171059O08101j30997n895729m773712M781684J745453J89019L237457L47710
1545E52280045j168251J332397Q36411J45301j578788j555748J072921Q12378m95224
1553.6E51681442k857246k07520K409783N42793j5144348n254669J0192032O050453
1561.4E47412720K136688K40822M34074j539726l69148M96101j24435j070328l487663
$$ plain form
1502.5 531036987 532457390 533736343 534205742 526389732 524489098 532703857 536289177 539441681
1510.2 539441681 540306129 540937843 540871162 542326698 543123665 542507324 544107819 542202873 545067406
1518.9 545067406 546507759 543066444 544280014 544626579 547489967 549021797 548753090 549116058 550425644
1527.6 550425644 550359955 550697632 552695160 552309418 551911545 550455589 549081459 551610756 552171059
1536.3 552171059 552779160 552648163 546752434 541978722 546760406 548505859 548694878 551932335 552280045
1545 552280045 551111794 552444191 553280602 553425903 551847115 550291367 551364288 552176666 551681442
1553.6 551681442 548824196 548616676 551026459 551569252 536424904 531170235 541362267 547412720
1561.4 547412720 549549408 549790230 550224304 548684578 548315430 548811531 548687096 547616768 544129105
1570E44129105J929435J394883K53601k9259l014j891632m488869L814469J897659
1578.7E47006378l6621k05612n99022n31044k97050L9596n58243p88536m11796k44217
1588.4E43373833l45345r55200o70586r54513n18761p20253j026382l06855j006774
1597E36869164p62101q03146p29179j122284j215859q29544j325569q39844j186485
1605.7E28055153j449890j943550q81424j419144k295647q87603j573830r42917j800499
1614.4E14860649j023407j697845p272339R54628j47896p73315j648064o22673j594925
1623.1E01034813m300308k65503p36618n41802l149147j823654k52304j006851q05435
1631.7D88153191j238137L243l33252n920372k273598J870651K27547K42386M91447
$$ plain form
1570 544129105 546058540 547453423 547707024 547677765 547674751 545783119 541294250 545108719 547006378
1578.7 547006378 546969757 546764145 546165123 545634079 545337029 545376625 544818382 544029846 543618050 543373833
1588.4 543373833 543028488 542073288 541402702 540448189 539929428 539209175 538182793 537875938 536869164
1597 536869164 536107063 535303917 534574738 533452454 532236595 531407051 530081482 529241638 528055153
1605.7 528055153 526605263 524661713 523780289 522361145 520065498 519177895 517604065 516661148 514860649
1614.4 514860649 513837242 512139397 504867058 505821686 505673790 504900475 503252411 502629738 501034813
1623.1 501034813 496734505 496469002 495732384 495190582 492041435 490217781 489965477 488958626 488153191
1631.7 488153191 486915054 486918297 486585045 480664673 478391075 480261726 480489273 480731659 481223106
1640.4D81223106n11856O32210p74727P75490O92024l395042q71048J215019L275147
1649.1D82260323J114158J603699N45616j1256332P70950Q999557N081864K399712
1656.8D91519547K049522J135521J552772J151924J526108J365052O21337L332978
1664.5E04254761K240982J966743J420136J233558k57225J918297M233360J880150
1672.3E18890762K748604K889519J793404j8311L005180L143158J733628K081489J115036
1680.9E37382469L224182L433838J71623k308311M206009N092239K861481J169777
1688.6E55233307J694412J829910K122498K471695J660042K061348J883812l474579
1696.4E65482445L465881L221169K883186K97585j454125L998718K763634J207466
$$ plain form
1640.4 481223106 480711250 481343460 480568733 481344223 482036247 478641205 477770157 478985176 482260323
1649.1 482260323 483374481 484978180 485523796 474267464 475038414 484037971 489119835 491519547
1656.8 491519547 493569069 494704590 496257362 497409286 498935394 500300446 500921783 504254761
1664.5 504254761 506495743 508462486 509882622 511116180 510858955 512777252 517010612 518890762
1672.3 518890762 521639366 524528885 526322289 526303978 529309158 532452316 534185944 536267433 537382469
1680.9 537382469 540606651 544040489 544212112 541903801 546109810 551202049 554063530 555233307
1688.6 555233307 556927719 558757629 560880127 563351822 565011864 567073212 568957024 565482445
1696.4 565482445 568948326 572169495 575052681 575350266 573896141 577894859 580658493 581865959
1704.1E81865959q89931J602097Q57735J354484K280121P07054L27339N26085J231041
1712.8E89861984J090966p43142q06274J682510J55945l088035N013160K684899J143112
1721.4E96995125J119232O22559J79863P74917J077728M65394J024284Q48579q53653
1730.1F02254028k74315K295342K279510l795814j276169L718720K824630Q24280R69391
1738.8F09819603N4436j249581L119431J534386p11899J17302J482811J208381Q4305
1747.5F15459175J329193L89176K388801J31607n00717L243294J376076J132621J401863
1756.2F26351089l10058P52945J298485P31582J560593l66364o5078K796554J148033
1764.8F33897781N57328P62214N54352j108856J026535K537308j825486k052345R61266
$$ plain form
1704.1 581865959 580976028 582578125 583435860 584790344 587070465 587777519 588104858 588630943 589861984
1712.8 589861984 590952950 590209808 589403534 591086044 591241989 588153954 593167114 595852013 596995125
1721.4 596995125 598114357 598736916 598916779 599691696 600769424 601234818 602259102 603107681 602254028
1730.1 602254028 601979713 604275055 606554565 602758751 601482582 605201302 608025932 608850212 609819603
1738.8 609819603 609874039 608624458 611743889 613278275 612566376 612683678 614166489 615374870 615459175
1747.5 615459175 616788368 617177544 619566345 619697952 619197235 622440529 623816605 624949226 626351089
1756.2 626351089 626041031 626793976 628092461 628824043 630384636 630018272 629953194 632749748 633897781
1764.8 633897781 634455109 635217323 635771675 634662819 635689354 638226662 636401176 634348831 635310097
1773.5F35310097L007736J629257p09534K039376N40619L00674m3564p57522J242141
1782.2F42559280R94950J028824m94461M7836J022034L80096K92587M86908m56848
1790.9F45861206n30701n38177m70963K320099Q05359m64325R41544R71374L98712
1799.5F49294128j026992J488494J14441n08880R17587J98975Q99124L78876K31781
1808.2F51987534L81774j144j217346J96762J511841L63464O23932q2474M39301j39771
1817.9F54063873j86386J076508l34015J08490k23465Q69064J050110k324600J97220
1826.5F54296799J256408R72367l58963k041855J350098J802139K9068k93732R3842
1835.2F57106171J88980L44848k93579O89392J43586j3581l0136l53012n8594k908706
$$ plain form
1773.5 635310097 638317833 639947090 639237556 641276932 641817551 642118225 642074661 641317139 642559280
1782.2 642559280 643554230 644583054 644088593 644136429 645158463 645538559 645831146 646318054 645861206
1790.9 645861206 645330505 644792328 644321365 646641464 647446823 646982498 647924042 648895416 649294128
1799.5 649294128 648267136 649755630 649870071 649361191 650278778 650477753 651376877 651755753 651987534
1808.2 651987534 652369308 652368164 651150818 651347580 652859421 653222885 653846817 653764343 654203644 654063873
1817.9 654063873 653877487 654953995 654619980 654728470 654505005 655374069 656424179 654099579 654296799
1826.5 654296799 655553207 656525574 656166611 654124756 655474854 657276993 657306061 657012329 657106171
1835.2 657106171 657295151 657639999 657346420 658035812 658179398 658165817 658135681 657782669 657724075 654815369
1844.9F54815369J630325J919327n3864j21078M91562J158371j99738j07498p3319
1853.6F59459457j38626K0905k60239L94898k23923m7607m6387K07748L00751J18942
1863.2F59785919K08359k82669q774q58078K36054l25394j381149J268692J144332
1871.9F59787292O59333O7138L70408K11105J5030R2239j45874K89230k40554M6768
1881.5F61152115N0888Q8196l281Q9493M76074l19595O35910J63879r76181N53894
1891.2F61911392O82373n3863M5700p6p02591O34536L40424j43662N1270J13525L98636
1901.8F63277664m88891J16043K1286J53885K72903o13861r7504J84632K54364j755
1911.4F63078766L75137j24588J93176K2889n22156P58209j629944r3002J241302p9879
$$ plain form
1844.9 654815369 656445694 658365021 658311157 658190079 658681641 659840012 659640274 659532776 659459457
1853.6 659459457 659320831 659341736 659081497 659476395 659252472 659204865 659158478 659366226 659666977 659785919
1863.2 659785919 659994278 659711609 659702835 658844757 659080811 658755417 657374268 658642960 659787292
1871.9 659787292 660446625 660513763 660884171 661095276 661110306 661202545 661056671 661345901 661105347 661152115
1881.5 661152115 661203003 661291199 661287918 661377411 661853485 661533890 662169800 662333679 661357498 661911392
1891.2 661911392 662593765 662539902 662585602 662585526 661882935 662517471 662857895 662714233 662765503 662879028 663277664
1901.8 663277664 662788773 662904816 662926102 663079987 663352890 662739029 662641525 662826157 663080521 663078766
1911.4 663078766 663453903 663329315 663522491 663545380 663023224 663781433 662151489 662058487 663299789 663219910
1921.1F63219910K46429m96826K18201K27813J04828j08490p0495K00119l93677J12457
1930.7F63260269J54572M92325j32981j43432J14364m28619J67541k9068J91193K2964
1940.3F63669128O15464m68903k159576R47189R72977J50451j78222J44195M00467
1949F64093170l1280R7503j297k3575l23333K39944K03858o11J82724J1902L46146
1959.6F64795151k11182l9596k1134n9433p248l59039K20642J06430J94321M88662
1969.3F65107574L26157k32925n8823K84805o3018o2638j52588L03574o7215k27051
1978.9F65157852j08719j52282J33133k98005K55051N9586j12915j831p4235O0959
1988.6F64918594l60870O91452K29569j098328j66397P21283K54211l66821J98440
$$ plain form
1921.1 663219910 663466339 662969513 663187714 663415527 663520355 663411865 663341370 663541489 663147812 663260269
1930.7 663260269 663414841 663907166 663774185 663630753 663745117 663316498 663484039 663454971 663646164 663669128
1940.3 663669128 664284592 663815689 661656113 662603302 663576279 663726730 663548508 663692703 664093170
1949 664093170 664061890 664159393 664158096 664134521 663811188 664051132 664254990 664254379 664437103 664449005 664795151
1959.6 664795151 664583969 664544373 664523239 664463806 664456558 664097519 664318161 664424591 664618912 665107574
1969.3 665107574 665433731 665200806 665141983 665426788 665363770 665301132 665148544 665452118 665384903 665157852
1978.9 665157852 665049133 664896851 665029984 664731979 664987030 665046616 664933701 664931870 664857635 664918594
1988.6 664918594 664557724 665249176 665478745 664380417 664214020 664935303 665189514 664822693 665021133
1997.2F65021133j33667p1029j64643o1340J80664j50833J29852m61654j37406J52054
2006.9F64303131J64566Q1177k17285J41754m11530j55944k01188l35922j8005k56195
2016.5F63094559l71018k65579M50668P2632m08783o28586m03595J52283N9052r6512
2026.2F61655121l42713J23063k98691k08512J8158m54788k60544n47790J7929m8828
2035.8F59652405r7809R6588j65863n6839m96979j99432m3564J32675k96173m36706
2045.5F58088303K11258j2513P4768l55224m3259P3929j13525l4256k19040J61438
2055.1F57831879l93830k24685o1036n5084K8382j80588K05993q0719K93808Q1101
2064.7F57445221l82156J00174L83911R7503n29937Q39L08533J89743l45536j09253
$$ plain form
1997.2 665021133 664887466 664816437 664651794 664590454 664771118 664620285 664750137 664288483 664151077 664303131
2006.9 664303131 664467697 664548874 664331589 664473343 664061813 663905869 663704681 663368759 663350754 663094559
2016.5 663094559 662723541 662457962 662908630 662981262 662572479 661943893 661540298 661692581 661751633 661655121
2026.2 661655121 661312408 661435471 661136780 660928268 660946426 660491638 660231094 659683304 659701233 659652405
2035.8 659652405 659554596 659651184 659485321 659428482 658931503 658732071 658688507 658821182 658525009 658088303
2045.5 658088303 658299561 658287048 658361816 658006592 657963333 658037262 657923737 657889481 657670441 657831879
2055.1 657831879 657438049 657213364 657152328 657097244 657125626 656945038 657151031 657070312 657364120 657445221
2064.7 657445221 657063065 657163239 657547150 657644653 657114716 657115555 657424088 657613831 657268295 657159042
2074.4F57159042K42691k31170J05362K3193J42746k46124j77307K66494J7319J54648
2084F57456894k95639N1041J95541J53809J43966l00140j79901J25274M19541j01013
2093.7F57669373J67083J86386j90658j07269j19858L91769J05591M5776r5977o2943
2103.3F57989273Q1635O7443K71302j39160m6158l33023J05972J09100j45340M27857
2113F58388901J15661J33057k48489J33667m9363L205N25894m24576r765j06736n8365
2123.6F58403091R385j11084K70538j0300O9886k75956Q087r536q4915k2507M1199
2134.2F58287888L56140l28522o0654k84805l5477K85721r842K39716l56369q8654
2143.8F58005142J33820K23083j81045o8665L11203k87094L46603N9357k45895j86234
$$ plain form
2074.4 657159042 657401733 657170563 657275925 657299118 657441864 657195740 657018433 657284927 657302246 657456894
2084 657456894 657161255 657212296 657407837 657561646 657705612 657405472 657225571 657350845 657770386 657669373
2093.7 657669373 657836456 658022842 657832184 657724915 657605057 657996826 658102417 658148193 658052216 657989273
2103.3 657989273 658070908 658138351 658409653 658270493 658224335 657891312 657997284 658106384 657961044 658388901
2113 658388901 658504562 658637619 658389130 658522797 658473434 658476639 659002533 658577957 658568192 658461456 658403091
2123.6 658403091 658412476 658301392 658571930 658561630 658631516 658355560 658363647 658354111 658269196 658246689 658287888
2134.2 658287888 658644028 658315506 658254852 657970047 657934570 658220291 658210449 658450165 658093796 658005142
2143.8 658005142 658138962 658362045 658181000 658112335 658423538 658136444 658483047 658542404 658296509 658110275
2153.5F58110275O1035J78681N8288L37372n12771J67541M88053L5400j38397l28064
2163.1F58457413K63900L07999O42853n1498O3781N73197J63421P9575l75672J74561
2172.8F60299530P5684J74255L09219M7837J89438K24151O60858J14289O332j61591
2182.4F61940002K18964M47006j21612L81927J7624N9586l9902n0964M8141N6534L68729
2193F63326035M3716N37720J30462J86539L03040j92948k1210R156L69949J41525N96924
2203.6F65430908J82495k57187j1596q6365N10406R4529M02069O1722j57471K84119
2213.3F66453629p630K20795K14386N72357k36359j74255K96631l8376R5749q39P25784
2223.9F68121872J50146j38397j63955k2507L68805k57263L56292K29569J71509J18942
$$ plain form
2153.5 658110275 658171310 658349991 658408279 658745651 658232880 658400421 658888474 658923874 658785477 658457413
2163.1 658457413 658721313 659029312 659672165 659620667 659684448 660257645 660421066 660500641 660124969 660299530
2172.8 660299530 660375214 660549469 660858688 660906525 661095963 661320114 661980972 662095261 662101593 661940002
2182.4 661940002 662158966 662605972 662484360 662866287 662883911 662943497 662903595 662852631 662900772 662957306 663326035
2193 663326035 663369751 663907471 664037933 664224472 664527512 664334564 664313354 664322510 664692459 664833984 665430908
2203.6 665430908 665613403 665356216 665344620 665258255 665768661 665863190 666265259 666326981 666169510 666453629
2213.3 666453629 666445999 666666794 666881180 667453537 667217178 667042923 667339554 667301178 667396927 667396088 668121872
2223.9 668121872 668272018 668133621 667969666 667947159 668315964 668058701 668414993 668644562 668816071 668935013
2233.5F68935013N2490L9902k05231L22800o7215N9051l83453r5367N53131J00860
2243.2F69311981N493j86462N37186J17187O9428J35650k2583P8354l08151N11017
2252.8F70249100r5139n0888K46887K30179J53198l64456N88303P6294K05002K60696
2262.4F71499176J21079K04544l80555K16980J6556R5825j87683K68936M42124M9133
2272.1F72346115L58734k29568L20511k03171Q5525j6632m74167K93961j29623K63748
2281.7F72615433n55954J09710N88685K16598K94952l64685P80487j98669N36423R74197
2291.4F74997177j22833O64444p4158N78537K23465N75562R81979J15967M21753j18866
2301F78243027N24826J85013M82864Q75473J020126J524811O18515J079254M97589
$$ plain form
2233.5 668935013 668987503 669027405 668822174 669144974 669077759 669136810 668753357 668657990 669211121 669311981
2243.2 669311981 669317474 669131012 669668198 669785385 669854813 669990463 669967880 670046234 669738083 670249100
2252.8 670249100 670153961 670103073 670349960 670580139 670733337 670368881 670957184 671033478 671238480 671499176
2262.4 671499176 671620255 671824799 671444244 671661224 671677780 671773605 671585922 671854858 672296982 672346115
2272.1 672346115 672704849 672475281 672795792 672592621 672678146 672661514 672187347 672481308 672351685 672615433
2281.7 672615433 672059479 672169189 672757874 672974472 673269424 672904739 673685226 673486557 674022980 674997177
2291.4 674997177 674874344 675538788 675464630 676043167 676266632 676842194 677824173 677940140 678361893 678243027
2301 678243027 678767853 678952866 679435730 680311203 681331329 682856140 683474655 684553909 685051498
2309.7F85051498J173859R51538k17209L48053j66168Q96606R22013J542969J679916
2318.4F92183075J212692J947937P22504J389770J865845N83267q72955Q09174K348480
2327.1G02189789M33197M61426M42352J094131J58921L7384Q15811o92063R47037M29230
2336.7G06317215j171951M03976J540451Q26416j91421l45002j000518k06299j094361
2345.4G05078506k868194m748764n516052P59658O357956L914872J970977K188111
2353.1G07137070K224426M353714J961136J260071k06833K106094L342056j557617
2360.8G20620117q68912q46786q59909j435242j322021k764817l670349j601028k583923
2369.5G04667130k689133l431549k460251j887817l062897k533341k890777k560959
$$ plain form
2309.7 685051498 686225357 687176895 686959686 687307739 687141571 688038177 688960190 690503159 692183075
2318.4 692183075 693395767 695343704 696066208 697455978 699321823 699905090 699032135 699841309 702189789
2327.1 702189789 702622986 703084412 703526764 704620895 704779816 704817200 705633011 704940948 705887985 706317215
2336.7 706317215 705145264 705549240 707089691 707916107 707724686 707379684 706379166 706172867 705078506
2345.4 705078506 702210312 697461548 691945496 692705154 699063110 702977982 704948959 707137070
2353.1 707137070 709361496 713715210 715676346 716936417 716729584 718835678 722177734 720620117
2360.8 720620117 719751205 718904419 718044510 716609268 715287247 712522430 708852081 707251053 704667130
2369.5 704667130 701977997 698546448 696086197 694198380 691135483 688602142 685711365 683150406
2377.2F83150406k258911k099839j737823j311951j631469k122116j235734j253738
2384.9F69498825r60998m88358j32446l14942q81653j36947J5411J41449n9204j30691
2394.6F66550446l18833k65045J81046m25110K25830p172j03912M2801m27933J97601
2404.2F65649719j11770j34125l09677j28479J90429j58004m36478q28857j07880J43051
2413.8F63767929P9880m12827k69928M08936M8599l29285r20410j67694l2882k34452
2423.5F61937866K3651k80990k97623m96063l7461l18603n2567l2043n55573R461k64893
2434.1F59635162j9607l57666m75693j49612j92414o6070o04172l92075j19857J35192
2443.7F57393188l69110l69186J21689k14997J46637m37851p63931m94232j8082J49994
$$ plain form
2377.2 683150406 680891495 678791656 677053833 675741882 674110413 671988297 670752563 669498825
2384.9 669498825 668537827 668049469 667917023 667602081 666720428 666583481 666598892 666740341 666681137 666550446
2394.6 666550446 666231613 665966568 666147614 665722504 665948334 665941162 665837250 665880051 665452118 665649719
2404.2 665649719 665537949 665403824 665094147 664965668 665156097 664998093 664561615 663732758 663624878 663767929
2413.8 663767929 663847809 663434982 663165054 663573990 663622589 663293304 662372894 662205200 662172318 661937866
2423.5 661937866 661961517 661680527 661382904 660886841 660849380 660530777 660478210 660446167 659890594 659900055 659635162
2434.1 659635162 659615555 659257889 658782196 658632584 658440170 658374100 657769928 657377853 657257996 657393188
2443.7 657393188 657024078 656654892 656776581 656561584 656708221 656270370 655506439 655012207 654994125 655144119
2453.4F55144119j39923m6844l54538j66016l24707J51749j602l63846R1400q24890
2463F53164902o66428l84979j0300J97907k05536j78375l31116L4103k50168j88827
2472.7F51181183l18070n21774l53622l18146N29404K49405k38038m88967k30866j70288
2482.3F49320221l69797K79770j36719l27148l71780l39051j97906j7166J5945m19312
2492F47437057K49177P1563m94613n90516j7700L28751m26788j23749m9134k53067
2501.6F46130981l10974q5449n3787k1820J21307o71997j73492P7362k80381j43280
2511.2F44588470o3095q6441k79770q7585l18832K41241L77045o2790j64490n92956
2520.9F43550797k00120k95333k23313j71966k91596L5706j66626m09699n15365j84860
$$ plain form
2453.4 655144119 655004196 654957352 654602814 654436798 654112091 654263840 654262238 653898392 653989792 653164902
2463 653164902 652498474 652113495 652103195 652301102 652095566 651917191 651586075 651620178 651370010 651181183
2472.7 651181183 650863113 650341339 649987717 649669571 650198975 650448380 650210342 649721375 649490509 649320221
2482.3 649320221 648950424 649230194 649093475 648766327 648394547 648055496 647857590 647840424 647856369 647437057
2492 647437057 647686234 647757797 647263184 646672668 646654968 646983719 646556931 646433182 646384048 646130981
2501.6 646130981 645820007 645734558 645680771 645658951 645780258 645108261 644934769 645012131 644731750 644588470
2511.2 644588470 644525375 644438934 644159164 644071579 643752747 643993988 644371033 644308243 644143753 643550797
2520.9 643550797 643350677 643055344 642832031 642660065 642368469 642404175 642237549 641827850 641312485 641127625
2530.5F41127625j87073k0905J59531j91116n93262n26543j0910j94588j95541m04091
2540.2F38963127j2131J2246m73710j297m31709n64194n87081R2544K73476l30887
2549.8F36940384l6125o06308l69721k44331k02866j40686l09677P6904l22914l98063
2559.5F34386597o15921k28577j58424l54500p9575l70521J36413p0877j88408l00522
2569.1F32155685l11966r2010m56429k20260l73802Q2359j75705n14717k02179n24292
2578.7F29366684l33977j69678L30925o5269k31476k02675n89752k1400j13869m20799
2588.4F27548714n64576j2626J18866j17302K327r4414k58522q86116p9041J82763
2598F25840073j71166j21231l94936j89628n2033L80783m30831m56582l3264n05180
$$ plain form
2530.5 641127625 640940552 640919647 641079178 640888062 640294800 639768257 639757347 639562759 639367218 638963127
2540.2 638963127 638950996 638963242 638489532 638488235 638056526 637492332 636905251 636997795 637271271 636940384
2549.8 636940384 636904259 636297951 635928230 635683899 635481033 635340347 635030670 635107574 634784660 634386597
2559.5 634386597 633770676 633542099 633383675 633029175 632949600 632579079 632715492 632644615 632456207 632155685
2569.1 632155685 631843719 631751709 631295280 631075020 630701218 630783577 630607872 630093155 629890976 629366684
2578.7 629366684 629032707 628863029 629193954 629128685 628897209 628694534 628104782 628083382 627969513 627548714
2588.4 627548714 626984138 626971512 627090378 626973076 626975403 626880989 626622467 625736351 625657310 625840073
2598 625840073 625668907 625547676 625152740 624963112 624911079 625291862 624861031 624404449 624371185 623866005
2607.7F23866005O2942J13068j88789q96378m39148P8240l77922l10669m66423l07084
2617.3F21133842m70008j52741l60794m57954r16m40445k28920l69835l78723l79715
2627F17893791k74200n23033q54493l59458o67153j83945k05993l21160J4153o13518
2636.6F13904991q85238n68924k04163p08580n63240l71666k75307m26407o34002o2714
2646.3F09204750q65288o87103k88086k10609k7390m28429l43666p37953m83589p81403
2655.9F04351234n65986m4594o75011n12237l86772q7090n38406n84069k03209j86347
2665.5F00567513k02141p07436k86980j72500j78871o15082n38330l34435q69713j49231
2675.2E96512794j80130p4920r7656n18113n56640n01976k22092m63486k74429n96352
$$ plain form
2607.7 623866005 623928947 624042015 623853226 622956848 622517700 622595940 622218018 621907349 621440926 621133842
2617.3 621133842 620663834 620511093 620150299 619692345 619691429 619250984 619022064 618652229 618273506 617893791
2627 617893791 617619591 617096558 616242065 615882607 615215454 615031509 614825516 614504356 614518509 613904991
2636.6 613904991 613019753 612450829 612246666 611538086 610974846 610603180 610327873 609901466 609267464 609204750
2646.3 609204750 608339462 607652359 607364273 607153664 607126274 606697845 606354179 605616226 605132637 604351234
2655.9 604351234 603785248 603740654 603065643 602553406 602166634 602079544 601541138 600957069 600753860 600567513
2665.5 600567513 600365372 599657936 599370956 599198456 599019585 598404503 597866173 597531738 596662025 596512794
2675.2 596512794 596332664 596257744 596160088 595641975 595085335 594583359 594361267 593897781 593623352 593027000
2684.8E93027000m02450n12886m32358L02467o29119m51775l35922l63007k13852l64227
2694.5E89623871k18620k65274j76507q94088m65431k51313n00412l04870m03481j89133
2704.1E85954742p03888k00271k12479n64308m29230n13687k14882q29200o33431n13077
2713.8E81140289o25496m40292k90794k83738m15039J145n65834j08452K2049m82483
2723.4E77951355l14484n28144k54441o39496m99916k33879J18447r4452q79441o24885
2733E74000664n71099r307k63215j75247m52118n84106N92613Q2932k28043o67915
2742.7E71725159l41378k30064m82445n4474m76150m4365m54521l96919j02425j96724
2752.3E68945694j2589l76739k2583m86565n49316m01535j29700p0572k59056O180
$$ plain form
2684.8 593027000 592624550 592111664 591679306 591981773 591352654 590900879 590564957 590201950 589988098 589623871
2694.5 589623871 589405251 589139977 588963470 588069382 587603951 587352638 586852226 586547356 586143875 585954742
2704.1 585954742 585250854 585050583 584838104 584273796 583844566 583330879 583115997 582286797 581653366 581140289
2713.8 581140289 580514793 580074501 579783707 579499969 579084930 579086075 578520241 578411789 578433838 577951355
2723.4 577951355 577636871 577108727 576854286 576214790 575714874 575480995 575599442 575504990 574625549 574000664
2733 574000664 573429565 573420258 573157043 572981796 572529678 571945572 572538185 572621117 572393074 571725159
2742.7 571725159 571383781 571153717 570671272 570616798 570140648 570096283 569641762 569244843 569142418 568945694
2752.3 568945694 568933105 568556366 568533783 568047218 567497902 567096367 566966667 566896095 566637039 566643219
2762E66643219p04536J65023K79351l94936m76456n98373j90392k71873J47743k12135
2771.6E64386635j76697l31535l39508J91726p12890n28221m65393q4610k50969p44439
2781.3E60944099l63884o70394l69187l47442j17569j88637j45607n99938j047897
2789.9E57093544j57890n59540k94457m38957l76816k53639j222038o91185k66342
2798.6E52832680k27356q08068o61392n94253j083908q34504q75053l41949l70827
2807.3E47035370l08914m56124p06100p99866j151390q11233j002160o57234p48024
2816E40394325p36427o52390r92660o02303j109123j131782p91626m60816j042938
2824.7E32874260j497078q69904r56916q04558j014671n96467p52182j086082r69734
$$ plain form
2762 566643219 565938683 566103706 566383057 565988121 565511665 564913292 564722900 564451027 564598770 564386635
2771.6 564386635 564209938 563878403 563538895 563730621 563017731 562489510 562024117 561939507 561688538 560944099
2781.3 560944099 560580215 559909821 559540634 559193192 559075623 558886986 558741379 558141441 557093544
2789.9 557093544 556935654 556376114 556081657 555642700 555265884 555012245 553790207 553099022 552832680
2798.6 552832680 552605324 551797256 551135864 550541611 549457703 548623199 547748146 547406197 547035370
2807.3 547035370 546726456 546270332 545564232 544764366 543612976 542801743 541799583 541142349 540394325
2816 540394325 539657898 539005508 538012848 537410545 536301422 535169640 534378014 533917198 532874260
2824.7 532874260 531377182 530507278 529550362 528745804 527731133 527134666 526382484 525296402 524326668
2833.3E24326668j410561r83391j248741q63457j016464j630859j557846j677208j000786
2842E12937355j512527j663056j374702j298523j194649j584473j718101j900940j575890
2850.7D99114494j483497j240120j543808j258164o81266j285210r82590q12721j51901
2859.4D89675217p39022j647300j097412j058655j320000j916695j639022j727639
2867.1D78529472j719169j970139k077865j415215k113838k053337k036858j712952
2874.8D63430099k019157k640991k050133k134514j848182k062455j482620j369629
2882.5D47822418j714287r44099j159363r34715q23441o86302o85081m29459m17442
2891.2D40028229r94454n10635q7547J75514q70743n86815j5068m79622k24457q56819
$$ plain form
2833.3 524326668 522916107 521932716 520683975 519820518 518804054 517173195 515615349 513938141 512937355
2842 512937355 511424828 509761772 508387070 507088547 505893898 504309425 502591324 500690384 499114494
2850.7 499114494 497630997 496390877 494847069 493588905 492907639 491622429 490639839 489827118 489675217
2859.4 489675217 488936195 487288895 486191483 485132828 483812828 481896133 480257111 478529472
2867.1 478529472 476810303 474840164 472762299 471347084 469233246 467179909 465143051 463430099
2874.8 463430099 461410942 458769951 456719818 454585304 452737122 450674667 449192047 447822418
2882.5 447822418 446108131 445164032 444004669 443069954 442246513 441560211 440875130 440445671 440028229
2891.2 440028229 439033775 438523140 438435593 438611107 437740364 437153549 437138481 436658859 436434402 435577583
2900.8D35577583j32446l700o36597p20405o00892m52270q36525l17268p24793q14819
2910.5D30337868j173058j423874j106796j422844j179428k085991j645470j302032
2918.2D18998375j649475j694946j871033j010285j541366j254273j030807r62181
2925.9D07984009n87082n15938J40038k71950J58691K13890M30909N48172L22494J349030
2935.6D09772263J435089J384544J636887K133178J849404J962166K127761J965523
2943.3D24266815K446442J882438K162209K098770K159538K183877K018775K492600
2951D41711464J996918K302208K033119K179069J952057K023583K401619J210670K276459
2959.7D60087166K384224J858139J607704J348343J731872J474572J641082J077004
$$ plain form
2900.8 435577583 435445137 435441437 434804840 434084435 433483543 433031273 432194748 431877480 431152687 430337868
2910.5 430337868 429164810 427740936 426634140 425211296 424031868 421945877 420300407 418998375
2918.2 418998375 417348900 415653954 413782921 412772636 411231270 409976997 408946190 407984009
2925.9 407984009 407396927 406880989 407021027 406749077 406907768 407121658 407552567 408100739 408423233 409772263
2935.6 409772263 411207352 412591896 414228783 416361961 418211365 420173531 422301292 424266815
2943.3 424266815 426713257 428595695 430757904 432856674 435016212 437200089 439218864 441711464
2951 441711464 443708382 446010590 448043709 450222778 452174835 454198418 456600037 457810707 460087166
2959.7 460087166 462471390 464329529 465937233 467285576 469017448 470492020 472133102 473210106
2967.4D73210106J437035J577339J204033J054115Q42819J377640J521454J912117
2975.1D84136658R16137R50623J712646J553612J745453J006165J148719J189385J404953
2983.8D95764351J321106J006775J284981J231422J588364P25746Q68416J253166J093368
2992.5E06137695J210785M34418M81186P78389Q75435L84292K94533L33252K58522
3001.1E11188507L45078q736J83792l891J58310k09007j11046O0654m48609K61803
3010.8E11416855p5684m07409o61202j67770l03612r42726j29242q08487p91664p06597
3020.4E06422462n75294m03099p43256o71386j273232r00764m68331J6136q61053j243553
3030.1D99298630n23110j230011o41327r12399j203613j170387r18198n69725r15833
$$ plain form
2967.4 473210106 474647141 476224480 477428513 478482628 479325447 480703087 482224541 484136658
2975.1 484136658 485052795 486003418 487716064 489269676 491015129 492021294 493170013 494359398 495764351
2983.8 495764351 497085457 498092232 499377213 500608635 502196999 502922745 503791161 505044327 506137695
2992.5 506137695 507348480 507782898 508264084 509042473 509917908 510302200 510596733 510929985 511188507
3001.1 511188507 511533585 511524849 511708641 511704750 511863060 511654053 511543007 511603661 511155052 511416855
3010.8 511416855 511341171 510933762 510272560 510104790 509801178 508858452 508729210 507920723 507129059 506422462
3020.4 506422462 505847168 505444069 504700813 504029427 502756195 501855431 501387100 501403236 500542183 499298630
3030.1 499298630 498775520 497545509 496904182 495991783 494788170 493617783 492699585 492129860 491214027
3038.7D91214027m96025q70170p15981j431999j474609p29981j336212r60159p23954
3047.4D82474937n78727j250000j027565j069794j476669p58400j155167m15115o52924
3056.1D74090576j539116j389236j077423j062737j278610p30400j070099r47113j545792
3064.8D63450050j016960k04696j306649r94987j231804j185761j333236j049195o43310
3073.5D54483452j115837r72557j524048j092606q17299n11589j017112j542664r42345
3082.1D44947395j206817n92766j186295j427116j183434p80220n24025j575126j049195
3090.8D35422401j027450q45261j073379j252480j169395j322060j96953p50503q02918
3099.5D26982002j263160j968499j530685j047745o25877j337815q99200r29184p43751
$$ plain form
3038.7 491214027 490718002 489847832 489131851 487699852 486225243 485495262 484159050 483198891 482474937
3047.4 482474937 481896210 480646210 479618645 478548851 477072182 476313782 475158615 474743500 474090576
3056.1 474090576 472551460 471162224 470084801 469022064 467743454 467013054 465942955 464995842 463450050
3064.8 463450050 462433090 462228394 460921745 459926758 458694954 457509193 456175957 455126762 454483452
3073.5 454483452 453367615 452395058 450871010 449778404 448961105 448449516 447432404 445889740 444947395
3082.1 444947395 443740578 443147812 441961517 440534401 439350967 438570747 438046722 436471596 435422401
3090.8 435422401 434394951 433549690 432476311 431223831 430054436 428732376 428535423 427784920 426982002
3099.5 426982002 425718842 423750343 422219658 421171913 420546036 419208221 418309021 417379837 416636086
3108.2D16636086q01621j297264r40094j346092q66471q27942m53071j150551j792870
3116.9D07160110o76612o65779o96412j375541r97391j114883j208954o68373j177292
3125.5C98578873q62580j173553q12683q86421j038933p96662r87815q40493j200065
3134.2C89979668n59693j015548r04923m58755j397705j423989j047859n17502j004944
3142.9C81648750r92317j076851j115722q46673q01582m14619j094666p18994j131477
3151.6C73455849j175423m09508o49528p35932j439819q69408j082725r72557n67856
3160.3C65553093r25751m87594r07021p57637r71413o78825r39026j204986l81814
3168.9C58299026j018791m91523n72434j084976q59070p81212q85963q76808n80063
$$ plain form
3108.2 416636086 415834465 414537201 413597107 412251015 411384544 410556602 410103531 408952980 407160110
3116.9 407160110 406483498 405817719 405121307 403745766 402748375 401633492 400424538 399756165 398578873
3125.5 398578873 397716293 396542740 395730057 394843636 393804703 393008041 392020226 391179733 389979668
3134.2 389979668 389419975 388404427 387499504 387040749 385643044 384219055 383171196 382653694 381648750
3142.9 381648750 380656433 379579582 378463860 377617187 376815605 376400986 375306320 374587326 373455849
3151.6 373455849 372280426 371870918 371221390 370485458 369045639 368176231 367093506 366120949 365553093
3160.3 365553093 364627342 364139748 363232727 362475090 361503677 360824852 359885826 358680840 358299026
3168.9 358299026 357280235 356788712 356216278 355131302 354272232 353491020 352605057 351728249 351148186
3177.6C51148186j107407n21545q26989j053352l84064m02984o63567j203995l43704
3186.3C44640579m82673p02973r39903j450424q26073l09715j45417j251983q04558
3195C37726860p21436r84230l69415p53326l44620p80487n11246l87306o69098n62324
3204.6C31643372j101036n18494l79791n05829r83811q03108m43993l12843J40076
3213.3C26734543p79114p68318p33605p44171l67469l64953p42492n81169R0179r01642
3222.9C20841789p38258m91428o99978q84457r54628L1471j71547l39069p92236n00145
3232.6C15301514m21753m75617q5640r46254m47197q18692n80253j13545o40697l41587
3242.2C10430279l97434j4210r53140p79210l41415n38235j37768o94351k93426n03235
$$ plain form
3177.6 351148186 350040779 349519234 348692245 347638893 347254829 346851845 346188278 344984283 344640579
3186.3 344640579 344157906 343454933 342515030 341064606 340238533 339928818 339783401 338531418 337726860
3195 337726860 337005424 336021194 335651779 334898453 334553833 333773346 333262100 332874794 332205696 331643372
3204.6 331643372 330542336 330023842 329644051 329138222 328154411 327351303 326907310 326594467 326734543
3213.3 326734543 325955429 325187111 324453506 323709335 323341866 322976913 322234421 321653252 321743431 320841789
3222.9 320841789 320103531 319612103 318912125 318027668 317073040 317104511 316932964 316593895 315801659 315301514
3232.6 315301514 314879761 314404144 314318504 313372250 312925053 312106361 311526108 311412563 310771866 310430279
3242.2 310430279 310032845 310018635 309065495 308286285 307944870 307406635 307268867 306574516 306281090 305777855
3251.9C05777855n82295n78479m73996k16445n38617M9172k60067l21732m46739l40385
3261.5C02068272l74489q18653r2545k97794n61218k06433K19860n41763o11382j05381
3271.2B98678474l81298O6510o11210l68881m83723p36237k13852n35431O333l61443
3280.8B95059242n4207P382q38070n77660j18580L79773J17530m10881r25178m76151
3290.4B92163200n11322m36515K93560k73152n09052n11685j2531m89235o17733m7035
3300.1B89048500l89099j9226l65410l57151j37672k43550m43725m67358k67849m39472
3309.7B85917988m1161m46892p8506k65923n41172J20907n96313n52502p39956m52308
3319.4B82324162R5005J01051j73493p10792k43340k51922m19483j158009o69746n8079
$$ plain form
3251.9 305777855 305195560 304617081 304143085 303926640 303388023 303437195 303177128 302855396 302408657 302068272
3261.5 302068272 301693783 300875130 300782585 300484791 299923573 299717140 299937000 299395237 298783855 298678474
3271.2 298678474 298297176 298363686 297752476 297383595 296899872 296163635 295949783 295414352 295420685 295059242
3280.8 295059242 295005035 295012417 294174347 293596687 293478107 293857880 293975410 293564529 292639351 292163200
3290.4 292163200 291651878 291215363 291508923 291235771 290726719 290215034 290202503 289713268 289095535 289048500
3300.1 289048500 288659401 288640175 288274765 287917614 287779942 287536392 287092667 286625309 286357460 285917988
3309.7 285917988 285876827 285429935 285351429 285085506 284544334 284665241 284068928 283516426 282776470 282324162
3319.4 282324162 282419167 282520218 282346725 281635933 281392593 281140671 280721188 279563179 278893433 278835354
3329B78835354o41003k84252k46468j17702m17252p1849k10591o17580k95887p37076
3338.7B75195694m96998m12941K33097n83210r81617K59705J1463k232n69095m27094
3348.3B72226772n63812n57442j70383p32174m89807o15845K613j11732m94747m96083
3357.9B67997360o42414j87359n08747l47500l92799j36223l86257k65637k1762q31795
3367.6B64276867j59092m74491k78855k10704n97420o46439n78632N31960m16241n13401
3377.2B60933552j97182l63884k64091o01273p5283j42670J51348l44677p12509n99632
3386.9B57783699l77617K37198l83873L43189N53208l66459p31106j27811R3364l92551
3396.5B56631241n2185l54214q9092m42467n46474j47782o4449K35462l54786m4575
$$ plain form
3329 278835354 278194351 277910099 277663631 277545929 277128677 277056828 276846237 276228657 275932770 275195694
3338.7 275195694 274698696 274285755 274518852 273935642 272954025 273213730 273225193 273222961 272653866 272226772
3348.3 272226772 271662960 271105518 270935135 270202961 269713154 269097309 269099922 268988190 268493443 267997360
3357.9 267997360 267354946 267167587 266658840 266311340 265918541 265782318 265396061 265130424 265108662 264276867
3367.6 264276867 264117775 263643284 263364429 263153725 262556305 261909866 261331234 261863194 261446953 260933552
3377.2 260933552 260736370 260372486 260108395 259507122 259431839 259289169 259440517 259095840 258383331 257783699
3386.9 257783699 257406082 257643280 257259407 257602596 258155804 257789345 257058239 256930428 257023792 256631241
3396.5 256631241 256579056 256224842 256135750 255693283 255146809 254999027 254934578 255170040 254815254 254770679
3406.2B54770679l23200J98307J14556n24845N2738m61254K50568j76907O695N56469
3415.8B54463806m73518k63081K25220M74853r21764p26166M50821O73466L88184j95275
3425.5B54096546Q2665m12140J32999J86615L60661K46772o43844r8400l26958N92232
3435.1B54217148M64802j71032j57261k42634L17478L39203J066971N5618j46809K50931
3444.7B55994415L52993P91226j264820j55945J131611N89637P0115J38435N58548
3453.4B58206215k14939Q9512N31006L64589J22757O08807L31440j76125N82066K44179
3463.1B60689507M74319M44565L58867L3608j85280O96316P41939O21968l27664j65596
3472.7B63382549O08559P25346M86526J87302L77521K9583P20463O71539O59733J88408
$$ plain form
3406.2 254770679 254447479 254645786 254760342 254235497 254288235 253826981 254077549 253900642 253907337 254463806
3415.8 254463806 253990288 253727207 253952427 254427280 253505516 252779350 253230171 253903637 254291821 254096546
3425.5 254096546 254179211 253767071 253900070 254086685 254447346 254694118 254050274 253951874 253624916 254217148
3435.1 254217148 254681950 254510918 254353657 254111023 254428501 254767704 255834675 255890293 255743484 255994415
3444.7 255994415 256347408 257138634 255873814 255717869 256849480 257439117 257509232 257647667 258206215
3453.4 258206215 257991276 258080788 258611794 258976383 259099140 259707947 260039387 259863262 260445328 260689507
3463.1 260689507 261163826 261608391 261967258 262000866 261815586 262511902 263253841 263875809 263548145 263382549
3472.7 263382549 263991108 264716454 265202980 265390282 265767803 265797386 266517849 267189388 267849121 268037529
3482.3B68037529k31247J103649L38860L83510P43828K64626L55205P67479J20888
3491B71884327l96080J206207N83534M26407M26083k26116O81343N89580L89996J40476
3500.7B75705757J241684O10561o56566L43132N63736J188049O57997P90558M44470
3509.4B80889378j5870M85650J71146Q78200P85542J066608P83844J28670P9537j1406
3519B85241299M67395P33757J511364L48645n67951P51018J640759J253032l67851
3527.7B91011467k6054M86908J214408N89543M51336Q11710o7234J294174N30682k54345
3537.3B96042595R52015J035175Q62065K73380Q82835Q16555J493168P91416o97155
3546C02452049J044560N51815P72819P35798J236229J615715m19330Q57296J123867
$$ plain form
3482.3 268037529 267806282 268909931 269248791 269632301 270376129 270640755 270995960 271763439 271884327
3491 271884327 271488247 272694454 273277988 273704395 274130478 273904362 274585705 275175285 275565281 275705757
3500.7 275705757 276947441 277558002 276901436 277244568 277808304 278996353 279654350 280444908 280889378
3509.4 280889378 280873508 281359158 281530304 282408504 283194046 284260654 285044498 285173168 285252705 285241299
3519 285241299 285708694 286442451 287953815 288302460 287734509 288485527 290126286 291379318 291011467
3527.7 291011467 290985413 291472321 292686729 293276272 293727608 294539318 294472084 295766258 296296940 296042595
3537.3 296042595 296994610 298029785 298891850 299165230 300048065 300864620 302357788 303149204 302452049
3546 302452049 303496609 304048424 304821243 305557041 306793270 308408985 307989655 308846951 309970818
3554.7C09970818J266002J271553Q7853J318016J231499L16505P05795J840019P67174
3563.4C18775234K40078L485680N23796j690025L33366P56340L949127J532326N86853
3572C28492775K000771Q46672N77850J557312K131767P91435K046471J505356K42310
3580.7C40192719K000389J835708J447029J038208M191017J556130m016533J733704
3588.4C49978371N72967L646317L262291K080002J180267R73663L762970j879234K040253
3597.1C65617867L618164o6987K711030J417884J708260J860199J870346K249184K085609
3605.8C83071556J221047j148034M249421j34278m63447P216758J672783k695236K503586
3614.5C95494156M4021M656182N059242l19023J673164j351890K359924M746246J351700
$$ plain form
3554.7 309970818 311236820 312508373 312596226 313914242 315145741 315462246 316168041 318008060 318775234
3563.4 318775234 319015312 322500992 323024788 321334763 321668129 322424469 326373596 327905922 328492775
3572 328492775 330493546 331340218 331918068 333475380 335607147 336398582 338445053 339950409 340192719
3580.7 340192719 342193108 344028816 345475845 346514053 350705070 352261200 348244667 349978371
3588.4 349978371 350551338 354197655 357459946 359539948 360720215 361693878 365456848 363577614 365617867
3597.1 365617867 369236031 369169044 371880074 373297958 375006218 376866417 378736763 380985947 383071556
3605.8 383071556 384292603 383144569 387393990 387259712 386796265 394013023 395685806 392990570 395494156
3614.5 395494156 395538177 400194359 405253601 404934578 406607742 405255852 407615776 412362022 413713722
3623.1D13713722K276154K732239J680717J902008N543938k263870j1107102O648903
3630.9D21126709O009636N815048R04656j853371L033256L382950K206993K18735J975670
3639.5D42820282K455559K475624J195831K9946K219467L406410N375252m282151m739799
3648.2D50956421O342468Q75588j370659Q42514O473465L821983L645821M564819p892952
3656.9D68259468K066383N591279K170715J593056J295852K101288Q29773J575317
3664.6D85483131K198029J281395L346367J526298j548156Q163n378685L815422R319496
3673.3E00051460P679787n422478j7941780P663078R029160M946098j368408N27535
3681E05164452L779564K078742J563416N68886J29165L669091M913101r978943j924095
$$ plain form
3623.1 413713722 415989876 418722115 420402832 422304840 427848778 425584908 414477806 421126709
3630.9 421126709 427136345 432951393 433856049 432002678 435035934 438418884 440625877 440844612 442820282
3639.5 442820282 445275841 447751465 448947296 448977242 451196709 454603119 459978371 455696220 450956421
3648.2 450956421 457298889 458174477 456803818 457646332 464119797 467941780 471587601 476152420 468259468
3656.9 468259468 470325851 475917130 478087845 479680901 480976753 483078041 483907814 485483131
3664.6 485483131 487681160 488962555 492308922 493835220 492287064 492295227 486916542 490731964 500051460
3673.3 500051460 507731247 502308769 484366989 492030067 501059227 506005325 504636917 505164452
3681 505164452 508944016 511022758 512586174 513155060 513284225 516953316 521866417 511887474 509963379
3689.7E09963379R052849n347901J422272O025162J087799K223511Q91227J88980O82335
3698.4E26189613K81411K461700L130798m787902k172471N567589J532021N93948O10352
3707E33407059K260666M435310q267517K970619L740273j2206040N065994M856339
3714.8E36262703J037941J175346L232689J915589l712120P69310O754989l229294
3722.5E44207153n158767O614303K334900J32675k784424n81321L683395J190987N744781
3731.2E55383682l958931p780342R730301l11088j1577988J417580L335838J234245
3738.9E47473297L491478L188439m248658L117066J2247047j2746696j5859490J1689377
3746.6E48351860N805244N910950m334335j1184502J0689659m488296n131149O816406
$$ plain form
3689.7 509963379 519016228 513668327 515090599 521115761 522203560 524427071 525318298 525507278 526189613
3698.4 526189613 526471024 528932724 532063522 527275620 525103149 530670738 532202759 532796707 533407059
3707 533407059 535667725 540103035 531835518 534806137 538546410 526340370 531406364 536262703
3714.8 536262703 537300644 538475990 541708679 543624268 539912148 540681458 547436447 544207153
3722.5 544207153 539048386 545662689 547997589 548130264 545345840 544764519 548447914 549638901 555383682
3731.2 555383682 551424751 543644409 553374710 553063622 541485634 542903214 546239052 547473297
3738.9 547473297 550964775 554153214 549904556 553021622 565268669 552521973 536662483 548351860
3746.6 548351860 554157104 560068054 555733719 544549217 555238876 550750580 545619431 552435837
3754.3E52435837N428848L141594n499153J699905N864029o701584j115455M211197
3762E59465218O51245N50956L891335k329521m719849L710556N075379q05779q570709
3770.7E56918831K903213M712143N17197M17519n08156N48286L67050K097779p73545
3779.4E67200317p898101M062461L124237J095238L026848k999992j280442Q36258
3787.1E67166824J625214J521034l75023M01383J78222Q66089n84640J149711L046647
3795.8E74995461m441224m317398J589585M905815N603981p230606q740006N026322
3803.5E67391930L458557M999733O548805j1350708l890533N961265K229385J48049
3811.2E75496483M50554N99746P12243N411491k372475j4345703O517792O509552M003525
$$ plain form
3754.3 552435837 557864685 561006279 555507126 557207031 563071060 556369476 555254021 559465218
3762 559465218 560116463 560667419 564558754 562229233 557509384 561219940 566295319 565489540 556918831
3770.7 556918831 559822044 564534187 565051384 565468903 564960747 565509033 565876083 567973862 567200317
3779.4 567200317 559302216 563364677 566488914 567584152 570611000 567611008 566330566 567166824
3787.1 567166824 568792038 570313072 569938049 570339432 570517654 571383743 570799103 571948814 574995461
3795.8 574995461 570554237 566236839 567826424 572732239 578336220 571105614 562365608 567391930
3803.5 567391930 570850487 575850220 582399025 571048317 567157784 573119049 575348434 575496483
3811.2 575496483 575947037 576546783 577259026 582670517 580298042 565952339 572470131 578979683 582983208
3819.9E82983208j224709j6201515L832588O121102K052574K719383J082230m334946
3827.6E77029915k3842K300949M410515J637001r760208K566719O745720o327286l33672
3836.3E78245811Q957444j0295830m912033R345054m779586J203270P891044k996597
3844E82658577m648361L687057K041397j44119J603851j733322J575661N460434o529732
3852.7E83971443N55382j3849945J541519J0730591k70500j628189L058738K330323
3860.4E86439362K369117o086197j74102Q333435p045479n536690M767304N374336
3868.1E88441086O750641q420067r868851M427910P577019M851455j0046997J02272
3875.8E83814468M396325K25105J259003L593711o323967o825218O870308J362915
$$ plain form
3819.9 582983208 581758499 565556984 569389572 575510674 577563248 580282631 581364861 577029915
3827.6 577029915 577006073 579307022 583717537 585354538 575594330 578161049 584906769 578579483 578245811
3836.3 578245811 587203255 576907425 571995392 581340446 576560860 577764130 585655174 582658577
3844 582658577 578010216 581697273 583738670 583594551 585198402 583465080 585040741 590501175 583971443
3852.7 583971443 584526825 570676880 572218399 582948990 582678490 581050301 584109039 586439362
3860.4 586439362 588808479 582722282 582548180 590881615 583836136 578299446 583066750 588441086
3868.1 588441086 595191727 586771660 576902809 581330719 588907738 593759193 583712196 583814468
3875.8 583814468 588210793 588435898 589694901 593288612 586964645 580139427 587009735 588372650
3883.5E88372650Q87413N886612j1400337N56793M220390K74964M516716J15013r141045
3892.2E84289169J673584M373970r39827R17054J348877K342948J707650j1095772
3899.9E84617653N062103K532959o789245O459655k327118j615867P80678O32591K549629
3908.6E91903038q18520L30506m9896L28598K07252q88443J742554K129593l469048
3917.3E91415634l670997N049781L40500l890152K779732J457558R58938j952629j775093
3926E90713272J923523J050873J114464q88253l63617J480446j641006j081925J174927
3934.6E93482704k34108L91655Q44269j014824p9117j89247J579743J932830m027443
3943.3E92686462q92791J391067J062508J563377j990433n5160Q98170j932525J376533
$$ plain form
3883.5 588372650 589260063 595146675 583746338 584303131 588523521 588798485 593315201 593430214 584289169
3892.2 584289169 585962753 590336723 589396896 590313950 591662827 594005775 595713425 584617653
3899.9 584617653 589679756 592212715 585423470 591883125 589556007 587940140 588720818 589353409 591903038
3908.6 591903038 591084518 591415024 591365128 591693726 591900978 591012535 592755089 594884682 591415634
3917.3 591415634 587744637 592794418 593134918 589244766 592024498 593482056 594440994 592488365 590713272
3926 590713272 592636795 593687668 594802132 593913879 593550262 595030708 593389702 592307777 593482704
3934.6 593482704 593248596 593640251 594484520 593469696 593390579 593201332 594781075 596713905 592686462
3943.3 592686462 591793671 593184738 594247246 595810623 593820190 593765030 594663200 592730675 594107208
3952E94107208M97399j101227R24339R60465K26173j372910L66745N91126R1019P80143
3961.6E96070480k052574j69868J379204P03697J50337l59612K90413j265182J41105
3970.3E94888000J171494j15166q4800r041J82686m41971L39546Q40988L12576k40821
3980E96843491p4425R537m31672R39293J34659q95424J22223L30582k54021N15175
3989.6E97239418J021500n79377j85470j51978j01814k18315p48367M69207R11827
3998.3E97656631O97060q39348
4000.2E97514343
$$ plain form
3952 594107208 594604607 593503380 594427719 595388184 595614357 594241447 594608192 595199318 595290337 596070480
3961.6 596070480 594017906 593848038 595227242 595930939 596081276 595721664 596012077 594746895 594888000
3970.3 594888000 596059494 595944328 595859528 595850487 596033173 595591202 595930748 596771736 597084312 596843491
3980 596843491 596769066 596778603 596346931 597286224 597420883 596525459 596647682 596978264 596724243 597239418
3989.6 597239418 598260918 597681541 597496071 597344093 597242279 597023964 596275597 596744804 597656631
3998.3 597656631 598353691 597514343
4000.2 597514343
##END=$$ End of the data block
