##TITLE=$$ Begin of the data block
##JCAMP-DX=5.00 $$ ACD/SpecManager v 10.08
##SPECTROMETER/DATA SYSTEM=Varian
##DATE=20 Nov 2012 15:26:50
##DATA TYPE=INFRARED SPECTRUM
##DATA CLASS=XYDATA
##ORIGIN=
##OWNER=
##NPOINTS=3735
##FIRSTX=399.26403809
##LASTX=4000.35498047
##MAXX=4000.35498047
##MINX=399.26403809
##MAXY=72.29151154
##MINY=20.57304573
##XFACTOR=1.0000000000
##YFACTOR=0.000000100000000
##FIRSTY=50.96517181
##DELTAX=0.96440572
##XUNITS=1/CM
##YUNITS=TRANSMITTANCE
##XYDATA=(X++(Y..Y))
$$ plain form
399.3 509651718 533126602 491748123 483758316 488922615 499789391 495368958 498338928 505955963
407 505955963 494560966 485422325 478715401 493277397 493343620 488331070 482317085 482314453 493891678
415.7 493891678 486146584 486682510 471848984 480018044 491223183 489841347 496835442 495228233
423.4 495228233 495673981 481188087 479132423 478473396 478069878 485455246 478839607 473771362 469427872
432.1 469427872 474379196 471438370 467390480 470195618 467761269 467200508 461953812 463155327 459744682
440.7 459744682 467679100 480862350 479466743 479744263 481147194 495240898 493237076 493302536 493353844
449.4 493353844 485291367 485736237 483665504 488817329 485568428 487674675 491377258 488860779 487776642
458.1 487776642 481385269 483999329 480554047 481266823 484111023 487396278 487315750 479714546 480120125
$$ packed form
399.3E09651718K3474884m1378479p989807N164299J0866776m420433K969970P617035
407E05955963j1394997r138641o706924J4561996O6223n012550o013985k632J1577225
415.7D93891678p745094N35926j4833526Q169060J1205139j381836O994095j607209
423.4D95228233M45748j4485894k055664o59027m03518P385368o615639n068245m343490
432.1D69427872M951324k940826m047890K805138k434349n60761n246696J201515l410645
440.7D59744682P934418J3183250j395607K77520J402931J4093704k003822O5460N1308
449.4D93353844q062477M44870k070733N151825l248901K106247L702583k516479j084137
458.1D87776642o391373K614060l445282P12776K844200L285255q0528p601204M05579
$$ plain form
466.8 480120125 479511452 481381645 476167259 473195496 470109711 463534393 465738487 462419472 464701614
475.5 464701614 462128334 459892769 459696922 459624100 458768005 456440392 462827530 461840019 460990715
484.1 460990715 458798027 455439644 454922104 455058823 457519569 456422920 460322075 457692871 456150703
492.8 456150703 458355217 457298279 456594620 452158394 453080406 449933853 449319916 452270851 451698723
501.5 451698723 449318390 445742073 447329025 444779625 443461609 441232071 441078415 440428581 435243301
510.2 435243301 436821709 435350800 433413239 430935898 430389252 430364761 425897408 424410172 421103516
518.9 421103516 419623795 417567444 416267471 414631615 412051582 410427628 407785301 409606819
526.6 409606819 408773079 408375931 408347893 407405243 407891159 407375336 408592491 409848709 412331581
$$ packed form
466.8D80120125o08673J870193n214386k971763l085785o575318K204094l319015K282142
475.5D64701614k573280k235565j95847p2822q56095k327613O387138r87511q49304
484.1D60990715k192688l358383n17540J36719K460746j096649L899155k629204j542168
492.8D56150703K204514j056938p03659m436226R22012l146553o13937K950935n72128
501.5D51698723k380333l576317J586952k549400j318016k229538j53656o49834n185280
510.2D35243301J578408j470909j937561k477341n46646k4491m467353j487236l306656
518.9D21103516j479721k056351j299973j635856k580033j623954k642327J821518
526.6D09606819q33740l97148k8038r42650M85916n15823J217155J256218K482872
$$ plain form
535.2 412331581 414166718 416669502 419535446 420485153 424019814 425515938 426762009 432593117 437772179
543.9 437772179 434276962 431445808 434497566 434630241 433782387 432025452 433035164 432219238 431005554
552.6 431005554 430961876 428785324 428414650 425077171 423567543 422545280 421396751 420477219 415640869
561.3 415640869 412448196 410915375 410035591 406055374 401788063 399156570 397808228 395655823 390665398
570 390665398 388291473 385597649 384022484 383110275 383521538 384381981 383280830 385485077 386963844
578.6 386963844 388145714 390479889 394452477 398262672 399869652 403102074 405284233 407362518
586.4 407362518 410606651 413900185 415621796 416463890 418765450 419625130 420907402 421350975 421912766
595 421912766 422302246 421944656 422532501 422232285 423013878 422737808 422371025 420973473 419747009 420579605
$$ packed form
535.2D12331581J835137K502784K865944R49707L534661J496124J246071N831108N179062
543.9D37772179l495217k831154L051758J32675q47854j756935J009712q15926j213684
552.6D31005554m3678k176552l70674l337479j509628j022263j148529r19532m836350
561.3D15640869l192673j532821q79784l980217m267311k631493j348342k152405m990425
570C90665398k373925k693824j575165r12209M11263Q60443j101151K204247J478767
578.6C86963844J181870K334175L972588L810195J606980L232422K182159K078285
586.4D07362518L244133L293534J721611Q42094K301560Q59680J282272M43573N61791
595D21912766L89480l57590N87845l00216P81593k76070l66783j397552j226464Q32596
$$ plain form
604.7 420579605 419683914 419585609 420230217 420803642 419993553 419958763 420111008 419787865 421276131 421405869
614.3 421405869 422880974 424857750 426976395 428247490 428100395 429373550 430729332 433707275 435627594
623 435627594 437302399 438498116 439148636 441424522 442586403 443876228 444368477 446186638 448000145
631.7 448000145 449542007 451598473 451927490 453054543 453507500 455006371 455061150 455207634 456836510
640.4 456836510 455649986 455516853 456388550 457922134 457584229 457373810 459049339 460868607 462665367
649 462665367 461894112 461568947 461685181 463152733 463238373 463155289 464357605 463386688 464664688 464756203
658.7 464756203 464861565 465607529 465661964 465600243 464463005 464922981 464738121 467206078 474783249 488684006
668.3 488684006 480121460 472801971 471562233 471408691 472137833 473413391 474024200 474185867 475045509
$$ packed form
604.7D20579605q95691r8305O44608N73425q10089l4790J52245l23143J488266J29738
614.3D21405869J475105J976776K118645J271095j47095J273155J355782K977943J920319
623D35627594J674805J195717O50520K275886J161881J289825M92249J818161J813507
631.7D48000145J541862K056466L29017J127053M52957J498871N4779J46484J628876
640.4D56836510j186524j33133Q71697J533584l37905k10419J675529J819268J796760
649D62665367p71255l25165J16234J467552Q5640q3084J202316r70917J278000R1515
658.7D64756203J05362P45964N4435o1721j137238M59976j84860K467957P577171J3900757
668.3D88684006q562546p319489j239738j53542P29142J275558O10809J61667Q59642
$$ plain form
677 475045509 476312447 475418625 476963806 477491341 477689667 479029503 479349480 480156136 479811401 479603119
686.7 479603119 479327850 480072365 479677773 479830208 480753136 478988533 478466949 478458328 478858604 477478943
696.3 477478943 475203247 473590889 471355057 469449196 467890778 468092575 466055489 463982086 463285446
705 463285446 462154465 460819435 458626823 459435272 460115242 460091324 461083031 462607384 463789406
713.7 463789406 464357948 466791153 468480339 469889832 471818733 475308571 478320351 479583626 481502991
722.3 481502991 482899971 486925240 490354233 493018532 495568275 497571487 499920540 499421463 500878143
731 500878143 503131409 506188545 508802643 509673538 510986671 510682755 513200722 515391350 516170540
739.7 516170540 515398521 514220505 515113487 514478149 514889145 513930511 512579384 510402908 507824707
$$ packed form
677D75045509J266938q93822J545181N27535J98326J339836L19977Q06656l44735k08282
686.7D79603119k75269P44515l94592J52435R22928j764603n21584q621M00276j379661
696.3D77478943k275696j612358k235832j905861j558418K01797k037086k073403o96640
705D63285446j130981j335030k192612Q08449O79970k3918R91707J524353J182022
713.7D63789406N68542K433205J689186J409493J928901L489838L011780J263275J919365
722.3D81502991J396980M025269L428993K664299K549743K003212K349053m99077J456680
731E00878143K253266L057136K614098Q70895J313133l03916K517967K190628P79190
739.7E16170540p72019j178016Q92982o35338M10996r58634j351127k176476k578201
$$ plain form
748.4 507824707 506745834 505158768 504791641 501697350 499345016 498518448 496594772 493853035 489500084
757.1 489500084 486700897 484560318 483237038 482396164 481759605 479686737 478250465 479475975 479346657
765.7 479346657 479704285 480263100 481919518 484157753 485864525 488751602 492228546 496068077 498630905
774.4 498630905 502016869 505614853 509829063 514549370 518571129 523088112 525549622 528716431
782.1 528716431 531282501 532918816 534853859 537810745 541240997 541155548 542305717 543719673 545434265
790.8 545434265 547087021 548717194 551323738 551424713 553532829 556172142 558268127 559105339 560174828
799.5 560174828 562538376 563306313 565566101 567728920 570918884 572666550 573208923 573355865 573066254
808.2 573066254 575062523 574936409 576614151 577441673 576984100 577511101 577390633 578809662 578977547
$$ packed form
748.4E07824707j078873j587066l67127l094291k352334q26568j923676k741737m352951
757.1D89500084k799187k140579j323280q40874o36559k072868j436272J225510j29318
765.7D79346657L57628N58815J656418K238235J706772K887077L476944L839531K562828
774.4D98630905L385964L597984M214210M720307M021759M516983K461510L166809
782.1E28716431K566070J636315J935043K956886L430252q5449J150169J413956J714592
790.8E45434265J652756J630173K606544J00975K108116K639313K095985Q37212J069489
799.5E60174828K363548P67937K259788K162819L189964J747666N42373J46942k89611
808.2E73066254J996269j26114J677742Q27522m57573N27001j20468J419029J67885
$$ plain form
816.9 578977547 579510269 578891182 579392586 580235367 578912354 578301010 577099190 577289734 576571198
825.5 576571198 575631065 574243202 572646255 570714645 568400688 568126335 564903030 561856346 559095078
834.2 559095078 557027740 555774231 552608376 550147591 547347221 545806656 544040871 542728920
841.9 542728920 541044922 538585014 537657509 535947533 534130325 531820183 531566162 530552177 528204117
850.6 528204117 526979599 525211563 524013100 520990257 518587608 517219887 515937119 514588661
858.3 514588661 512255821 510095329 508379326 508980293 510268021 512918892 517034760 522412910 527290802
867 527290802 530692482 535732765 539873009 545464745 550241280 553898926 558802071 561811180 565148849
875.7 565148849 566853065 568457565 569212074 569099312 568576050 566195221 564581146 561905251 559874191
$$ packed form
816.9E78977547N32722o19087N01404Q42781j323013o11344j201820J90544p18536
825.5E76571198r40133j387863j596947j931610k313957k74353l223305l046684k761268
834.2E59095078k067338j253509l165855k460785k800370j540565j765785j311951
841.9E42728920j683998k459908r27505j709976j817208k310142k54021j013985k348060
850.6E28204117j224518j768036j198463l022843k402649j367721j282768j348458
858.3E14588661k332840k160492j716003O00967J287728K650871M115868N378150M877892
867E27290802L401680N040283M140244N591736M776535L657646M903145L009109L337669
875.7E65148849J704216J604500P54509j12762n23262k380829j614075k675895k031060
$$ plain form
884.4 559874191 556554756 552993431 550217476 547768250 546726151 544375000 542793198 540741692
892.1 540741692 539023972 536973381 534572830 532917480 530951653 530026016 527595024 526468277 525305862
900.8 525305862 523496246 522431030 519687157 517073174 514347725 511919289 508372688 505045967
908.5 505045967 501830902 498172646 494720840 489892159 485688705 480837822 476820259 472523384
916.2 472523384 467071686 462303429 457808876 454709015 451787300 449569244 447206955 445763397
923.9 445763397 445040550 443695297 442750893 441676979 441870117 441595612 442059021 443404350 444204140
932.6 444204140 445160675 445650864 447621880 449416504 451241226 453166199 455288925 458104362 459363251
941.3 459363251 461460876 463966713 466446953 467591362 467014046 466141930 463717079 461091843 457207069
$$ packed form
884.4E59874191l319435l561325k775955k449226j042099k351151j581802k051506
892.1E40741692j717720k050591k400551j655350j965827r25637k430992j126747j162415
900.8E25305862j809616j065216k743873k613983k725449k428436l546601l326721
908.5E05045967l215065l658256l451806m828681m203454m850883m017563m296875
916.2D72523384n451698m768257m494553l099861k921715k218056k362289j443558
923.9D45763397p22847j345253r44404j073914J93138k74505M63409J345329P99790
932.6D44204140R56535M90189J971016J794624J824722J924973K122726K815437J258889
941.3D59363251K097625K505837K480240J144409n77316q72116k424851k625236l884774
$$ plain form
949.9 457207069 452667427 448140907 443161926 437556725 431785851 425875854 418479805 411392937
957.7 411392937 404538269 397826233 390897484 383821716 376265106 368607903 361839409 354698448
965.4 354698448 347604332 339718399 331883583 324337845 316631012 308454742 300025902 291935368
973.1 291935368 283868446 276520691 268521786 261398735 254380283 247555218 241516953 235758362
980.8 235758362 231094131 225784626 221781864 217827225 214380798 211996651 210245628 209651031 208183613
989.5 208183613 207110748 206071491 205921345 205730457 205774345 206319485 206767979 207707539 207278004 207680435
999.1 207680435 207779942 208397903 208819580 208712578 209988728 210127239 211155014 210634937 209706917 209568233
1008.8 209568233 209358521 209989433 209348717 209030037 207385197 206889534 207784805 208169441 208312492
$$ packed form
949.9D57207069m539642m526520m978981n605201n770874n909997p396049p086868
957.7D11392937o854668o712036o928749p075768p556610p657203o768494p140961
965.4C54698448p094116p885933p834816p545738p706833q176270q428840q090534
973.1B91935368q066922p347755p998905p123051p018452o825065o038265n758591
980.8B35758362m664231n309505m002762l954639l446427k384147j751023n94597j467418
989.5B08183613j072865j039257j50146j90888M3888N45140M48494R39560m29535M02431
999.1B07680435R9507O17961M21677j07002J276150J38511J027775n20077r28020j38684
1008.8B09568233k09712O30912o40716l18680j644840m95663Q95271L84636J43051
$$ plain form
1017.5 208312492 208082428 209825916 210375004 211084328 212073631 212707024 213404350 213931694 215377960
1026.1 215377960 216380310 218515949 219418564 220455151 222158604 224013443 226199036 226284523 227532883
1034.8 227532883 228202763 229116077 229434776 228840923 229788551 230263309 231082249 231093426 232230339 232493458
1044.5 232493458 232159195 232197170 231493225 232624702 233181553 235079250 236525669 237610435 238881130
1053.1 238881130 240489063 243689690 245215874 248196297 250600643 253657417 257467442 260581341
1060.9 260581341 264482193 267338581 272576675 277503052 282022552 286048660 288087463 289645329
1068.6 289645329 288810482 286966686 283348103 278936462 273161583 267334805 263074932 259235802
1076.3 259235802 257888527 255989685 255158653 254753075 254898720 255659981 255963764 257288914 258364811
$$ packed form
1017.5B08312492k30064J743488N49088P09324R89303O33393O97326N27344J446266
1026.1B15377960J002350K135639R02615J036587J703453J854839K185593Q5487J248360
1034.8B27532883O69880R13314L18699n93853R47628M74758Q18940J1177J136913K63119
1044.5B32493458l34263L7975p03945J131477N56851J897697J446419J084766J270695
1053.1B38881130J607933L200627J526184K980423K404346L056774L810025L113899
1060.9B60581341L900852K856388N238094M926377M519500M026108K038803J557866
1068.6B89645329q34847j843796l618583m411641n774879n826778m259873l839130
1076.3B59235802j347275j898842q31032m05578J45645P61261L03783J325150J075897
$$ plain form
1085 258364811 260401134 261637535 263560658 265199280 266947079 269844475 271928558 275405521 277419624
1093.6 277419624 279651794 281974277 283501701 285066509 285892639 287662354 288462563 289171619 289305801
1102.3 289305801 289914246 290532360 290345364 291192989 291057472 292060089 293608246 295570126 297242393
1111 297242393 299042130 301672230 303197117 305132065 305884190 307430515 309158401 309753323 310330849
1119.7 310330849 311183357 313210468 313409824 314140911 315224247 316592922 318307095 318553810 320042114
1128.4 320042114 322050056 324860153 327320633 329613914 331611786 332579498 333377571 333263397 333680954
1137 333680954 332741394 331402664 329586945 326940422 324725914 320694160 316776981 312703705 309503536
1145.7 309503536 306533375 303508625 300837784 297544708 295219707 292154980 290430584 289055023
$$ packed form
1085B58364811K036323J236401J923123J638622J747799K897396K084083L476963K014103
1093.6B77419624K232170K322483J527424J564808Q26130J769715Q00209P09056J34182
1102.3B89305801O08445O18114j86996Q47625j35517J002617J548157J961880J672267
1111B97242393J799737K630100J524887J934948P52125J546325J727886N94922N77526
1119.7C10330849Q52508K027111J99356P31087J083336J368675J714173K46715J488304
1128.4C20042114K007942K810097K460480K293281J997872R67712P98073j14174M17557
1137C33680954r39560j338730j815719k646523k214508m031754l917179m073276l200169
1145.7C09503536k970161l024750k670841l293076k325001l064727j724396j375561
$$ plain form
1153.4 289055023 288287220 287882957 286576328 286251240 285686111 286561184 287046833 288026829 289229298
1162.1 289229298 290183620 292064781 293693542 297030277 299799252 302733612 306250267 311047573
1169.8 311047573 316323624 320422096 325833244 330903893 336416321 342147827 348334656 354389763
1177.5 354389763 359875793 366199265 371185837 376719589 382784538 388333473 393778992 398854828
1185.3 398854828 403883400 408159294 412688141 416366882 419499931 423036079 425796089 428694839
1193 428694839 430824776 432257042 432982597 433518524 434583092 435172501 436183891 437159081 438168144
1201.6 438168144 438436737 438806190 440020485 440860672 441979675 442411118 443490791 445388184 447107391
1210.3 447107391 448498878 449850807 452479324 454754868 456697388 458302879 460319939 462678528
$$ packed form
1153.4B89055023p67803m04263j306629l25088n65129Q75073M85649R79996J202469
1162.1B89229298R54322J881161J628761L336735K768975K934360L516655M797306
1169.8C11047573N276051M098472N411148N070649N512428N731506O186829O055107
1177.5C54389763N486030O323472M986572N533752O064949N548935N445519N075836
1185.3C98854828N028572M275894M528847L678741L133049L536148K760010K898750
1193D28694839K129937J432266P25555N35927J064568N89409J011390R75190J009063
1201.6D38168144K68593L69453J214295Q40187J119003M31443J079673J897393J719207
1210.3D47107391J391487J351929K628517K275544J942520J605491K017060K358589
$$ plain form
1218 462678528 464129829 465772171 466525383 467466354 468212624 468482819 468727074 468062172 467916031 467148056
1227.7 467148056 466339073 465828667 465437279 464903107 463684692 462852020 461796417 461123962 460407486
1236.4 460407486 459652748 458923950 457967148 457495003 457156258 456828728 456227875 456156616 456014404 456331863
1246 456331863 457606354 458502274 459411430 460037613 460708656 461301689 462160950 463287201 464190102 465286560
1255.7 465286560 465784264 466555443 467145996 467332001 467450485 467559929 468477783 469323387 469996719 470220833
1265.3 470220833 471089249 472467804 473214111 473925629 474602242 475673180 476365700 477288933 478035469
1274 478035469 478245087 478792877 478888359 478963509 478600311 478472252 478247719 477487411 477065506 476809921
1283.6 476809921 476615715 475994415 475841026 475380592 474789467 474440269 473863258 473689728 473188820 472514458
$$ packed form
1218D62678528J451301J642342P53212R40971P46270K70195K44255o64902j46141p67975
1227.7D67148056q08983n10406l91388n34172j218415q32672j055603o72455p16476
1236.4D60407486p54738p28798r56802m72145l38745l27530o00853p1259j42212L17459
1246D56331863J274491Q95920R09156O26183O71043N93033Q59261J126251R02901J096458
1255.7D65286560M97704P71179N90553J86005J18484J09444R17854Q45604O73332K24114
1265.3D70220833Q68416J378555P46307P11518O76613J070938O92520R23233P46536
1274D78035469K09618N47790R5482P5150l63198j28059k24533p60308m21905k55585
1283.6D76809921j94206o21300j53389m60434n91125l49198n77011j73530n00908o74362
$$ plain form
1293.3 472514458 471566963 470945396 470255280 469526215 468650093 467151566 466633339 466059074 465242081
1301.9 465242081 464000587 463152122 462966423 462216148 461618843 460508575 459749222 459072227 458176537
1310.6 458176537 457548103 456747894 456044540 455443726 455529289 455136833 454359627 453732224 453045044 452394600
1320.3 452394600 451571846 450926514 449886513 448766823 446951332 445173798 443633804 441293945 438926926
1328.9 438926926 436380577 434252892 432339249 430648880 428758240 426820412 425213127 423681450
1336.7 423681450 422807693 421909103 421358299 421341896 421940804 422255020 422146530 422258263 422568703 423217163
1346.3 423217163 423353958 423188248 422968063 422844543 422924385 422904625 422921486 422768364 422594795 422105675
1355.9 422105675 421787529 421304512 420591049 420342140 419629059 418831329 418073082 417155457 417192459 417624092
$$ packed form
1293.3D72514458r47495o21567o90116p29065q76122j498527n18227n74265q16993
1301.9D65242081j241494q48465j85699p50275n97305j110268p59353o76995q95690
1310.6D58176537o28434q00209p03354o00814Q5563l92456p77206o27403o87180o50444
1320.3D52394600q22754o45332j040001j119690j815491j777534j539994k339859k367019
1328.9D38926926k546349k127685j913643j690369j890640j937828j607285j531677
1336.7D23681450q73757q98590n50804j6403N98908L14216j08490J11733L10440O48460
1346.3D23217163J36795j65710k20185j23520P9842j9760J6861j53122j73569m89120
1355.9D22105675l18146m83017p13463k48909p13081p97730p58247r17625L7002M31633
$$ plain form
1365.6 417624092 417414436 417194061 416530724 415275841 415297623 415022888 415125313 415069199 414837685 415923424
1375.2 415923424 416558952 417425995 417621574 418148537 418767891 418999786 419584389 420294456 421586838
1383.9 421586838 422575569 423944740 425432968 427427483 429716301 431564064 433146133 434389648
1391.6 434389648 435606003 435933609 435071259 434628410 435904694 436256523 435095253 433852119 433678703
1400.3 433678703 434267654 433792076 433089638 432640343 430755844 430260201 430492706 429719162 428657684
1409 428657684 427883186 426629486 425601082 424948845 424242783 423945618 423294220 422571945 421703682 421333389
1418.6 421333389 419790993 419939384 421431923 421501503 421742554 421543236 422251091 423127670 422888680
1427.3 422888680 423461037 423570290 424160843 424556732 425485878 426569633 426899796 427865067 427964630 427715836
$$ packed form
1365.6D17624092k09656k20375o63337j254883K1782k74735J02425n6114k31514J085739
1375.2D15923424O35528Q67043J95579N26963O19354K31895N84603P10067J292382
1383.9D21586838R88731J369171J488228J994515K288818J847763J582069J243515
1391.6D34389648J216355L27606q62350m42849J276284L51829j161270j243134j73416
1400.3D33678703N88951m75578p02438m49295j884499m95643K32505p73544j061478
1409D28657684p74498j253700j028404o52237p06062k97165o51398p22275q68263l70293
1418.6D21333389j542396J48391J492539O9580K41051j99318P07855Q76579k38990
1427.3D22888680N72357J09253N90553L95889R29146J083755L30163R65271R9563k48794
$$ plain form
1437 427715836 428589439 430751534 432040672 432825356 433779526 433789787 434906502 435095482 435446167 435846062
1446.6 435846062 435617676 435000648 434728394 435156898 434064026 433915634 433612900 433561249 432966461 430676498
1456.2 430676498 428996658 426403542 429466362 429648705 430878754 431295929 431823235 434249954 433855782
1464.9 433855782 435563164 436937103 439715652 442207985 445079994 448990173 450954819 453998184
1472.6 453998184 456154556 462453766 466133804 469813232 474304581 477534981 481301804 483845406
1480.3 483845406 487461662 490147743 493539963 496493835 498504028 501064835 501878014 505047073
1488.1 505047073 506778107 507853699 510591125 514045410 517386780 518663216 520313950 521059151
1495.8 521059151 521763573 524268036 525907745 526772461 528461800 530372238 531345444 533008957 534019012
$$ packed form
1437D27715836Q73603K162095J289138P84684R54170J0261J116715J88980L50685L99895
1446.6D35846062k28386o17028k72254M28504j092872j48392l02734n1651n94788k289963
1456.2D30676498j679840k593116L062820J82343J230049M17175N27306K426719l94172
1464.9D33855782J707382J373939K778549K492333K872009L910179J964646L043365
1472.6D53998184K156372O299210L680038L679428M491349L230400L766823K543602
1480.3D83845406L616256K686081L392220K953872K010193K560807Q13179L169059
1488.1E05047073J731034J075592K737426L454285L341370J276436J650734P45201
1495.8E21059151P04422K504463J639709Q64716J689339J910438R73206J663513J010055
$$ plain form
1504.5 534019012 534896965 527187195 523078613 533469009 536684456 539158707 540198669 540968056
1512.2 540968056 541252899 542902794 543944283 542785873 543271103 542395401 545362701 546861038 543481827
1520.8 543481827 542875671 543939056 547495956 549032478 549503059 550232582 551244507 551221390 551334267
1529.5 551334267 552894325 552252808 552278137 551734848 549510307 551578674 552385712 553116341 553105354
1538.2 553105354 548114815 541720314 547595787 550645638 549673576 552565842 552508278 551436920 552981873
1546.9 552981873 553612747 553892021 552211571 550300179 551359825 552410583 552169876 549141426 549089203
1555.6 549089203 551401062 552203751 538548203 537381325 544658051 548211899 550209427 550525818
1563.3 550525818 550725746 549617462 549581718 549818077 549856071 549549370 545195351 546616936 547966156
$$ packed form
1504.5E34019012Q77953p709770m108582J0390396L215447K474251J039962P69387
1512.2E40968056K84843J649895J041489j158410M85230q75702K967300J498337l379211
1520.8E43481827o06156J063385L556900J536522M70581P29523J011925k3117J12877
1529.5E51334267J560058o41517K5329n43289k224541K068367Q07038P30629j0987
1538.2E53105354m990539o394501N875473L049851r72062K892266n7564j071358J544953
1546.9E52981873O30874K79274j680450j911392J059646J050758k40707l028450n2223
1555.6E49089203K311859Q02689j3655548j166878P276726L553848J997528L16391
1563.3E50525818J99928j108284l5744K36359L7994l06701m354019J421585J349220
$$ plain form
1572 547966156 548180580 548153038 548271561 547146950 542319756 545794411 547433357 547094727 547154427 546951752
1581.6 546951752 546523819 545850945 545784454 545674210 545117798 544580040 544150963 543530464 542503014 542093468
1591.2 542093468 540994301 540283966 539587631 538514786 538167992 537362938 536682854 535371895 534621391
1599.9 534621391 533768387 532437668 531614990 530384254 529770012 528691483 527103806 524926872 524156494
1608.6 524156494 523274651 521403656 520721169 518900948 517686844 515999985 514955978 513304710 506228409
1617.3 506228409 506899376 506716766 506064987 504184647 503289757 501202126 496691093 497306442 496815453
1626 496815453 496054001 492967873 491340714 491193008 489955864 488380127 486788139 487416496 487887459
1634.6 487887459 482354012 479948807 481666946 481400833 481736755 482264366 481096268 481641273 481138840
$$ packed form
1572E47966156K14424k7542J18523j124611m827194L474655J638946l38630N9700k02675
1581.6E46951752m27933o72874o6491j10244n56412n37758m29077o20499j027450m09546
1591.2E42093468j099167p10335o96335j072845l46794q05054o80084j310959p50504
1599.9E34621391q53004j330719q22678j230736o14242j078529j587677k176934p70378
1608.6E24156494q81843j870995o82487j820221j214104j686859j044007j651268p076301
1617.3E06228409O70967j82610o51779j880340q94890k087631m511033O15349m90989
1626D96815453p61452l086128j627159j47706j237144j575737j591988O28357M70963
1634.6D87887459n533447k405205J718139k66113L35922N27611j168098N45005n02433
$$ plain form
1643.3 481138840 481872368 482623520 479846039 479716682 480003815 482336235 483595963 486032600 488148956
1652 488148956 482508545 480012360 485913849 490332756 492499733 494274178 495457611 497333565 498688507
1660.7 498688507 500404167 502179909 502414246 505306053 507447243 509384155 510883408 511884575
1668.4 511884575 511362000 514316330 518920212 520329018 522735176 525519295 527776489 527970619 530654564
1677.1 530654564 533532867 535066261 537365799 538675652 541753616 544555817 543151894 543074913 547437248
1685.8 547437248 552231445 555021553 556313133 558091011 559953690 561993179 564069557 565545197
1693.5 565545197 567527618 569332123 566840973 570297813 573513145 577311745 578947563 573831253
1701.2 573831253 578078232 581208229 582669373 581729660 583297691 584593658 585328178 587361259 588518486
$$ packed form
1643.3D81138840P33528P51152k777481j29357K87133K332420J259728K436637K116356
1652D88148956n640411k496185N901489M418907K166977J774445J183433J875954J354942
1660.7D98688507J715660J775742K34337K891807K141190J936912J499253J001167
1668.4E11884575n22575K954330M603882J408806K406158K784119K257194J94130K683945
1677.1E30654564K878303J533394K299538J309853L077964K802201j403923p6981M362335
1685.8E47437248M794197K790108J291580J777878J862679K039489K076378J475640
1693.5E65545197J982421J804505k491150L456840L215332L798600J635818n116310
1701.2E73831253M246979L129997J461144r39713J568031J295967P34520K033081J157227
$$ plain form
1709.9 588518486 588965149 589573212 590802612 591578865 590797577 590373421 592316780 593924255 590602455
1718.5 590602455 594162865 597083321 598522186 599069214 598959656 599396591 600529327 601766510 602161217
1727.2 602161217 602807236 603655777 603080139 603437233 605495338 606509247 602633858 601809921 605820160
1735.9 605820160 608910675 609853020 610773277 610252037 609025879 612051277 613100052 612327309 613311729
1744.6 613311729 615096130 616045494 616141205 617433014 617699165 619770164 620059586 619968834 623026428
1753.3 623026428 624447823 625824814 627560539 627098923 627613716 628931923 629540482 631284599 631637344
1761.9 631637344 631368103 633465881 634460068 635259590 636105003 636638145 635482254 636265945 638309212
1770.6 638309212 636683693 635183678 636077805 639200172 641260071 640763931 642187347 642490921 642743759
$$ packed form
1709.9E88518486M46663O08063J229400P76253p81288m24156J943359J607475l321800
1718.5E90602455L560410K920456J438865N47028j09558M36935J132736J237183L94707
1727.2F02161217O46019Q48541n75638L57094K058105J013909l875389q23937M010239
1735.9F05820160L090515R42345R20257n21240j226158L025398J048775p72743R84420
1744.6F13311729J784401R49364R5711J291809K66151K070999K89422r0752L057594
1753.3F23026428J421395J376991J735725m61616N14793J318207O08559J744117L52745
1761.9F31637344k69241K097778R94187P99522Q45413N33142j155891P83691K043267
1770.6F38309212j625519j500015Q94127L122367K059899m96140J423416L03574K52838
$$ plain form
1779.3 642743759 642680435 642339325 643548050 644202118 644788895 644445190 644669495 645926056 646799927
1788 646799927 646839218 647042694 646505432 645927963 645256424 645006027 647823486 648522720 647798538 648875732
1797.6 648875732 649831619 649894867 648455276 649774628 650119019 649993057 650945435 651095886 651888504
1806.3 651888504 652192917 652444687 652944946 653297806 652268372 652202148 653489838 653850555 654507446
1815 654507446 654637299 655134888 654956741 654996490 656026535 655794601 656092224 655665894 656096802 656775284
1824.6 656775284 654567795 654957657 656483002 657507935 656851425 654521866 655616302 657496414 657871780
1833.3 657871780 658241882 658673782 658456268 658284454 657758713 658498383 658781891 658835831 658584137 658428345
1842.9 658428345 659020538 655987854 657486267 659318848 659416962 659384460 659600372 660521622 660097885
$$ packed form
1779.3F42743759o3324l41110J208725O54068N86777l43705K24305J256561Q73871
1788F46799927L9291K03476n37262n77469o71539k50397K817459O99234p24182J077194
1797.6F48875732R55887O3248j439591J319352L44391j25962R52378J50451P92618
1806.3F51888504L04413K51770N00259L52860j029434o6224J287690L60717O56891
1815F54507446J29853M97589j78147L9749J030045k31934K97623m26330M30908O78482
1824.6F56775284k207489L89862J525345J024933o56510k329559J094436J880112L75366
1833.3F57871780L70102M31900k17514j71814n25741P39670K83508N3940k51694j55792
1842.9F58428345N92193l032684J498413J832581R8114l2502K15912R21250m23737
$$ plain form
1851.6 660097885 659944839 659909973 659980316 660033112 659646454 660144348 660164108 660400085 660210648 660139618
1861.3 660139618 660123749 660192261 660630646 660225601 660428619 659702072 659242706 658505249 657954254 659884720
1870.9 659884720 660930023 661395493 661238480 661349564 661601334 661931686 662018890 661318283 661435776 661632462
1880.6 661632462 662323914 662402115 661996994 661733322 661512909 662083054 661902618 662480316 662797546 661837921
1890.2 661837921 662642365 663446121 663221436 663087921 662900620 662388306 663176498 663525238 663386917 663419113
1899.8 663419113 663645554 664045792 663474045 663732834 663711853 663689651 664217758 663782959 663437195 663362427
1909.5 663362427 663598175 663599396 664126740 664257812 663985901 663797836 663545074 664305420 662773743 662495270
1919.1 662495270 664051895 664275589 664227066 663372269 663008041 663504715 664073181 664128265 664181366 663999939
$$ packed form
1851.6F60097885j53046l4866P0343N2796l86658M97894J9760K35977j89437p1030
1861.3F60139618j5869O8512M38385m05045K03018p26547m59366p37457n50995J930466
1870.9F59884720J045303M65470j57013J11084K51770L30352Q7204p00607J17493J96686
1880.6F61632462O91452P8201m05121k63672k20413N70145j80436N77698L17230r59625
1890.2F61837921Q04444Q03756k24685j33515j87301n12314P88192L48740j38321L2196
1899.8F63419113K26441M00238n71747K58789k0981k2202N28107m34799l45764p4768
1909.5F63362427K35748J221N27344J31072k71911j88065k52762P60346j531677k78473
1919.1F62495270J556625K23694m8523q54797l64228M96674N68466N5084N3101j81427
$$ plain form
1928.8 663999939 663781662 664194031 664204407 664605865 664161606 663943939 664166718 664042282 664543839 664310760
1938.4 664310760 664369812 664168396 664341049 664200897 662895126 663955841 664510040 664228363 664148788 664262619
1948.1 664262619 664442673 664451675 664631119 664861069 665126953 664698944 664590225 664802399 665003815 665262909
1957.7 665262909 665099182 664971542 664939270 665249939 665079575 665120316 665285797 665243607 665600281 665324936
1967.3 665324936 665182648 665314407 665554733 665477448 665314865 665389633 665510941 665798874 665664825 665944901
1977 665944901 665919952 666001129 666092377 665788879 666014709 665787888 666002121 665984497 665898285 665929260 665505676
1987.6 665505676 665407562 665220413 665954971 665952911 664932709 665110245 665778351 665998993 665560379 665968628
1997.2 665968628 666043091 665709229 665549698 665167694 664978714 664885330 665065842 664952011 665020447 665096970
$$ packed form
1928.8F63999939k18277M12369J0376M01458m44259k17667K22779j24436N01557k33079
1938.4F64310760N9052k01416J72653j40152j305771J060715N54199k81677p9575J13831
1948.1F64262619J80054R002J79444K29950K65884m28009j08719K12174K01416K59094
1957.7F65262909j63727j27640l2272L10669j70364M0741J65481m2190L56674k75345
1967.3F65324936j42288J31759K40326p7285j62583P4768J21308K87933j34049K80076
1977F65944901k4949Q1177R1248l03498K25830k26821K14233j7624q6212L0975m23584
1987.6F65505676r8114j87149P34558k060j020202J77536O68106K20642m38614M08249
1997.2F65968628P4463l33862j59531l82004j88980r3384J80512j13831O8436P6523
$$ plain form
2006.9 665096970 665122604 665224380 665169296 665277481 664916611 664689789 664395218 664100266 664123459 663999557
2016.5 663999557 663633575 663391800 663668900 663462982 663269196 662989426 662567596 662541809 662790833 663040695
2026.2 663040695 662398911 662026596 661839905 661585770 661481857 661480484 661495590 660869217 660516052 659984436
2035.8 659984436 659755402 659928131 659721603 659551773 659239273 659192963 659472198 660039139 659569626 658756638
2045.5 658756638 658572693 658497238 658740997 658439484 658696518 658871536 658565369 658420029 658219757 658369522
2055.1 658369522 658141785 658391342 658396149 658132172 658254929 658232422 658202438 657821884 658066559 658275223
2064.7 658275223 658209000 658114319 658094559 658204498 657745895 657704849 657976913 658377838 658154831 657889404
2074.4 657889404 657968445 658036270 658661728 658430939 658400345 658388824 658080444 658303604 658501587 658637314
$$ packed form
2006.9F65096970K5634J01776n5084J08185l60870k26822k94571k94952K3193j23902
2016.5F63999557l65982k41775K77100k05918j93786k79770m21830k5787K49024K49862
2026.2F63040695o41784l72315j86691k54135j03913j373J5106o26373l53165n31616
2035.8F59984436k29034J72729k06528j69830l12500m6310K79235N66941m69513q12988
2045.5F58756638j83945p5455K43759l01513K57034J75018l06167j45340k00272J49765
2055.1F58369522k27737K49557M807k63977J22757k2507k9984l80554K44675K08664
2064.7F58275223o6223r4681j9760J09939m58603m1046K72064M00925k23007k65427
2074.4F57889404P9041O7825O25458k30789l0594j1521l08380K23160J97983J35727
$$ plain form
2084 658637314 658056793 658047485 658342209 658271103 658358154 658467102 658425674 658216782 658580627 658406754 658141556
2094.6 658141556 658425140 658872604 659103546 658878098 658953247 658674088 658560181 658605881 658946075 659326019
2104.3 659326019 659236984 659260712 658964386 659271393 659425278 659356079 659254303 659012375 659228516 659044647
2113.9 659044647 659090881 659096527 659212952 659156952 659230576 659734421 659446182 659301605 658998642 659015121 659010468
2124.5 659010468 659065323 659544067 659257965 659275970 659355850 659491959 659429245 659223709 659143372 659209137 659481888
2135.1 659481888 658838882 658725586 658772812 658604431 658795319 659025803 659250336 658939209 658985291 659017792
2144.8 659017792 659139404 659154739 659059067 659320526 659340286 659685440 659660950 659512558 659358826 659335175
2154.4 659335175 659517975 659384918 659421539 659374847 659659195 659778442 659969177 659993362 659658279 659834442
$$ packed form
2084F58637314n80521r308K94724p1106Q7051J08948m1428k08892L63845j73873k65198
2094.6F58141556K83584M47464K30942k25448P5149k79159j13907M5700L40194L79944
2104.3F59326019q9035K3728k96326L07007J53885o9199j01776k41928K16141j83869
2113.9F59044647M6234N646J16425n6000P3624N03845k88239j44577l02963J6479m653
2124.5F59010468N4855M78744k86102J8005P9880J36109o2714k05536q0337O5765K72751
2135.1F59481888o43006j13296M7226j68381J90888K30484K24533l11127M6082L2501
2144.8F59017792J21612J5335r5672K61459J9760L45154k4490j48392j53732k3651
2154.4F59335175J82800j33057L6621m6692K84348J19247J90735K4185l35083J76163
$$ plain form
2164.1 659834442 660159607 660648804 660534134 660615692 660619278 660652695 661092529 661087799 661407547 661288071 661631088
2174.7 661631088 661855545 661679306 662279892 662712250 662911301 662558289 662709503 662908707 663032074 663476105
2184.3 663476105 663541489 663577271 663575439 663959732 663836517 663824310 663832016 663792877 664421082 664665527 664875412
2194.9 664875412 664735565 664899063 664888077 665009766 665526657 665288315 665285263 665234451 665741196 666166000
2204.6 666166000 666606522 666828995 666593552 667001572 666744614 666945801 666973114 667005692 667200012 667162170
2214.2 667162170 667700119 667536545 667976913 668042221 667859192 668063812 668269348 668767319 668519363 668777771
2223.9 668777771 668510895 668379745 668622131 668629227 669118576 669111023 669563599 669542999 669250488 669374161
2233.5 669374161 669759064 669709930 669257050 670001450 670171585 670073700 669957047 670006332 670282364 670184326
$$ packed form
2164.1F59834442L25165M89197j14670Q1558L586L3417M39834m730L19748j19476L43017
2174.7F61631088K24457j76239O00586M32358J99051l53012J51214J99204J23367M44031
2184.3F63476105O5384L5782j832L84293j23215j2207P706l9139O28205K44445K09885
2194.9F64875412j39847J63498j0986J21689N16891k38342l052n0812N06745M24804
2204.6F66166000M40522K22473k35443M08020k56958K01187K7313L2578J94320l7842
2214.2F67162170N37949j63574M40368O5308j83029K04620K05536M97971k47956K58408
2223.9F68777771k66876j31150K42386P096M89349p553M52576k0600k92511J23673
2233.5F69374161L84903m9134m52880P44400J70135r7885j16653M9285K76032r8038
$$ plain form
2243.2 670184326 670235062 670053329 670643616 670987091 671208420 671233902 670882111 670720825 670401611 671075516
2252.8 671075516 671053848 670999451 671186447 671492615 671933212 671330566 671636124 671808777 672125931 672448807
2262.4 672448807 672310867 672425690 672399368 672886734 672784271 672743607 672813263 673206482 673577652 673688583
2272.1 673688583 673937378 673450089 673593216 672897797 672612839 673207092 673309174 673292084 672770691 673119888
2281.7 673119888 672870636 673013153 673318787 673558807 674310074 674144440 674818344 674735031 675031433 675243988
2291.4 675243988 675322266 676574020 676437378 677067642 677323914 677901993 678628616 678425980 679109573 679206772
2301 679206772 679910889 680074005 680644150 681581726 682135696 683456345 683807449 685134888 685830231 686222534
2310.7 686222534 687212524 687803497 688463058 687802658 688778839 690224075 691286240 692868729 694492569
$$ packed form
2243.2F70184326N0736j81733N90287L43475K21329K5482l51791j61286l19214O73905
2252.8F71075516k1668n4397J86996L06168M40597o02646L05558J72653L17154L22876
2262.4F72448807j37940J14823k6322M87366j02463m0664O9656L93219L71170J10931
2272.1F73688583K48795m87289J43127o95419k84958N94253J02082j7090n21393L49197
2281.7F73119888k49252J42517L05634K40020P51267j65634O73904q3313K96402K12555
2291.4F75243988P8278J251754j36642O30264K56272N78079P26623k02636O83593R7199
2301F79206772P04117J63116N70145R37576N53970J320649L51104J327439O95343L92303
2310.7F86222534R89990N90973O59561o60400R76181J445236J062165J582489J623840
$$ plain form
2319.3 694492569 696436615 696961975 697945709 699217911 700051422 700492325 701324387 702778702 703468781
2328 703468781 704290009 704723129 706561737 707194595 706599503 706396027 704652023 705776749 707792435
2336.7 707792435 707712784 707254639 707254257 707667465 707427216 707926331 707428894 706482697 705556717 702881317
2346.3 702881317 697869720 692570267 693341370 698826370 702240906 704940796 707618637 709645996
2354.1 709645996 713526993 716733093 719824295 719867096 720924454 722915115 722618713 721290817 718465500
2362.7 718465500 718395386 716858673 715366135 713012543 709687576 708844757 705993576 703009186 699594727
2371.4 699594727 696680756 694422607 691591492 689127579 686480942 685011978 683108521 680688400
2379.1 680688400 678400650 676243362 674571152 672778244 671688995 670606461 669639130 668942261 668413849
$$ packed form
2319.3F94492569J944046N25360R83734J272202Q33511M40903Q32062J454315O90079
2328G03468781Q21228M33120J838608O32858n95092k03476j744004J124726K015686
2336.7G07792435p9651m58145l82M13208k40249M99115m97437r46197r25980k675400
2346.3G02881317n011597n299453P71103N485000L414536K699890K677841K027359
2354.1G09645996L880997L206100L091202M2801J057358J990661k96402j327896k825317
2362.7G18465500p0114j536713j492538k353592l324967q42819k851181k984390l414459
2371.4F99594727k913971k258149k831115k463913k646637j468964j903457k420121
2379.1F80688400k287750k157288j672210j792908j089249j082534r67331o96869n28412
$$ plain form
2387.8 668413849 668105621 667731781 667713394 667505264 667614288 667426300 667086639 666920395 666812057 667034836
2397.4 667034836 666485519 666440887 666429291 666206207 666310730 666266861 666330414 665998001 666015472 665934219 666053925
2408.1 666053925 666278381 665957108 665693588 665146561 664944534 664820404 664765549 664511642 664251785 664312897
2417.7 664312897 664006348 663595657 663008881 662969971 662884598 662829285 662907028 662563858 662289200 661950150
2427.3 661950150 662110519 661940918 661616440 661053467 660500946 660631638 660531387 660881271 660543137 659762802
2437 659762802 659290466 659176483 659274216 658531342 658193893 658179855 658273773 657998886 657771530 657792206 657187347
2447.6 657187347 656988373 656735687 656375427 655943909 656058884 656088028 655422287 655352631 654959106 654789886
2457.2 654789886 654844284 654968796 655031052 654628677 654483032 654027786 653442001 653069153 653326263 653370361
$$ packed form
2387.8F68413849l08228l73840j8387k08130J09024j87988l39661j66244j08338K22779
2397.4F67034836n49317m4632j1596k23084J04523m3869O3553l32413J7471q1253J19706
2408.1F66053925K24456l21273k63520n47027k02027j24130n4855k53907k59857O1112
2417.7F64312897l06549m10691n86776l8910q5373n5313P7743l43170k74658l39050
2427.3F61950150J60369j69601l24478n62973n52521J30692j00251L49884l38134p80335
2437F59762802m72336j13983R7733p42874l37449j4038R3918k74887k27356K0676o04859
2447.6F57187347j98974k52686l60260m31518J14975K9144o65741o9656l93525j69220
2457.2F54789886N4398J24512O2256m02375j45645m55246n85785l72848K57110M4098
$$ plain form
2466.9 653370361 653086090 652752762 652154236 652255096 652099533 651896820 651723099 651368866 650970383 650736694
2476.5 650736694 650944366 650683975 650842133 650813446 650502243 650299988 650033264 649873886 649298859 649232330
2486.2 649232330 648996887 649078598 649292908 648846436 648648758 648337708 648520508 648460999 648006973 647642212
2495.8 647642212 647502136 647548065 647159195 647105026 647234116 647316055 646982422 646627197 646330566 646179886
2505.5 646179886 646565933 646541061 646409607 646001129 645966797 645795975 645276031 645353241 645164337 645029221
2515.1 645029221 644723740 644798508 644686203 644346161 644562607 644327621 644230270 643882294 643604431 643402863
2524.7 643402863 643270721 643399734 643046265 642672729 641988220 641844254 642074509 642230682 642271347 641578979
2534.4 641578979 641033401 641022034 641112518 640710678 640524597 640150146 639934044 639989128 639097672 638622856
$$ packed form
2466.9F53370361k84271l33328n98526J00860j55563k02713j73721l54233l98483k33689
2476.5F50736694K07672k60391J58158k8687l11203k02255k66724j59378n75027o6529
2486.2F49232330k35443Q1711K14310m46472j97678l11050J82800n9509m54026l64761
2495.8F47642212j40076M5929l88870n4169J29090Q1939l33633l55225k96631j50680
2505.5F46179886L86047k4872j31454m08478l4332j70822n19944P7210j88904j35116
2515.1F45029221l05481P4768j12305l40042K16446k34986r7351l47976k77863k01568
2524.7F43402863j32142J29013l53469l73536o84509j43966K30255J56173M0665o92368
2534.4F41578979n45578j1367R0484m01840j86081l74451k16102N5084q91456m74816
$$ plain form
2544 638622856 638344574 638490410 638769646 638388176 638105659 637896767 637768822 637126884 636625557 636386528
2553.7 636386528 636311493 636133347 635575905 635683632 635728798 635391846 634849968 634570732 634481010 634328423
2563.3 634328423 634075699 633281288 632825546 632897606 633099747 632620773 632286797 632386360 632270737 632385063
2573 632385063 631911736 631631279 631490059 631309280 631156883 630703049 630656357 630439224 630214348 629785309
2582.6 629785309 629545097 629507713 629113579 628946495 628989868 629045792 628485794 628077049 627776871 627703400
2592.2 627703400 627828522 627524376 627272873 626579819 626652184 626967316 626675262 626346550 626131439 626147499
2601.9 626147499 625654716 625505066 625429573 625492897 625380020 624952850 624823761 624263535 624381828 624335976
2611.5 624335976 623873367 623390656 623044205 623072433 622603569 622656441 622445221 621800690 621116486 620750198
$$ packed form
2544F38622856k78282J45836K79236l81470k82517k08892j27945o41938n01327k39029
2553.7F36386528p5035j78146n57442J07727M5166l36952n41878k79236q9722j52587
2563.3F34328423k52724p94411m55742P2060K02141m78974l33976R9563j15623J14326
2573F32385063m73327k80457j41220j80779j52397m53834m6692k17133k24876m29039
2582.6F29785309k40212l7384l94134j67084M3373N5924n59998m08745l00178p3471
2592.2F27703400J25122l04146k51503o93054P2365L15132k92054l28712k15111J6060
2601.9F26147499m92783j49650p5493O3324j12877m27170j29089n60226J18293m5852
2611.5F24335976m62609m82711l46451K8228m68864N2872k11220o44531o84204l66288
$$ plain form
2621.2 620750198 620729942 620066490 619824600 619538002 619157791 618833771 618376350 617721138 616996880 616695824
2630.8 616695824 616231041 616132889 615644302 615195236 615050850 614521751 614166565 613565445 613283348 612777939
2640.5 612777939 612182732 611779594 611447945 611329689 610833511 610381813 609628105 609154282 608624420 607893715
2650.1 607893715 607399445 607057991 607222710 606726799 606113472 605337296 604731255 604674301 604154358 603578758
2659.8 603578758 603141708 603103752 602689171 602180252 601672211 601319237 601312828 600526161 599892960 599574356
2669.4 599574356 599553528 599254379 598965378 598867607 598031273 597626686 597508430 597565269 597309418 596804924
2679 596804924 596268730 595622902 595390587 594933853 594591331 593914337 593675690 593745651 593307686 592738800
2688.7 592738800 591799011 591781654 591681137 591282349 591063461 590708923 590353355 589946861 590011978 589544296
$$ packed form
2621.2F20750198k0256o63452k41890k86598l80211l24020m57421o55212p24258l01056
2630.8F16695824m64783r8152m88587m49066j44386n29099l55186o01120k82097n05409
2640.5F12777939n95207m03138l31649j18256m96178m51698p53708m73823n29862p30705
2650.1F07893715m94270l41454J64719m95911o13327p76176o06041n6954n19943n75600
2659.8F03578758m37050l7956m14581n08919n08041l52974o409p86667o33201l18604
2669.4E99574356k0828k99149k89001r7771q36334m04587j18256N6839k55851n04494
2679E96804924n36194o45828k32315m56734l42522o76994k38647O9961m37965n68886
2688.7E92738800r39789j7357j00517l98788k18888l54538l55568m06494O5117m67682
$$ plain form
2698.3 589544296 589114532 588709145 588323517 587939873 586947136 586301003 585686913 585769844 585781822 585451813
2708 585451813 584985466 584285011 584099922 583355484 582810745 582396545 582023048 581463623 580719109 580756912
2717.6 580756912 580780182 580764427 580093918 579777946 579347801 578503876 578603745 578254089 577721519 577273636
2727.3 577273636 577002792 576764641 576946068 577188721 576266403 575297127 574709740 574902039 574869576 574248810
2736.9 574248810 573449287 572914925 573130836 573302917 573499947 572887192 572600365 572468605 571942711 571826286
2746.5 571826286 571229820 571195869 571133347 570670280 570224228 570109291 570098152 569548912 569412804 568836823
2756.2 568836823 568281975 568129501 568137703 567881622 567432098 567581787 567364311 567484818 567246056 566611023
2765.8 566611023 566380272 566402779 566533012 566106339 565957832 565458107 565093575 564922752 564577599 564385567
$$ packed form
2698.3E89544296m29764m05387l85628l83644r92737o46133o14090Q2931J1978l30009
2708E85451813m66347p00455j85089p44438n44739m14200l73497n59425p44514L7803
2717.6E80756912K3270j5755o70509l15972m30145q43925R9869l49656n32570m47883
2727.3E77273636k70844k38151J81427K42653r22318r69276n87387J92299l2463o20766
2736.9E74248810p99523n34362K15911J72081J97030o12755k86827j31760n25894j16425
2746.5E71826286n96466l3951o2522m63067m46052j14937j1139n49240j36108n75981
2756.2E68836823n54848j52474Q202k56081m49524J49689k17476J20507k38762o35033
2765.8E66611023k30751K2507J30233m26673j48507m99725l64532j70823l45153j92032
$$ plain form
2775.5 564385567 563755608 563294601 562863197 562988052 562676010 561966400 561517639 561064949 561246262 560750923
2785.1 560750923 560413895 560254898 559991684 559581223 558701401 558205070 557476501 557067337 556609879 556485939
2794.8 556485939 556310768 555477791 554810562 554156075 554068146 552970772 551702690 551194115 550710258
2803.4 550710258 550180588 549440842 549296532 548442001 547511864 546941261 546443977 545685043 544272766
2812.1 544272766 543718185 543205910 542678757 541844292 541017265 540323029 539093170 538110313 537109222
2820.8 537109222 536682549 535917244 534855232 533825226 532706985 532080231 531181717 530286064 528996735
2829.5 528996735 527984009 526956062 525811920 525029373 523793755 522753716 521703415 521075020 519898033
2838.2 519898033 518414230 517291298 515874062 514560699 512393112 510789833 509491577 507779388
$$ packed form
2775.5E64385567o29959m61007m31404J24855l12042p09610m48761m52690J81313m95339
2785.1E60750923l37028j58997k63214m10461q79822m96331p28569m09164m57458j23940
2794.8E56485939j75171q32977o67229o54487q7929j097374j268082n08575m83857
2803.4E50710258n29670p39746j44310q54531r30137n70603m97284p58934j412277
2812.1E44272766n54581n12275n27153q34465q27027o94236j229859r82857j001091
2820.8E37109222m26673p65305j062012j030006j118241o26754q98514q95653j289329
2829.5E28996735j012726j027947j144142p82547j235618j040039j050301o28395j176987
2838.2E19898033j483803j122932j417236j313363k167587j603279j298256j712189
$$ plain form
2845.9 507779388 506003571 504347954 503410797 501598244 499772949 498424988 497425652 496389008 495155830
2854.6 495155830 494167023 492928276 492142372 491081924 490357208 489418144 488038979 487134209 485890617
2863.2 485890617 484494171 482509499 480987473 479479523 477893066 476222153 473886337 472178154
2870.9 472178154 470060692 468017235 465817032 463639297 461776924 459272385 457189178 455260620
2878.7 455260620 453490181 451626663 450191574 448975868 447489433 446266937 444996910 444340439
2886.4 444340439 443351746 442387848 441637154 440976524 440788002 440208282 439836845 439443398 439260330 438803215
2896 438803215 438366776 438335152 437804642 437492714 437127686 436802750 436316833 435830994 434946175 433855553
2905.7 433855553 433432808 432859917 432490540 431587143 430501060 429478798 428370056 427182045 425831757
$$ packed form
2845.9E07779388j775817j655617r37157j812553j825295j347961r99336j036644j233178
2854.6D95155830r88807j238747p85904j060448p24716r39064j379165r04770j243592
2863.2D85890617j396446j984672j522026j507950j586457j670913k335816j708183
2870.9D72178154k117462k043457k200203k177735j862373k504539k083207j928558
2878.7D55260620j770439j863518j435089j215706j486435j222496j270027o56471
2886.4D44340439r88693r63898p50694o60630j88522n79720l71437l93447j83068m57115
2896D38803215m36439l1624n30510l11928l65028l24936m85917m85839q84819j090622
2905.7D33855553m22745n72891l69377r03397j086083j022262j108742j188011j350288
$$ plain form
2914.3 425831757 425057449 423198318 421111298 419428520 417559166 415547752 413921051 413414497 412420387
2923 412420387 411597939 410283012 408694534 408067589 407677612 407677765 407681427 407853279 407349052 407398720 408509636
2933.6 408509636 409680901 410965843 411852036 413188438 414466972 416024704 418224030 420588646
2941.3 420588646 422855988 425232124 427904549 429756966 431588936 433385201 435658989 438033028
2949.1 438033028 440125275 442742805 444904556 446922150 448412437 450431557 452706909 454814224
2956.8 454814224 457284775 459064789 461112900 462929611 464837494 466848297 468506622 469673882
2964.5 469673882 470886230 472887497 473984604 475255852 476925659 478742981 480012970 480953751
2972.2 480953751 482732506 483906174 485192795 486124954 487217026 488623695 490168343 492022896
$$ packed form
2914.3D25831757p74308j859131k087020j682778j869354k011414j626701n06554r94110
2923D12420387q22448j314927j588478o26945l89977J53L662J71852n04227M9668J110916
2933.6D08509636J171265J284942Q86193J336402J278534J557732K199326K364616
2941.3D20588646K267342K376136K672425J852417J831970J796265K273788K374039
2949.1D38033028K092247K617530K161751K017594J490287K019120K275352K107315
2956.8D54814224K470551J780014K048111J816711J907883K010803J658325J167260
2964.5D69673882J212348K001267J097107J271248J669807J817322J269989R40781
2972.2D80953751J778755J173668J286621R32159J092072J406669J544648J854553
$$ plain form
2979.9 492022896 492931709 494421921 495685959 496816254 498084145 499412651 501053467 501868324 503058052
2988.6 503058052 504112282 505124359 506075363 507065582 508043137 508378792 509417534 510674973 511785583
2997.3 511785583 511782951 511784592 512358131 512620049 513226585 513305511 513283806 512722244 512501945 512861977 512599754
3007.9 512599754 512540016 512746010 513110466 512808037 512277794 511840515 511744156 511137199 510008125 509794426
3017.5 509794426 509145241 508610229 507888451 507189331 506799965 506178970 505724678 504741211 503919449 502686653
3027.2 502686653 501881065 501412506 500739136 500202713 498908768 498461723 497857246 496878929 495681648
3035.9 495681648 494364929 493956070 493564835 492781296 491192551 490370636 489411545 487912292 486991425
3044.5 486991425 485902214 484881744 483782616 483556900 482774162 481284065 480163994 478980827 478085518
$$ packed form
2979.9D92022896R08813J490212J264038J130295J267891J328506J640816Q14857J189728
2988.6E03058052J054230J012077R51004R90219R77555L35655J038742J257439J110610
2997.3E11785583k632J641N73539K61918O06536P8926k1705n61562k20299L60032k62223
3007.9E12599754n9738K05994L64456l02429n30243m37279r6359o06957j129074k13699
3017.5E09794426o49185n35012p21778o99120l89366o20995m54292r83467q21762j232796
3027.2E02686653q05588m68559o73370n36423j293945m47045o04477r78317j197281
3035.9D95681648j316719m08859l91235p83539j588745q21915r59091j499253r20867
3044.5D86991425j089211j020470j099128k25716p82738j490097j120071j183167q95309
$$ plain form
3053.2 478085518 476893501 476123428 475185089 474279594 473264923 471699753 470502472 469421005 468778725
3061.9 468778725 467866402 466796417 465141602 464041023 463497429 461965408 461079788 459797783 458600121
3070.6 458600121 457806778 456793633 455903969 454861336 453885880 452320137 451302338 450721741 449924049
3079.2 449924049 448805351 447534332 446472435 445294037 444609947 443542366 442680702 441764832 440314789
3087.9 440314789 438977623 437948799 437044640 435317459 434645081 433714867 432258987 431270943 430050278
3096.6 430050278 429651146 428736801 427807503 426550026 425316162 424400940 422790565 422222061 421792336
3105.3 421792336 420950203 419508705 418327179 417719116 416604156 415365410 414196434 413656311 412544098
3114 412544098 411347237 410430336 409258614 408083687 407038536 406471825 405165443 404071198 402914963
$$ packed form
3053.2D78085518j192017p70073r38339r05495j014671j565170j197281j081467o42280
3061.9D68778725r12323j069985j654815j100579n43594j532021q85620j282005j197662
3070.6D58600121p93343j013145q89664j042633r75456j565743j017799n80597p97692
3079.2D49924049j118698j271019j061897j178398o84090j067581q61664r15870j450043
3087.9D40314789j337166j028824r04159j727181o72378r30214j455880r88044j220665
3096.6D30050278l99132r14345r29298j257477j233864r15222j610375n68504m29725
3105.3D21792336q42133j441498j181526o08063j114960j238746j168976n40123j112213
3114D12544098j196861r16901j171722j174927j045151n66711j306382j094245j156235
$$ plain form
3122.6 402914963 401521873 400578537 399617920 398997040 398254814 397549286 396231728 395253677 394525223
3131.3 394525223 393348274 392477493 391713524 391322899 389730797 388337975 387664871 386633072 385592461
3140 385592461 384295883 383582039 382348328 381488876 380890160 379816818 379009514 377875175 377028008
3148.7 377028008 376330795 375958557 375069733 374224663 373724327 372627907 371715355 370592041 369442978
3157.4 369442978 367785721 366714058 366261597 365594978 365294304 364481735 363462486 362384911 361786194
3166 361786194 360652390 359447670 359079132 358523979 358028374 357029305 356520119 355413933 354115829
3174.7 354115829 353455429 352619133 352423897 351237335 350273170 349660110 348932915 348578835 347916527
3183.4 347916527 347277184 346085701 345351601 344528847 343556557 342858238 342049484 341593132 341251183
$$ packed form
3122.6D02914963j393090r43336r60617o20880p42226p05528j317558r78051p28454
3131.3C94525223j176949q70781p63969l90625j592102j392822o73104j031799j040611
3140C85592461j296578p13844j233711q59452n98716j073342q07304j134339q47167
3148.7C77028008o97213l72238q88824q45070n00336j096420r12552j123314j149063
3157.4C69442978j657257j071663m52461o66619l00674q12569j019249j077575n98717
3166C61786194j133804j204720l68538n55153m95605r99069n09186j106186j298104
3174.7C54115829o60400q36296j95236j186562r64165o13060p27195l54080o62308
3183.4C47916527o39343j191483p34100q22754r72290o98319q08754m56352l41949
$$ plain form
3192.1 341251183 340926552 339713745 338949051 338520050 337741776 336861076 335934067 335633011 334547653
3200.8 334547653 334020348 333801041 332995644 332289543 331579132 331305161 330457497 329892235 329313126 328169327
3210.4 328169327 327354126 327012711 326623611 325591736 325232239 325112801 324630508 323719597 323160324
3219.1 323160324 322635193 321990623 322103615 321562462 320863152 319821548 319421043 319010696 317858849
3227.8 317858849 318168583 318157959 317705173 316965485 316468105 315904846 314928989 314601860 313972378 313891258
3237.4 313891258 313162594 312360020 312047272 311388664 311011810 310620213 310834541 310058784 309339371 308892269
3247 308892269 308115616 308104973 307301083 306703148 306645737 306617107 306106052 305398540 305197792 304888020
3256.7 304888020 304857101 304472313 303653564 302783051 302383175 301906586 301752987 301722755 300990143 301076641
$$ packed form
3192.1C41251183l24631j212807p64694m29001p78274q80700r27009l01056j085358
3200.8C34547653n27305k19307q05397p06101p10411k73971q47664n65262n79109j143799
3210.4C28169327q15201l41415l89100j031875l59497j19438m82293r10911n59273
3219.1C23160324n25131o44570J12992n41153o99310j041604m00505m10347j151847
3227.8C17858849L09734j0624m52786p39688m97380n63259r75857l27129o29482q1120
3237.4C13891258p28664q02574l12748o58608l76854l91597K14328p75757p19413m47102
3247C08892269p76653j0643q03890n97935n7411k8630n11055p07512k00748l09772
3256.7C04888020l0919l84788q18749q70513l99876m76589j53599l0232p32612Q6498
$$ plain form
3266.3 301076641 300609913 299905109 299527225 299559822 299658794 298831234 298621616 298323975 298339539 297793198
3276 297793198 296748962 296743259 296597996 296328754 295675907 295492859 294990997 294392338 294440479 294137268
3285.6 294137268 293808079 293535786 293665428 293135967 293020763 292967072 292400227 292373314 291564293 291085510
3295.3 291085510 290671329 290430183 290550060 290362320 290153179 289617939 289398842 289068089 288772659 288322735
3304.9 288322735 288102684 287915554 287313404 286908455 286179810 286153812 286019230 285659046 285147476 284570980
3314.6 284570980 284522896 284065971 283781834 283248024 283295269 283111458 282467880 282489166 281951046 281524010
3324.2 281524010 281021023 280874672 280292950 279513664 279418354 278982735 278744755 278015766 277549877 277246151
3333.8 277246151 277216167 277362213 276965847 276682816 275649357 275268536 275283127 274877052 274161644 273632889
$$ packed form
3266.3C01076641m66728p04804l77884L2597R8972q27560k09618k97641J5564n46341
3276B97793198j044236n703j45263k69242o52847j83048n01862n98659M8141l03211
3285.6B94137268l29189k72293J29642n29461j15204n3691n66845k6913q09021m78783
3295.3B91085510m14181k41146J19877j87740k09141n35240k19097l30753k95430m49924
3304.9B88322735k20051j87130o02150m04949p28645k5998j34582l60184n11570n76496
3314.6B84570980m8084m56925k84137n33810M7245j83811o43578K1286n38120m27036
3324.2B81524010n02987j46351n81722p79286r5310m35619k37980p28989m65889l03726
3333.8B77246151k9984J46046l96366k83031j033459l80821J4591m06075p15408n28755
$$ plain form
3343.5 273632889 273769531 273417778 273367195 272830276 271879826 271066990 270948772 271557751 271200695 270789661
3353.1 270789661 270129051 269753284 269292736 268232841 268082867 268119621 267698689 267060680 266678543 266039143
3362.8 266039143 265676060 265563717 265273895 265235043 265092468 264759140 263902664 263787251 263413086 262522984
3372.4 262522984 262280617 262007637 262114677 261714916 261301708 260749111 260129910 260370197 260270748 259888725
3382.1 259888725 259722576 259877644 259578896 259385777 258938484 258155994 258110428 257970791 258074169 258061485
3391.7 258061485 257465019 256084518 255800915 256901245 257109489 256825943 256160736 256197929 256061077
3400.4 256061077 255336227 255450630 255469818 255203533 254923916 255114651 254801884 254343948 254528370 254574566
3410 254574566 254432163 254298706 254285107 253919220 254064484 254013557 254199963 254547291 253950958 253977718
$$ packed form
3343.5B73632889J36642l51753n0583n36919r50450q12836j18218O08979l57056m11034
3353.1B70789661o60610l75767m60548j059895j49974L6754m20932o38009l82137o39400
3362.8B66039143l63083j12343k89822l8852j42575l33328q56476j15413l74165q90102
3372.4B62522984k42367k72980J07040l99761m13208n52597o19201K40287r9449l82023
3382.1B59888725j66149J55068k98748j93119m47293p82490m5566j39637J03378j2684
3391.7B58061485n96466j380501k83603J100330K08244k83546o65207L7193j36852
3400.4B56061077p24850J14403J9188k66285k79617J90735l12767m57936J84422M6196
3410B54574566j42403j33457j3599l65887J45264n0927J86406L47328n96333K6760
$$ plain form
3419.7 253977718 253581142 253441658 253608398 253556919 253867607 253797245 253826084 253935661 254270172 254334793
3429.3 254334793 254594536 254379406 253838520 253853474 253612099 254403706 254440842 253952522 253961678 254063511
3439 254063511 254738598 254983654 255300331 255313969 255828075 256165409 256533222 257527847 256625156 256101494
3448.6 256101494 256653595 257460232 257508717 257363796 257853050 257860680 258239021 258698807 259121170 259147854
3458.2 259147854 259167080 259385185 259745655 260313129 260454369 261234798 261521797 261871548 262255230 262543831
3467.9 262543831 263321667 263257713 263832817 264455090 264727402 265049553 265470676 265701408 265509224 266086082
3477.5 266086082 266264400 266645603 266998749 267353745 268198509 268371582 268774700 269192162 270266361
3486.2 270266361 271347084 271166439 270551167 271293678 272372684 272561760 273118916 273143864 273960438
$$ packed form
3419.7B53977718l96576j39484J66740n1479L10688p0362K8839J09577L34511O4621
3429.3B54334793K59743k15130n40886J4954k41375P91607L7136m88320R156J01833
3439B54063511O75087K45056L16677J3638N14106L37334L67813R94625r02691n23662
3448.6B56101494N52101Q06637M8485j44921M89254P630L78341M59786M22363K6684
3458.2B59147854J9226K18105L60470N67474J41240P80429K86999L49751L83682K88601
3467.9B62543831P77836o3954N75104O22273K72312L22151M21123K30732j92184N76858
3477.5B66086082J78318L81203L53146L54996Q44764J73073M03118M17462J074199
3486.2B70266361J080723j80645o15272P42511J079006J89076N57156K4948Q16574
$$ plain form
3494.9 273960438 274289474 273488503 274326515 275391026 276127224 276164913 276870956 277591572 277253666 277432728
3504.5 277432728 277997017 278877125 279457989 280959358 281656456 281146393 281538830 281939793 282542362
3513.2 282542362 282779160 283854237 284855690 285232086 285857544 286389275 287222385 287694817 288531399
3521.9 288531399 288882446 288882256 289739704 290529633 290965405 291209049 291721668 291457424 292294979 293428440
3531.5 293428440 294088039 295302105 295865669 296753635 296674976 296342754 297547703 298546696 299240208
3540.2 299240208 300081959 301374092 302282219 302636948 301769924 301987457 303594246 303506775 304772072
3548.9 304772072 306323833 307978516 309347858 308152447 308744602 310121212 311510906 313033009
3556.6 313033009 313576965 315073814 316444511 316844692 317657108 319138927 319383621 319588242 322625046
$$ packed form
3494.9B73960438L29036q00971Q38012J064511P36198L7689P06043P20616l37906J79062
3504.5B77432728N64289Q80108N80864J501369O97098n10063L92437M00963O02569
3513.2B82542362K36798J075077J001453L76396O25458N31731Q33110M72432Q36582
3521.9B88531399L51047j90Q57448P89929M35772K43644N12619k64244Q37555J133461
3531.5B93428440O59599J214066N63564Q87966p8659l32222J204949R98993O93512
3540.2B99240208Q41751J292133R08127L54729q67024K17533J606789q7471J265297
3548.9C04772072J551761J654683J369342j195411N92155J376610J389694J522103
3556.6C13033009N43956J496849J370697M00181Q12416J481819K44694K04621L036804
$$ plain form
3565.3 322625046 323282928 322991447 322692146 321759758 325399323 327826767 329194031 331464157 332823639
3574 332823639 333647118 334979591 336785927 336722984 338435707 340451546 340716438 342819176 345462570
3582.6 345462570 347319336 347523766 351037140 353751717 350874405 351264458 350289307 354080620 357763100
3591.3 357763100 359996681 361625481 361839790 365143013 364878387 367319336 370750465 371078072 373857079
3600 373857079 374215851 375281982 377883072 379797859 381498184 383989449 385852165 384573364 388496323
3608.7 388496323 388143196 388283806 395785675 396955185 394721222 397505569 396970139 401215858 406116409
3617.4 406116409 405971680 407306976 406093445 407854691 412368660 415317993 417769814 419974632
3625.1 419974632 422536163 424428520 429634895 428108406 417065926 423791733 429326134 434741974
$$ packed form
3565.3C22625046O57882k91481k99301r32388L639565K427444J367264K270126J359482
3574C32823639Q23479J332473J806336o2943J712723K015839K64892K102738K643394
3582.6C45462570J856766K04430L513374K714577k877312L90053r75151L791313L682480
3591.3C57763100K233581J628800K14309L303223k64626K440949L431129L27607K779007
3600C73857079L58772J066131K601090J914787J700325K491265J862716j278801L922959
3608.7C88496323l53127J40610P501869J169510k233963K784347n35430M245719M900551
3617.4D06116409j44729J335296j213531J761246M513969K949333K451821K204818
3625.1D19974632K561531J892357N206375j526489j1042480O725807N534401N415840
$$ plain form
3632.8 434741974 435442467 433398743 436492157 439802094 442314301 442761955 444293480 446264877 448112373
3641.5 448112373 449104309 450018845 453012505 456329994 462023926 459732132 455208397 460565109 459839630
3650.1 459839630 456925659 458080635 465680618 470125809 473341980 477089729 468885193 471932335
3657.9 471932335 478010101 480076256 481641312 482481003 484373093 485154686 486556511 488765831 490152817
3666.5 490152817 494036636 496128502 494283485 493552094 488660622 492726631 501658363 509425545
3674.3 509425545 505211411 487883797 495029526 503445320 507196693 505090141 506419983 510550041
3682 510550041 512665443 514177513 514239845 514780884 519311523 524469376 514562950 512413979 522440605
3690.6 522440605 517138786 516024895 521634903 523835258 526516151 527221756 527299767 528035660 528380814
$$ packed form
3632.8D34741974P00493k043724L093414L309937K512207M47654J531525J971397J847496
3641.5D48112373R91936R14536K993660L317489N693932k291794m523735N356712p25479
3650.1D59839630k913971J154976P599983M445191L216171L747749q204536L047142
3657.9D71932335O077766K066155J565056Q39691J892090P81593J401825K209320J386986
3666.5D90152817L883819K091866j845017p31391m891472M066009Q931732P767182
3674.3E09425545m214134j7327614P145729Q415794L751373k106552J329842M130058
3682E10550041K115402J512070O2332N41039M530639N157853r906426k148971J0026626
3690.6E22440605n301819j113891N610008K200355K680893P05605P8011P35893L45154
$$ plain form
3699.3 528380814 531551933 534751282 528981895 527230721 532644043 533595047 534089813 535591278 538933372
3708 538933372 542790985 533497467 536482697 539086990 526417999 532337799 537137489 537859001 539441299
3716.7 539441299 543056602 544829330 540880127 542328682 549766731 546448593 540863647 546596794
3724.4 546596794 548353386 547693138 544833183 546142540 550668449 552171135 557830467 552946587
3732.1 552946587 544937935 554516640 553958778 542560539 545233498 548912659 549778061 553137360
3739.8 553137360 556141739 552185211 554494629 565032043 553325157 539076538 550240822 556427612
3747.5 556427612 563517609 558559189 545604706 557008476 552059631 546191902 553480911 559211655
3755.3 559211655 561612930 556237831 558951683 564221916 556989403 556382561 561489334 563224564
$$ packed form
3699.3E28380814L171119L199349n769387j751174N413322R51004M94766J501465L342094
3708E38933372L857613r293518K985230K604293j2668991N919800M799690P21512J582298
3716.7E39441299L615303J772728l949203J448555P438049l318138n584946N733147
3724.4E46596794J756592o60248k859955J309357M525909J502686N659332m883880
3732.1E52946587q008652R578705n57862j1398239K672959L679161Q65402L359299
3739.8E53137360L004379l956528K309418J0537414j1706886j4248619J1164284O186790
3747.5E56427612P089997m958420j2954483J1403770m948845n867729P289009N730744
3755.3E59211655K401275n375099K713852N270233p232513o06842N106773J735230
$$ plain form
3763 563224564 562938042 564933815 561836624 558057556 562283096 567709351 567540550 558884239 561218338
3771.7 561218338 565347366 565995560 567093735 566812782 567232285 567769775 570693054 570907288 562003555
3780.3 562003555 564954910 568236427 569270592 572291107 569876633 568397102 569418488 570547638
3788 570547638 571068573 571311760 572490463 572540436 573303719 572781448 573707962 576869087 572646446 568344078
3797.7 568344078 570201149 574614067 580238380 573807182 563709908 568761635 572856483 578011169
3805.4 578011169 584153938 572308655 567666626 573940353 577758980 578518219 578482704 578720703 579095078
3814.1 579095078 583659668 580888214 568226395 574576263 580239182 583856125 583266563 566752739
3821.8 566752739 570302773 576952057 579367027 581972122 582341957 578328514 578928337 580855713 584967804
$$ packed form
3763E63224564k86522J995773l097191l779068M225540N426255j68801q656311K334099
3771.7E61218338M129028O48194J098175k80953M19503N37490K923279K14234q903733
3780.3E62003555K951355L281517J034165L020515k414474j479531J021386J129150
3788E70547638N20935K43187J178703M9973P63283n22271R26514L161125m222641m302368
3797.7E68344078J857071M412918N624313o431198j0097274N051727M094848N154686
3805.4E78011169O142769j1845283m642029O273727L818627P59239l5515K37999L74375
3814.1E79095078M564590k771454j2661819O349868N662919L616943n89562j6513824
3821.8E66752739L550034O649284K414970K605095L69835m013443N99823J927376M112091
$$ plain form
3830.5 584967804 586740074 577767372 580840073 587747269 580481262 578829498 588623276 580942345
3838.2 580942345 575182533 583723564 578590317 578988266 586348152 583924675 579974060 583363342
3845.9 583363342 585238419 585446129 587171059 585279427 587177277 592783928 585187263 585595131 571069336
3854.6 571069336 573015900 584944992 585741386 583649750 585684738 587767601 590327072 584866600
3862.3 584866600 585268784 593050537 585760536 580647316 585525017 590791054 596795883 587809143
3870 587809143 577968941 582530975 590367432 594559326 583372726 584396706 589900322 590711632 592566032
3878.7 592566032 596369057 590146408 582707748 588359413 589455643 590502396 595876884 583772888
3886.4 583772888 584975891 590109749 590757790 595320854 594802208 586013374 588498726 592463455 591195107
$$ packed form
3830.5E84967804J772270q972702L072701O907196p266007j651764R793778p680931
3838.2E80942345n759812Q541031n133247L97949P359886k423477l950615L389282
3845.9E83363342J875077K07710J724930j891632J897850N606651p596665M07868j4525795
3854.6E71069336J946564J1929092P96394k091636K034988K082863K559471n460472
3862.3E84866600M02184P781753p290001n113220M877701N266037O004829q986740
3870E87809143r840202M562034P836457M191894j1186600J023980N503616Q11310J854400
3878.7E92566032L803025o222649p438660N651665J096230J046753N374488j2103996
3886.4E83772888J203003N133858O48041M563064n18646q788834K485352L964729j268348
$$ plain form
3895.1 591195107 591872787 592686577 594457321 596011696 586439438 592398224 594662323 587017708 592538376
3903.8 592538376 588433533 587361946 589651833 590662003 593942757 593938484 594003601 593651390 594019623
3912.5 594019623 594011269 592973595 595046158 597690582 593966141 589235573 594173393 594629402 590488091
3921.1 590488091 593372803 595002174 596084709 593318748 591403275 594686165 596309700 597022362
3928.8 597022362 595387039 594484634 596097603 594698257 594010315 596051979 595900078 595136452 595488319
3937.5 595488319 594955635 595518608 595566101 596899643 598561287 593633690 592926750 594978943 595953140
3946.2 595953140 597816963 595635681 595190773 596007309 593924637 596148338 597211037 595699501 596258507
3954.9 596258507 596333389 596001320 595712624 596679802 596815643 596760368 597228394 595508461 596525650 597831497
$$ packed form
3895.1E91195107O77680Q13790J770744J554375r572258N958786K264099p644615N520668
3903.8E92538376m104843j071587K289887J010170L280754m273O5117l52211L68233
3912.5E94019623q354j037674K072563K644424l724441m730568M937820M56009m141311
3921.1E90488091K884712J629371J082535k765961j915473L282890J623535P12662
3928.8E97022362j635323r02405J612969j399346o87942K041664j51901p63626L51867
3937.5E95488319n32684N62973M7493J333542J661644m927597p06940K052193R74197
3946.2E95953140J863823k181282m44908Q16536k082672K223701J062699j511536N59006
3954.9E96258507P4882l32069k88696R67178J35841n5275M68026j719933J017189J305847
$$ plain form
3964.5 597831497 597410049 597165146 597079659 598420715 598179893 597292633 597696838 598213768 598354912 598361588
3974.2 598361588 598591881 598419304 598745346 598613052 598286934 598453369 598665504 598791161 598652000 598859863
3983.8 598859863 598537788 598294029 598944092 599743118 599356613 599041367 598919983 598042755 598600502 598673515
3993.5 598673515 598899994 598818169 598087959 599279976 599632454 599542809 599536438
4000.2 599536438
$$ packed form
3964.5E97831497m21448k44903q5487J341056k40822q87260M04205N16930J41144O676
3974.2E98361588K30293j72577L26042j32294l26118J66435K12135J25657j39161K07863
3983.8E98859863l22075k43759O50063P99026l86505l15246j21384q77228N57747P3013
3993.5E98673515K26479q1825p30210J192017L52478q9645o371
4000.2E99536438
##END=$$ End of the data block
