##TITLE=$$ Begin of the data block
##JCAMP-DX=5.00 $$ ACD/SpecManager v 10.08
##SPECTROMETER/DATA SYSTEM=Varian
##DATE=20 Nov 2012 15:26:46
##DATA TYPE=INFRARED SPECTRUM
##DATA CLASS=XYDATA
##ORIGIN=
##OWNER=
##NPOINTS=3735
##FIRSTX=399.26403809
##LASTX=4000.35498047
##MAXX=4000.35498047
##MINX=399.26403809
##MAXY=72.21957397
##MINY=20.57249069
##XFACTOR=1.0000000000
##YFACTOR=0.000000100000000
##FIRSTY=51.85730362
##DELTAX=0.96440572
##XUNITS=1/CM
##YUNITS=TRANSMITTANCE
##XYDATA=(X++(Y..Y))
399.3E18573036M298020l1879197L949700m409485N466652q63876N484886J194954
$$ 518573036 522871056 490991859 494941559 490532074 495998726 495134850 500619736 501814690
407E01814690k1190796r47228P38449O688996N665855M293366k526780n238456K017402
$$ 501814690 480623894 479676666 480415115 487104111 492769966 497063332 494536552 489298096 491315498
415.7D91315498j613235m10423k9677468J9397393J4555740j847763J73721j2903976
$$ 491315498 489702263 489291840 459614372 479011765 493567505 491719742 491893463 478989487
423.4D78989487J040840J622696N114898p162094l60984L532676q644943j484108m333191
$$ 478989487 480030327 481653023 486767921 479605827 479244843 482777519 474132576 472648468 468315277
432.1D68315277L141708r12513M80766j519508m892311M733314k773666J083603l267479
$$ 468315277 471456985 470544472 471025238 469505730 464613419 469346733 466573067 467656670 464389191
440.7D64389191L947258N380287J979599M228287m592400P622261o86836K846985K135849
$$ 464389191 468336449 473716736 475696335 479924622 475332222 482954483 482267647 485114632 487250481
449.4D87250481o903458J210709K898445O353798l762589Q06275m151078q394737P178116
$$ 487250481 480347023 481557732 484456177 490809975 487047386 487853661 483702583 475307846 482485962
458.1D82485962L823814P09992p496529J562996J748161J294213k015915l900986N453415
$$ 482485962 486309776 487019768 479523239 481086235 482834396 484128609 482112694 478211708 483665123
466.8D83665123k76375J9684r018135l111229j784210n666085K909356m866333L146171
$$ 483665123 483388748 483408432 474390297 471279068 469494858 463828773 466738129 461871796 465017967
475.5D65017967q17032l428802n07584J625138k169342n648728L770218l703957p1449
$$ 465017967 464200935 460772133 460264549 461889687 459720345 454071617 457841835 454137878 454066429
484.1D54066429M485626K678757o85387k774047J414489k123642K978134k985839k091828
$$ 454066429 458552055 461230812 460545425 457771378 459185867 457062225 460040359 457054520 454962692
492.8D54962692J872063O45561J143761l778382J455803l224830j765404M25682K06146
$$ 454962692 456834755 457480316 458624077 454845695 456301498 453076668 451311264 451736946 451943092
501.5D51943092N99099o260910K78701p46879m19503n304298l705749L074989q34313
$$ 451943092 452542191 446281281 446559982 445813103 445393600 440089302 436383553 439458542 438624229
510.2D38624229K8267k133979k360497m778862l848915q79555m66461p31010m338761
$$ 438624229 438652496 436518517 434158020 429379158 425530243 424650688 424184227 423453217 419114456
518.9D19114456J066857n6076k429314l505325l436013j747818k107620J833534J594200
$$ 419114456 420181313 420125237 417695923 414190598 410754585 409006767 406899147 408732681 410326881
527.5D10326881J902695k048263j822930J140785k99301J336632l66096J424331J553688
$$ 410326881 412229576 410181313 408358383 409499168 409199867 410536499 410170403 411594734 413148422
536.2D13148422J215973K190552K150955M838944L499145M046097L446998J665688
$$ 413148422 414364395 416554947 418705902 423544846 427043991 431090088 434537086 436202774
543.9D36202774q05626j989746J37405q9378L24516j274299M14467j021271j808167
$$ 436202774 435397148 433407402 433544807 433455429 433779945 432505646 432920113 431898842 430090675
552.6D30090675k45552q6403L69645l399430q86688j027718k793502k387658k448463
$$ 430090675 429845123 429758720 430128365 426728935 425842247 424814529 422021027 419633369 417184906
561.3D17184906k007027m587783k882767k520752j488800j872215m049874n104370
$$ 417184906 415177879 410590096 407707329 405186577 403697777 401825562 397775688 392671318
569C92671318l536453J265068j806183l260498k147484R4986O78673m96597J827812
$$ 392671318 389134865 390399933 388593750 385333252 383185768 383280754 383959427 383462830 385290642
577.7C85290642K52495J093368L034554L100547K775574L559227N096779L299027K818374
$$ 385290642 385543137 386636505 389671059 392771606 395547180 399106407 404203186 407502213 410320587
586.4D10320587J867523K340126K394905Q91762Q34923R86214K477264L78609J85623
$$ 410320587 412188110 414528236 416923141 417814903 418649826 419636040 422113304 422491913 422677536
595D22677536o0387j44424q38738j813850J734047l45154j45378L17192m24919K66304
$$ 422677536 422617149 422472725 421633987 419820137 421554184 421209030 421063652 421380844 420955925 421222229
604.7D21222229j440239L61939Q68301l23906j688690K61726J209603L62663J285057
$$ 421222229 419781990 420143929 421012230 420688324 418999634 419261360 420470963 420833626 422118683
613.4D22118683M91104J980591R15298J716690K095681L77159J867408J378289J717529
$$ 422118683 422609787 424590378 425505676 427222366 429318047 429695206 431562614 432940903 434658432
622D34658432J235619K292900J325874O26183K469291J346665K242584P48062R52606
$$ 434658432 435894051 438186951 439512825 440139008 442608299 443954964 446197548 446945610 447898216
630.7D47898216Q67768J88560J546211P20215Q95119l14293J194801J364136O85654
$$ 447898216 448765984 448954544 450500755 451220970 452116089 451801796 452996597 454360733 455046387
639.4D55046387J414146J4343K62261P09267J022796k81143J036110J365013J254501
$$ 455046387 456460533 456474876 456737137 457446404 458469200 458188057 459224167 460589180 461843681
648.1D61843681J589280q60825K73857o60477r4909M16679P20749J208801l94325J091576
$$ 461843681 463432961 462572136 462845993 462185516 462090607 462507286 463228035 464436836 464042511 465134087
657.7D65134087L62053j97793o93092J511154P14569j182441Q99963r12590K147217
$$ 465134087 465496140 465298347 464605255 466116409 466830978 465648537 466548500 465635910 467783127
666.4D67783127N745582J1787873o633072o875839m75655j245003J95732K873383K285652
$$ 467783127 473528709 485316582 478683510 471807671 471332016 470087013 470282745 473156128 475441780
675.1D75441780J135330K19879J34583n63927K698136O92978p05300J34773L52517
$$ 475441780 476577110 476796989 476931572 476367645 479065781 479758759 479053459 479188232 479540749
683.8D79540749K083129K28730m28887r93080K47879N0583J09902P00225n24864p4653
$$ 479540749 481623878 481852608 481423721 480430641 480678520 480729103 480839005 481539230 481014366 480939713
693.4D80939713j545830m14543j079941k134819j886330j968040j229744j785355r02290
$$ 480939713 479393883 478979340 477899399 475764580 473878250 471910210 470680466 468895111 467992821
702.1D67992821k833748j635704j04370p01866l21846j521035n62858r96208R24224
$$ 467992821 465159073 463523369 463418999 462717133 462395287 460874252 460311394 459315186 460239410
710.8D60239410J505280J197700K282715Q45032K262917K322540J383324M04396L335647
$$ 460239410 461744690 462942390 465225105 466070137 468333054 470655594 472038918 472443314 475778961
719.5D75778961M482651N74875J394615R69276L039971M065704L189736K731933J466446
$$ 475778961 480261612 480836487 482231102 483200378 486240349 490306053 493495789 496227722 497694168
728.1D97694168K488632J319657J588821J620903K506828K491684J346703Q28171p77779
$$ 497694168 500182800 501502457 503091278 504712181 507219009 509710693 511057396 511885567 511107788
736.8E11107788J883507J536293J459465O99921q26569L55072j73492O04934j922035
$$ 511107788 512991295 514527588 515987053 516686974 515860405 516215477 516041985 516646919 514724884
745.5E14724884k266960j683846j570930n35126q36525o64062l402558l016853k602386
$$ 514724884 512457924 510774078 509203148 508668022 507831497 507167435 503764877 500748024 498145638
754.2D98145638k559433k774392l472747j878853j598587q45337k154770j078148r07135
$$ 498145638 495586205 492811813 489339066 487460213 485861626 485016289 482861519 481783371 480876236
762.8D80876236j165466O09436l32222R34028K95868O49834J916656L072892L697281
$$ 480876236 479710770 480320206 479987984 480922012 481217880 481867714 483784370 486857262 490554543
771.5D90554543K442321M454155L508606L271523M014511L707123L374481L064957
$$ 490554543 492996864 497451019 500959625 504231148 508245659 511952782 515327263 518392220
779.2E18392220M193038K566224L682174L150597J789970K130852J912499K875022
$$ 518392220 522585258 525151482 528833656 531984253 533774223 535905075 537817574 540692596
787E40692596J671486K119294J792984J839942M17252O54602K686310O04210J733436
$$ 540692596 542364082 544483376 546276360 548116302 548533554 549188156 551874466 552478676 554212112
795.6E54212112J339570K264823K097130N45922J152649J552886L663407J285515J999283
$$ 554212112 555551682 557816505 559913635 560459557 561612206 563165092 566828499 568114014 570113297
804.3E70113297K604064J472130J064759m43955J223106M22020J040001K32659p74040
$$ 570113297 572717361 574189491 575254250 574810295 576033401 576455421 577495422 577728081 576954041
813E76954041R1094J070481J486931m23394Q74672j91879Q67806N89027j802750p55500
$$ 576954041 577045135 578115616 579602547 579179153 580053825 579861946 580729752 581318779 579516029 578760529
822.6E78760529j301575l71781j033210o96526j332474j313476r50012k060547j061669
$$ 578760529 577458954 577087173 576053963 575357437 574024963 572711487 571761475 569700928 568639259
831.3E68639259l036842k741165k982903k241707j700439l012657j964836k709770
$$ 568639259 565602417 562861252 559878349 557636642 555936203 552923546 550958710 548248940
839E48248940j751442k040863j912308j744538j843299j164132j657867j232567k267837
$$ 548248940 546497498 544456635 542544327 540799789 538956490 537792358 536134491 534901924 532634087
847.7E32634087j036835j341019j957626j504059j498756j185456l309936k055741
$$ 532634087 531597252 530256233 528298607 526794548 525295792 524110336 520800400 518744659
855.4E18744659j322631j437035j960602k124595j155434r33457O21911M78935L406181
$$ 518744659 517422028 515984993 514024391 511899796 510744362 509810905 510432816 510911751 514317932
864.1E14317932M748650L973655M528084L997574M592514M619484O435547M040565
$$ 514317932 519066582 523040237 527568321 531565895 536158409 540777893 547213440 551254005
871.8E51254005K996216M639626L013305L322144J904526J439094q69064j72005P39518
$$ 551254005 554250221 558889847 561903152 565225296 567129822 568568916 567699852 567527847 568267365
880.5E68267365j733208j133537l033181l155212l827591k467423j816597l334007
$$ 568267365 566534157 565400620 562367439 559212227 555384636 552917213 551100616 547766609
888.2E47766609k310867k221642p93762j649704j124763j936417l054008j595459j561890
$$ 547766609 545455742 543234100 542440338 540790634 539665871 537729454 534675446 533079987 531518097
896.9E31518097j241150k437172j367683k192498k127914p59201j485062j965522l418007
$$ 531518097 530276947 527839775 526472092 524279594 522151680 521392479 519907417 517941895 514523888
905.6E14523888k391663l494377l193665l251571m095459l448487m757080m133796
$$ 514523888 512132225 508637848 505444183 502192612 498097153 494648666 489891586 485757790
913.3D85757790n653763m766731l905526m617080m083405m513054l272743l708649
$$ 485757790 480104027 475337296 471431770 466814690 462731285 458218231 454945488 451236839
921D51236839k922821j781959r86443r51423j561623m72565j026916l10097K19002
$$ 451236839 448314018 446532059 445545616 444594193 443032570 442560005 441533089 441222992 441441994
929.7D41441994O82792R11484Q82225J671410R44443J319046J589355K192192J630592
$$ 441441994 442124786 443036270 443918495 445589905 446534348 447853394 449442749 451634941 453265533
938.4D53265533J681138K643470J571045K294045K265548K074776O79283n30891p19567
$$ 453265533 454946671 457590141 459161186 461455231 463720779 465795555 466474838 465943947 465224380
947.1D65224380j963272j720581l784256n091781m627610m391784n550385o643486
$$ 465224380 463261108 461540527 457756271 452664490 448036880 443645096 438094711 431451225
954.8D31451225o045608o880799p271919p034263o361962o852608p116165p276916
$$ 431451225 425405617 418524818 411252899 404218636 397856674 391004066 383887901 376610985
962.5C76610985p580681o903687p007141p337951q390580q197288p892609p179947
$$ 376610985 369030304 362126617 355119476 347781525 339390945 331193657 323301048 316121101
970.2C16121101p894535q628463p711583q228321p275181p468109o970653o849995
$$ 316121101 308226566 299598103 291886520 283658199 276383018 268914909 261944256 255094261
977.9B55094261p343235o556949n562630m295273m977875m220390l708439k713413
$$ 255094261 247751026 241194077 235631447 231336174 226358299 222137909 218429470 215716057
985.6B15716057k457028k317123j611385j684399n21832j309547O8531M7283k05650
$$ 215716057 213259029 210941906 209330521 207646122 207124290 205814743 205883274 205930557 205724907
994.3B05724907L70884J1349J421222R651N02816K85511n9662L30219J85127J510086
$$ 205724907 206095791 206107140 207528362 207538013 208040829 208326340 208266678 208596897 208782024 210292110
1004B10292110L54538L27721p31430n36652J85910p1984J7567j149712M4670n96904
$$ 210292110 210646648 210974369 210242939 209706287 209892197 209820213 209837780 208688068 208732738 208135834
1013.6B08135834m31977j50165K65236M71058J86309J734658k54650M09526P84417
$$ 208135834 207703857 207553692 207818928 208289986 208476295 210210953 209956303 210365829 211150246
1022.3B11150246J273784J884804O78654J527366O47164J756000J425095J315498J116867
$$ 211150246 212424030 214308834 214987488 216514854 217162018 218918018 220343113 221658611 222775478
1031B22775478Q27084J999359M23679J119843N07889J174907O00777o01883J262226
$$ 222775478 223602562 225601921 226025600 227145443 227653332 228828239 229429016 228827133 230089359
1039.6B30089359P44133R33209J6937M53625j28823l81202M5681Q9149J836796M22440
$$ 230089359 230833492 231766701 231783638 232237263 232108440 231727238 231772919 231862068 233698864 234121304
1049.3B34121304J169090O09875J533966J909256Q16192L170281K034073K896423K744827
$$ 234121304 235290394 235900269 237434235 239343491 240159683 243329964 245364037 248260460 251005287
1058B51005287K622032L425274L602371L645516K626057N158920N069923M929943L954277
$$ 251005287 253627319 257052593 260654964 264300480 266926537 272085457 277155380 282085323 286039600
1066.6B86039600K474137J834297r34143j515694l750877n015393o286220n877247
$$ 286039600 288513737 290348034 289413891 287898197 284147320 279131927 272845707 266968460
1074.4B66968460l771515l320999j872349k776336m27056K33326N68428Q65021J06144
$$ 266968460 263196945 259875946 258003597 255227261 254800205 255033531 255601959 256466980 256573124
1083B56573124J212273K09369J698284J955204K431565K113094J427727J666736J568222
$$ 256573124 257785397 257994766 259693050 261648254 264079819 266192913 267620640 269287376 270855598
1091.7B70855598L448315K124710K611656K282734J821289K008591R99889J837559
$$ 270855598 274303913 276428623 279040279 281323013 283144302 285152893 286152782 287990341
1099.4B87990341K87399Q43258K44351P4348R59187J66282M76208l09162J534691J684456
$$ 287990341 288277740 289120998 289365349 289439697 290398884 290565166 291041374 290732212 292266903 293951359
1109.1B93951359J167660J251945K085457K725372J198635J817475J050090K074929
$$ 293951359 295119019 296370964 298456421 301181793 302380428 304197903 305247993 307322922
1116.8C07322922J744041Q33340J506481M40674J034298J89266J140480J087132J016349
$$ 307322922 309066963 309900303 311406784 311847458 312881756 313071022 314211502 315298634 316314983
1125.5C16314983K189427P26986J241970J734543K539711K159690J936570K213669
$$ 316314983 318504410 319231396 320473366 322207909 324747620 326907310 328843880 331057549
1133.2C31057549J777076J347504n13802m70810r35592j327439k094879k735595k593346
$$ 331057549 332834625 334182129 333668327 333197517 332261925 330934486 328839607 326104012 323510666
1141.9C23510666l429642l015022l883019k970333l598575l717079k571297k950726
$$ 323510666 320081024 317066002 313182983 310212650 306614075 302896996 300325699 297374973
1149.6B97374973j655502k593746j672001j865883j393280n34801j122246j90640m97837
$$ 297374973 295719471 293125725 291453724 289587841 288194561 287659760 286537514 286346874 285849037
1158.3B85849037J156483L12424N26504J053181J448669K436390J010342L190689L307686
$$ 285849037 287005520 287317944 287844448 288897629 290346298 292782688 293793030 296983719 300291405
1166.9C00291405L306579L667527L859291N017566M774037N147438M834747N864182
$$ 300291405 303597984 307265511 311124802 316142368 320916405 326063843 330898590 336762772
1174.6C36762772N490646N778389O269264N583458O391029N398751N892563N955925
$$ 336762772 342253418 348031807 354301071 359884529 366275558 371674309 377566872 383522797
1182.4C83522797N230369N244560M681778N160599M551582M477120L930206L180123
$$ 383522797 388753166 393997726 398679504 403840103 408391685 412868805 416799011 419979134
1190.1D19979134L683014K724609K367287J900520J561623J308746Q47778P68471K50854
$$ 419979134 423662148 426386757 428754044 430654564 432216187 433524933 434372711 435141182 435392036
1198.8D35392036Q55790P74078M32930L19710Q23364J153145N88569R42994J077232
$$ 435392036 436247826 437021904 437454834 437774544 438597908 439751053 440339622 441282616 442359848
1207.4D42359848J597710J501541J530418J408806J594467K713700K037811K241554
$$ 442359848 443957558 445459099 446989517 448398323 449992790 452706490 454744301 456985855
1215.1D56985855J851807J746368K056580J159210J667366J073151Q10165P19185N12314
$$ 456985855 458837662 460584030 462640610 463799820 465467186 466540337 467350502 468069687 468582001
1223.8D68582001J8806p01790j91345q64372k65045l52745j022835r64661j021309
$$ 468582001 468600807 467899017 467707672 466843300 466578255 466225510 465202675 464238014 463216705
1232.5D63216705n82008p80411j70517o85272j226807j059036p97806n00869o46210
$$ 463216705 462634697 461854286 461683769 460998497 459771690 458712654 457914848 457413979 456767769
1241.2D56767769K9220k35748K19917L14064j51481N34935O67724R17359J015167J077614
$$ 456767769 456796989 456561241 456781158 457095222 456943741 457478676 458146400 459063759 460078926 461156540
1250.8D61156540O52008N53703J026459J210136J015892L67928O97670M59633K70042
$$ 461156540 461808548 462362251 463388710 464598846 465614738 465982666 466680336 467139969 467410011
1259.5D67410011J70899L01399P09839N26085Q92791K77901P50923J010857O08025
$$ 467410011 467580910 467882309 468592148 469118233 470011024 470288925 471039848 472050705 472658730
1268.2D72658730J094856Q38318J252556P93380O18286P76825N82199L88871M348L76473
$$ 472658730 473753586 474591904 475844460 476637840 477256126 478032951 478615150 479004021 479008369 479384842
1277.8D79384842n77049m25988j72271l62015k49367o73103j68305n21545l84636l41988
$$ 479384842 478807793 478381805 478209534 477847519 477598152 476925049 476756744 476235199 475850563 475508575
1287.5D75508575m02565m42428p24907m41017p57714k15835m56276q77266r28764r21402
$$ 475508575 475106010 474663582 473938675 473497658 472739944 472524109 472067833 471190567 470261803 469340401
1297.1D69340401r03778r85718l47786r81979r04618j015129r00841k48069n00412
$$ 469340401 468436623 467450905 467103119 466121140 465216522 464201393 463300552 463052483 462552071
1305.8D62552071n27497j369590q89092n94559o61239m54102q79860p85904n76935
$$ 462552071 462024574 460654984 459765892 459171333 458510094 458055992 457176132 456390228 455813293
1314.5D55813293J70823n74685r08126m51699p69729n55497q24623q26149j000824
$$ 455813293 455984116 455409431 454501305 454049606 453279877 452724380 451899757 451073608 450072784
1323.2D50072784j195678j747742j951523j611023j710319k089844k785645k464561
$$ 450072784 448877106 447129364 445177841 443566818 441856499 439766655 436981010 434516449
1330.9D34516449k053757j703109j780015j540756j478653j787529j136856o60515
$$ 434516449 432462692 430759583 428979568 427438812 425960159 424172630 423035774 422375259
1338.6D22375259l73382n66330P20596P70683q3999m2954K17553L84902M4556J54877
$$ 422375259 422001877 421435547 422156143 422926826 422842827 422799873 423017426 423402328 423446884 423601761
1348.2D23601761N7373k0065j54190j99242Q812m20723j15891j42898k25563n36728
$$ 423601761 423659134 423639069 423484879 423285637 423294449 422873726 422757835 422614937 422389374 421852646
1357.9D21852646q80280n42679j025199q62008o36329o34155m8981K87666k60429m52729
$$ 421852646 420972366 420429687 419404488 418542480 417906151 417271996 417223015 417510681 417250252 416797523
1367.5D16797523j19056m03900j12229m02641Q0070l72200o90002P74612P10297J059609
$$ 416797523 416678467 416274567 416162338 415759697 415839767 415467567 414777565 415552177 416262474 417322083
1377.2D17322083L31802P93342R14803J78642N55382P24487Q50678J078415J850624
$$ 417322083 417653885 418447227 419362030 419540672 420096054 420820541 421671219 422749634 424600258
1385.8D24600258J173744J361351K401009K354507J802101J096421J236534K49366
$$ 424600258 425774002 427135353 429536362 431890869 433692970 434789391 436025925 436275291
1393.6D36275291q99810p33376R24988O05430o09321j291657p53860N87654j84059
$$ 436275291 435375481 434642105 435567093 436172523 435563202 434271545 433517685 434105339 433921280
1402.2D33921280o35681n71671j398620n28031o61049q50525q56552q30612r43375
$$ 433921280 433285599 432713928 431315308 430787277 430126228 429275703 428419151 427588539 426645164
1410.9D26645164q49571m40902p23381n63660m65889m74396q04329l9024j731720M806
$$ 426645164 425795593 425354691 424631310 424067650 423601761 423127365 422323036 422284012 420552292 420557098
1420.6D20557098J665306j81999j38855n30090P59354J148567j49269P02743J27030
$$ 420557098 422222404 422040405 421901550 421371460 422130814 423279381 423130112 423832855 423959885
1429.2D23959885P37571P43981O53877N90973M06341J192627J55983L11013P25670
$$ 423959885 424697456 425441437 426095314 426686287 427092628 428285255 428441238 428752251 429477921
1437.9D29477921J798706J046905L82347Q21533L81203J256790P0915N53513L17535
$$ 429477921 431276627 432323532 432705879 433527412 433908615 435165405 435236320 435789833 436107368
1446.6D36107368p07359m16069K87247R96971q46939o99120j126327j23215M59671
$$ 436107368 435400009 434983940 435271187 436268158 435421219 434722099 433595772 433472557 433932228
1455.3D33932228j575241l347244l082924L899422K89497J206322L43704J08490K014694
$$ 433932228 432356987 429009743 425926819 429826241 430115738 431322060 431665764 431774254 433788948
1464D33788948q00247K269935J865731L066444K569657K316169K968598O80961M373246
$$ 433788948 432988701 435258636 437124367 440190811 442760468 445076637 448045235 448726196 453099442
1472.6D53099442M216270N874252L442498L374176M339523L594742M330215K693367
$$ 453099442 457315712 463189964 466632462 470006638 474346161 477940903 482271118 484964485
1480.3D84964485L430557K585335L393860K912865J808967K725106Q46901K802352
$$ 484964485 488395042 490980377 494374237 497287102 499096069 501821175 502668076 505470428
1488.1E05470428J858445Q95805K861099L698731L379707J254997J776200Q60748q0490
$$ 505470428 507328873 508224678 511085777 514784508 518164215 519419212 521195412 522056160 521975670
1496.7E21975670K375984J518288J192054K060166J788292P86476J652527J153145
$$ 521975670 524351654 525869942 527061996 529122162 530910454 531696930 533349457 534502602
1504.5E34502602K83203q747826j348305R397049K098275K412567J834984J216888
$$ 534502602 534785805 526037979 524689674 534086723 536184998 538597565 540432549 541649437
1512.2E41649437K73743J668548Q74291q29506J049652k041931K877273K163887k934341
$$ 541649437 541923180 543591728 544466019 543636513 544686165 542644234 545521507 547685394 544751053
1520.8E44751053j74370J339226K926979J193085l40805L92799J158714K98844K74849
$$ 544751053 544576683 545915909 548842888 550035973 549695168 550087967 551246681 551545525 551820374
1529.5E51820374J413459l77998j907j081467j880837K398911Q95271K46620l67851
$$ 551820374 553233833 552855835 552853928 551772461 549891624 552290535 553185806 553432426 553064575
1538.2E53064575n067100o775093O551208L445320p15942K556839K95563q90999J040916
$$ 553064575 547997475 541222382 547773590 551218910 550502968 553059807 553355370 552464371 553505287
1546.9E53505287N50308J75744j780282j549377J262665J146545j1864k319412n41496
$$ 553505287 554055595 554231339 552451057 550901680 552164345 553310890 553299026 550979614 550438118
1555.6E50438118J598778O35605j1962700o250687P716675N860824K560502M425l25776
$$ 550438118 552036896 552672501 540709801 534459114 542175789 548036613 550597115 550601540 550275764
1564.2E50275764j127586K96517M82482L9101o68640l811874J948471J361770l2463
$$ 550275764 549148178 549444695 549927177 549966278 549297638 545485764 547434235 548796005 548763542
1572.9E48763542q5678L01285r43527n081368K774544J939430K50473k55585o56166
$$ 548763542 548677864 548979149 548035622 542954254 545728798 547668228 547918701 547663116 547006950
1581.6E47006950m34303l37715o5117m33655l51944n52978m81148k05688j161995o64444
$$ 547006950 546572647 546234932 546169815 545736160 545384216 544831238 544350090 544144402 542982407 542317963
1591.2E42317963q40569n60913p30820j077118m13475r63783o42738j290550r25255
$$ 542317963 541477394 540916481 540185661 539108543 538695068 537731285 537088547 535797997 534872742
1599.9E34872742p52297j248741q73451j232300r74655j132622r90066j870194r28497
$$ 534872742 534120445 532871704 531998253 530765953 529791298 528658676 527668610 525798416 524869919
1608.6E24869919q53844j857490j063500k046547j118431j761360j061287j828041
$$ 524869919 524016075 522158585 521095085 519048538 517930107 516168747 515107460 513279419
1616.3E13279419p119293J429901M3754q93859k044449q79441j730041m512711K6894
$$ 513279419 506160126 507590027 507633781 506739922 504695473 503816032 502085991 497573280 497600174
1625D97600174o36139n56526l025551j774063k11563r58100j019096j576233J78414
$$ 497600174 496964035 496407509 493381958 491607895 491396332 490438232 489419136 487842903 488021317
1633.7D88021317J65023n993004k558860K013626N62477P23152M63295j232185N86509
$$ 488021317 488186340 482193336 479634476 481648102 482210579 482933731 483397026 482164841 482751350
1642.4D82751350l62701O65207K95982l667335l24936P83157L112869J575623J971054
$$ 482751350 482388649 483053856 483349838 479682503 479357567 480140724 483253593 484829216 486800270
1651D86800270J510391p787933l287621Q639222M820480K248878K381096J531334J677742
$$ 486800270 488310661 480522728 477235107 485874329 490694809 492943687 495324783 496856117 498533859
1659.7D98533859J037445J620980J759681N75600K999916J989365J908455J576118
$$ 498533859 499571304 501192284 502951965 503527565 506527481 508516846 510425301 512001419
1667.4E12001419J379089p65113K057838M422607J760750K931786K655716J523323
$$ 512001419 513380508 512615395 514673233 519095840 520856590 523788376 526444092 527967415
1675.1E27967415N95283L016243L124695J729584K095108J022873L256378K642174
$$ 527967415 528562698 531578941 534703636 536433220 538528328 539551201 542807579 545449753
1682.9E45449753k778816J014251M410363M724578L012734J505127J649017J501770
$$ 545449753 542670937 543685188 548095551 552820129 555832863 557337990 558987007 560488777
1690.6E60488777K350998K423134J490974J751976L35083l293266M783707L653145
$$ 560488777 562839775 565262909 566753883 568505859 568840942 565547676 570331383 573984528
1698.3E73984528L537826q6288k830849M852219K957992J221924o03371J521378J156120
$$ 573984528 577522354 577436066 574605217 579457436 582415428 583637352 583033981 584555359 585711479
1707E85711479J229210J692848L04985N58129J052437J142349O88705n40199k90451
$$ 585711479 586940689 588633537 588938522 589496651 590549088 591691437 592380142 591839943 591549492
1715.6E91549492J788635M23737l443222M405327K959403J408196P43713L77884O01158
$$ 591549492 593338127 593761864 590318642 594723969 597683372 599091568 599835281 600213165 600814323
1724.3F00814323Q30384Q13637M25682R33532P54166q57086J5487K021103J130333
$$ 600814323 601644707 602458344 602884026 603817558 604571724 603714638 603730125 605751228 606881561
1733F06881561m115410n15785M194489L081016Q52890J050568l7842j306152K998161
$$ 606881561 602766151 602250366 606444855 609525871 610378761 611429329 611391487 610085335 613083496
1741.7F13083496J536179p13501K46353J651459J041107J65596J067009J27067K522965
$$ 613083496 614619675 613906174 614152527 615803986 616845093 617010689 618077698 618204765 620727730
1750.4F20727730N64194j01624K941551J299553J276627J437072p83920O16837J543388
$$ 620727730 621291924 621190300 624131851 625431404 626708031 628145103 627361183 627978020 629521408
1759F29521408O24542J472321l00255R232K634658J211701J080093J033783N59159
$$ 629521408 630145950 631618271 631318016 631327248 633961906 635173607 636253700 637287483 637846642
1767.7F37846642j375237Q95958K427521j738777k067490L56712L342934K247314o56738
$$ 637846642 636471405 637367363 639794884 638056107 635988617 636345329 639688263 641935577 641278839
1776.4F41278839J576080M48456M10385j05743p91092R52072R54056R13010n28717
$$ 641278839 642854919 643303375 643713760 643608017 642816925 643768997 644723053 645636063 645107346
1785.1F45107346K91366R35745O35453L61709K65427l56751n35507o75659k72064K416763
$$ 645107346 645398712 646334457 646969910 647331619 647597046 647240295 646704788 646029129 645757065 648173828
1794.7F48173828M27857o37055J323166J114121J41448r59854J668396o8740l26996
$$ 648173828 648601685 647964630 649287796 650401917 650543365 649583511 651251907 651183167 650856171
1803.4F50856171J058120O2485Q34046K13012R156K58026J51519q08410K47040J384887
$$ 650856171 651914291 651976776 652810822 653023834 653032990 653291016 653442535 652634125 652881165 654266052
1813F54266052L13263N34516o9046M44717k34909J1673J155853k90375K94648l47901
$$ 654266052 654579315 655113831 655044785 655489502 655254593 655266266 656422119 656131744 656426392 656078491
1822.7F56078491M57001Q09708j810914M08173J115418Q38699m37622j886444J267242
$$ 656078491 656535492 657345200 655534286 655942459 657057877 657896576 657458954 655572510 656839752
1831.4F56839752J828156R918q9569M39682p0877j54114n70221P48138L49427M7760
$$ 656839752 658667908 658677826 658588257 659027939 658957062 658802948 658232727 658980865 659330292 659378052
1841F59378052J068L0823J61972l668976J837158K083435k33459N0354M97131O59790
$$ 659378052 659379120 659409943 659571915 655902939 657740097 659823532 659590073 659640427 660137558 660797348
1850.7F60797348n70297R7046J48468K00882K40860l68271M53338k63137K1743m6081
$$ 660797348 660227051 660324097 660472565 660673447 660914307 660546036 660999374 660736237 660757980 660711899
1860.3F60711899Q850J89133j4801K85568k46735M1123o24009L51334m5624j329651
$$ 660711899 660720749 660909882 660895081 661180649 660933914 660975037 660351028 660702362 660656738 659327087
1869.9F59327087R12323R41010O99158l2578J76849N0507k23694M2191Q1863P22809
$$ 659327087 660239410 661180420 661879578 661847000 662023849 662074356 661850662 661892853 661974716 662697525
1879.6F62697525L55377K04392m29840l9521J52207j16043L57666m98047L82156j54571
$$ 662697525 663052902 663257294 662827454 662787933 662940140 662824097 663181763 662683716 663065872 662911301
1889.2F62911301j165390R99221R41391j02081J69907J93252n37033P71256K59170
$$ 662911301 661745911 662745132 663686523 663584442 663754349 663947601 663410568 664181824 664440994
1897.9F64440994k67486L8452k9450L95203j03378K16217n29251k41394M15573k33689
$$ 664440994 664173508 664211960 664182510 664577713 664474335 664690552 664161301 663919907 664335480 664101791
1907.6F64101791J8769j26419O5231k14386O00433L21884q3694L1738m28467R18503
$$ 664101791 664120560 663994141 664059372 663844986 664445419 664767303 664683609 664715347 664286880 665205383
1917.2F65205383j290054p39136J151886J33438L30353p60956o5918Q76084J08337
$$ 665205383 663915329 663176193 664328079 664461517 664791870 664030914 663964996 664841080 664949417
1925.9F64949417n09491j51520J91574J3047J47705K66189O20804l58505l3340J59683
$$ 664949417 664439926 664288406 664479980 664493027 664640732 664906921 665527725 665169220 665135880 665295563
1935.5F65295563l30887Q6594k98081K98386l6164K10801n17655j578064J239472J092224
$$ 665295563 664964676 665051270 664753189 665051575 665015411 665226212 664708557 663130493 664369965 665462189
1945.2F65462189j55487n41687n4245j4420K96478O00357o8588K28653M4251O3858
$$ 665462189 665306702 664765015 664710770 664696350 664992828 665593185 665524597 665753250 665797501 665861359
1954.8F65861359o9199K7237m6310j80436L93830n4932J19019k01264P8659K52152
$$ 665861359 665792160 665819397 665773087 665592651 665986481 665931549 666050568 665849304 665927963 666180115
1964.5F66180115k61917J52053k61611J12228J98288O2408j48163j97677J92642K54212
$$ 666180115 665918198 666070251 665808640 665920868 666119156 666181564 666033401 665835724 666028366 666282578
1974.1F66282578L24783k34528K63214K18354q0490j07728k4719L81928m95758j10703
$$ 666282578 666607361 666372833 666636047 666854401 666773911 666666183 666641464 667023392 666527634 666416931
1983.7F66416931l0823j40609J20773r4070q4687j39236Q41980M5318j201629j42136
$$ 666416931 666386108 666245499 666366272 666272202 666187515 666048279 666890259 666935577 665733948 665591812
1993.4F65591812P30744M04892k07367J36947k77023q9264m8294j12610j71356k49405
$$ 665591812 666322556 666727448 666520081 666657028 666380005 666290741 666242447 666129837 665958481 665709076
2003F65709076L73382r2926Q9722j84021j33362J43357k80762q7433l46680J59455
$$ 665709076 666082458 665989532 666079254 665895233 665761871 665905228 665624466 665537033 665190353 665349808
2012.7F65349808k87094n04685J39771r9259m79812k61689N21317k47192l29972j41525
$$ 665349808 665062714 664558029 664697800 664598541 664118729 663857040 664378357 664131165 663801193 663659668
2022.3F63659668k51007J9455j71585k02484n79300J21154J28556j98059j75171l06244
$$ 663659668 663408661 663428116 663256531 663054047 662474747 662595901 662724457 662526398 662351227 662044983
2032F62044983n8823p09228l05863r4299%J31149k38723j50834j67923J17722l63235
$$ 662044983 661986160 661276932 660971069 660876770 660876770 661007919 660769196 660618362 660450439 660568161 660204926
2042.6F60204926L1204q2398n74798j22757N7907L95431m74548k3880K62299m17176
$$ 660204926 660236130 660153732 659578934 659456177 659514084 659909515 659434967 659411087 659673386 659256210
2052.2F59256210j37558q468K81448j74103j04065j22299m5395P4768k10571p8201
$$ 659256210 659118652 659110184 659391632 659217529 659113464 658991165 658945770 659020538 658809967 658731766
2061.9F58731766k41852M37012N3634l18374n3635n3329K14233k26135J49765L30429
$$ 658731766 658489914 658926926 658980560 658662186 658608551 658555222 658769455 658543320 658693085 659023514
2071.5F59023514J9913l89786j00708M02908J02615l3035k41089L02506Q7051Q7662
$$ 659023514 659043427 658653641 658552933 658955841 659058456 659025421 658784332 659086838 659173889 659261551
2081.1F59261551J03912k29034J02234k74506J26267m8829j53121Q8043J0681Q4610
$$ 659261551 659365463 659136429 659238663 658964157 659090424 659041595 658888474 658976517 658987198 659071808
2090.8F59071808K0981L35464k79083K93579L41949l48052r3232j4114M32129k11945
$$ 659071808 659092789 659428253 659149170 659442749 659784698 659436646 659343414 659329300 659761429 659549484
2100.4F59549484j01623J49307K19650K53296o2179L1433n88608J08948J19781m6768
$$ 659549484 659447861 659597168 659816818 660070114 660007935 660039368 659450760 659559708 659679489 659632721
2110.1F59632721L30734J23215J65329j76849K03018r6054k1973j66168q1253O06918
$$ 659632721 659963455 660086670 660251999 660075150 660278168 660182114 660160141 659993973 659912720 660519638
2119.7F60519638l50723k82364j61133J77231K04315m2572L6697k53601K23465j20010
$$ 660519638 660168915 659886551 659725418 659902649 660106964 660064392 660101089 659847488 660070953 659950943
2129.4F59950943R1858J39618n3177o9122K8228M94004m84925j39770K83508p7972
$$ 659950943 660042801 660182419 660129242 660060120 660088348 660582352 660097427 659957657 660241165 660163193
2139F60163193l58429k00882M59137J94931j8311m53872L81k63901j77078M13513j88598
$$ 660163193 659804764 659603882 660063019 660257950 660239639 659785767 659786148 659522247 659345169 659758682 659570084
2149.6F59570084L09372j6251J36642Q7738p7362L11051j02997O5994j96075J51443
$$ 659570084 659879456 659863205 659999847 660087585 660010223 660321274 660218277 660284271 660088196 660239639
2159.3F60239639J45493M02603L12576k55966L98636j7471Q7890l7842R4529J26800
$$ 660239639 660385132 660787735 661100311 660844345 661242981 661225510 661313400 661275558 661370087 661496887
2168.9F61496887p3700M20761N5008L90702O4468L8376L1357O6070M16107J9532N79834
$$ 661496887 661423187 661843948 661898956 662289658 662354126 662392502 662423859 662489929 662906036 662925568 663505402
2179.5F63505402P9498l8529J60141J01548J31912J99432O07071l15857p6M23584K90146
$$ 663505402 663584900 663546371 663706512 663808060 663939972 664139404 664746475 664430618 664430542 664854126 665144272
2190.1F65144272l9978J5793N52368K9297L81927j38321j08337J55563j22757J17340
$$ 665144272 665104294 665120087 665672455 665701752 666083679 665945358 665837021 665992584 665869827 665987167
2199.8F65987167q2855M76456K67486L19977r6817j28174L38211q7738M11454k2812
$$ 665987167 665904312 666380768 666648254 666968231 666871414 666743240 667081451 666993713 667405167 667382355
2209.4F67382355K59170K64206O1722K91290o0959J30463p0953M09469N3711j4648
$$ 667382355 667641525 667905731 667967453 668258743 668197784 668328247 668257294 668666763 668720474 668705826
2219F68705826J39160M0283M42658O0653K94113j85546K13317L05787k6017L23792
$$ 668705826 668844986 668885269 669327927 669388580 669682693 669497147 669710464 670016251 669990234 670314026
2228.7F70314026n2643L19595j23901P6k03323m501L99627l89938K65121K50245J92184
$$ 670314026 670261383 670580978 670457077 670457153 670253830 670249329 670648956 670259018 670524139 670774384 670966568
2239.3F70966568k71606j09864K50016o867K20871k76947M60129J28937m6158J92871
$$ 670966568 670694962 670585098 670835114 670828247 671049118 670772171 671232300 671361237 671315079 671507950
2248.9F71507950P9117J32980l59268O74591q698l02353J56174M78058N99289o02341
$$ 671507950 671587067 671720047 671360779 672035370 672026672 671724319 671880493 672358551 672957840 672355499
2258.6F72355499L77884M75693L1662k47040N646N79986n2337J46942k51389P2632
$$ 672355499 672733383 673209076 673240738 672993698 672999344 673579330 673526993 673673935 673422546 673495178
2268.2F73495178J67847O0272J8616L4256M06875J26572N60761p16401n10177J25274
$$ 673495178 673663025 673723297 673741913 673776169 674183044 674309616 674870377 674153976 673643799 673769073
2277.9F73769073J10779N08194m84619J40839l1891K92358K33155J37176N35431j64413
$$ 673769073 673879852 674388046 673903427 674044266 674012375 674304733 674537888 674675064 675210495 675046082
2287.5F75046082R16671j59454M2801N77164L20739O90766m39530P55158M32510O79169
$$ 675046082 675962753 675803299 675846100 676423264 676744003 677434769 676995239 677750397 678182907 678862076
2297.2F78862076Q26568k80609L51334J84326M90189j54114P73086J015778N54352
$$ 678862076 679688644 679408035 679759369 679943695 680433884 680279770 681052856 682068634 682622986
2305.8F82622986J145859Q32824J880341P68433R41314O79932j22070Q92181j05896
$$ 682622986 683768845 684601669 686482010 687250443 688191757 688871689 688749619 689641800 689535904
2314.5F89535904Q23364J050339J271057J127625J651077K606735M39758P27082P33184
$$ 689535904 690359268 691409607 692680664 693808289 695459366 698066101 698505859 699232941 699966125
2323.2F99966125L99933j05056J543960K570419M45557Q90885n66941N50690Q84628
$$ 699966125 700366058 700261002 701804962 704375381 704820938 705711823 705144882 705695572 706580200
2331.9G06580200k08359K30942m44946J988144N34057j154251L70255Q22067N68619
$$ 706580200 706371841 706602783 706157837 708145981 708680038 707525787 707896042 708718109 709286728
2340.6G09286728l90396Q5907j410752j194000m49066k253723m821930n354767M29535
$$ 709286728 708896332 708982239 707571487 706377487 705928421 703674698 698852768 693498001 693927536
2349.2F93927536N490189M281005L057023L154602K374191K976684K171250J516571
$$ 693927536 699417725 703698730 706755753 709910355 712284546 715261230 717432480 718949051
2356.9G18949051p9041K102738J222992j737900J78757m16184o68030k017822j285248
$$ 718949051 718870010 720972748 722195740 720457840 720636597 720220413 719552383 717534561 716249313
2365.6G16249313j115875k216186k049103l887940m070282l712387j870193j882477
$$ 716249313 715133438 712917252 710868149 706980209 702909927 699197540 697327347 695444870
2373.3F95444870l299103k964325k371750j013641j942291k741013k136993j569061
$$ 695444870 692145767 689181442 686809692 685796051 683853760 681112747 678975754 677406693
2381.1F77406693j740418k093811j166916r78165o13250p68738p12433j15662m07867
$$ 677406693 675666275 673572464 672405548 671427383 670814133 670045395 669332962 669217300 668809433
2389.7F68809433k26364m09317o3477Q2245m3869k97623j88827M92325k57721j95847
$$ 668809433 668583069 668173752 668110275 668192520 668148651 667851028 667662201 668154526 667896805 667700958
2399.4F67700958j22909q545j5030n8289L32642m75082o3782j86310n86853k16675
$$ 667700958 667578049 667569504 667554474 667496185 667828827 667353745 667289963 667103653 666516800 666300125
2409F66300125k41012p5531M2343L52783j45722k02102l56064l70102J0681k99530
$$ 666300125 666059113 665983582 666025925 666378708 666232986 666030884 665674820 665304718 665315399 665015869
2418.7F65015869j58539k53372l8452l94821l95508j20316l65295k00043l62701K27127
$$ 665015869 664857330 664603958 664565506 664170685 663775177 663654861 663289566 663089523 662726822 662953949
2428.3F62953949o7749m10919m88663m73251L0746m01535j3962k54135k77405P2251
$$ 662953949 662886200 662475281 661986618 661513367 661544113 661142578 661128616 660874481 660597076 660669327
2438F60669327k43149o5002k10267k39715l56369p4387j48468k53830k39029l73153
$$ 660669327 660426178 660361176 660150909 659911194 659554825 659480438 659331970 659078140 658839111 658465958
2447.6F58465958n3101k61002k62908m47388l205k05612o00280j07270k91824J85852
$$ 658465958 658412857 658151855 657888947 657441559 657438354 657232742 656632462 656525192 656233368 656419220
2457.2F56419220j72501j07803j88904p96051l16009k26670n417m17099j09024O7444
$$ 656419220 656246719 656138916 655950012 655153961 654837952 654611282 654605865 654188766 654079742 654147186
2466.9F54147186k14996j19324j97067J33209m25262k25678j84479l05709j71509j88065
$$ 654147186 653932190 653812866 653615799 653749008 653323746 653098068 652913589 652607880 652436371 652248306
2476.5F52248306K1286n18341J20621j90125m92401n8593j56784K09579m33044n33982
$$ 652248306 652269592 651751251 651871872 651681747 651189346 651130753 650973969 651183548 650750504 650216522
2486.2F50216522l65066J57242N8059n43747k24838l00140K89077L06j99433q2321
$$ 650216522 649851456 650008698 650066757 649523010 649298172 648998032 649287109 649287415 649087982 649005661
2495.8F49005661l92151j50375k27509Q0261J22986j23977k67334J34201j59073o79245
$$ 649005661 648613510 648463135 648235626 648315887 648438873 648314896 648047562 648181763 648022690 647343445
2505.5F47343445j46332n6229L28598Q4610j01928l46146m50745J22605k17133l5934
$$ 647343445 647197113 647140884 647469482 647554092 647452164 647106018 646655273 646777878 646560745 646524811
2515.1F46524811j49994j42136m8599k20489j98822m46015k63672l52096r2163o8207
$$ 646524811 646374817 646232681 646184082 645963593 645764771 645318756 645055084 644702988 644610825 644542618
2524.7F44542618K1744N8593k82974j55258m75006m01612l52020k59781j68533K20871
$$ 644542618 644564362 644622955 644339981 644184723 643709717 643308105 642956085 642696304 642527771 642748642
2534.4F42748642J55945l82996l14407r40933k05765K7923j4419M1580q64410k0829
$$ 642748642 642904587 642521591 642207184 641266251 641060486 641088409 641073990 641115570 640251160 640230331
2544F40230331j80511l18527l3226k97013j33056j29738j00327p61718o21720k79159
$$ 640230331 640049820 639731293 639698067 639401054 639267998 639138260 639037933 638276215 637654495 637375336
2553.7F37375336J00479R1018l55224k72942n41801M2381m6005n01251m93775j34010
$$ 637375336 637475815 637566833 637211609 636938667 636396866 636439247 636393242 635891991 635398216 635264206
2563.3F35264206k22092n82924K74773o1111k10457m42124m67186j9073k86637J12839
$$ 635264206 635042114 634459190 634733963 634672852 634462395 634020271 633553085 633534012 633247375 633360214
2573F33360214m15306m41818j96343N1232J7929n70221j22719j41525L3417l27073
$$ 633360214 632944908 632503090 632306747 632357979 632375908 631805687 631682968 631541443 631574860 631247787
2582.6F31247787j40914k0714p82242l54500j79062o3247j69106K0714n10674o15310
$$ 631247787 631106873 631086159 630303917 629949417 629770355 629707108 629538002 629558716 629048042 628432732
2592.2F28432732K67372p2899j00174m41475J0338K2354o01311j69067O9160J72463
$$ 628432732 628700104 628627205 628527031 628085556 628095894 628118248 627516937 627347870 627417030 627589493
2601.9F27589493k47498j31759o61011n08652L87802K17362l4485q75092n88188n14793
$$ 627589493 627341995 627210236 626549225 626040573 626428375 626645737 626611252 625736160 625147972 624633179
2611.5F24633179l78685J89399p0953j75934n00564k40898k86332k83241l02086m85992
$$ 624633179 624254494 624443893 624372940 624197006 623696442 623455544 623169212 622885971 622583885 622097893
2621.2F22097893m50249o68106k43187r4337o0044l15056m38766o89621p09152j54419
$$ 622097893 621647644 620979538 620736351 620642014 620581970 620266914 619828148 619138527 618429375 618274956
2630.8F18274956l97377k6169k69699o90651o32477n79338n36766o62117j71356l74756
$$ 618274956 617877579 617851410 617581711 616891060 616258583 615679245 615142479 614480362 614309006 613934250
2640.5F13934250m22554m72756k08625l20206p93610l59344p65152l04794k22054m67644
$$ 613934250 613511696 613038940 612830315 612510109 611716499 611357155 610592003 610287209 610065155 609597511
2650.1F09597511p53250q99505N4397k86178l72544p13272m56123j06049o01158m40330
$$ 609597511 608844261 607944756 607999153 607712975 607340431 606627159 606171036 606064987 605463829 605023499
2659.8F05023499l93830j67923j032295m82941K53792k21023l27950p06673l13987
$$ 605023499 604629669 604461746 603429451 602946510 603200302 602979279 602651329 601944656 601630669
2668.4F01630669m82903k02179l98826k55928j40267j152038l19710r6855J54953k95678
$$ 601630669 601147766 600945587 600546761 600290833 600150566 598998528 598678818 598581963 598736916 598441238
2678.1E98441238j035080p57942k15606K49176p94793l34701k23503k61688j88218
$$ 598441238 597406158 596648216 596432610 596681786 595886993 595552292 595328789 595067101 594878883
2686.8E94878883m83932j15471r78432j88560j01624n38368k66724k37999K62108o87065
$$ 594878883 594394951 594279480 593301048 593112488 593010864 592472496 592205772 591967773 592229881 591542816
2696.4E91542816n77545l16353l18146m27665q57888l16009j40267q583n96771p92274
$$ 591542816 590965271 590648918 590330772 589903107 589045219 588729210 588588943 588580360 587983589 587191315
2706E87191315m82788j50795m97094p92541R7847m92630p35474m66118m28123o16493
$$ 587191315 586708527 586557732 586060638 585268097 585365944 584873314 584137840 583671722 583243599 582627106
2715.7E82627106m63639j49040m32854J99242m57039l53584J8959o27937m29268l16506
$$ 582627106 582163467 582014427 581581573 581780815 581323776 580970192 580989151 580361214 579931946 579615440
2725.3E79615440j75476j040725m93355R804k65694N493o80809l49617k29340k06604
$$ 579615440 579439964 578399239 577905884 577915688 577649994 577655487 576974678 576625061 576395721 576189117
2735E76189117q5296k31896q10012r16100L98483K30255k64091n54237k76528j65939
$$ 576189117 576103821 575871925 575061913 574145813 574544296 574774551 574510460 573956223 573679695 573513756
2744.6E73513756k65351J77689m17366m61807n81513j57890J3504m89159k96745k74467
$$ 573513756 573248405 573426094 573008728 572546921 571965408 571807518 571821022 571331863 571035118 570760651
2754.3E70760651J62277k84233m06609j70669l71170m25225l97758k11334k06261K66380
$$ 570760651 570922928 570638695 570232086 570061417 569690247 569265022 568867264 568655930 568449669 568716049
2763.9E68716049l93753n62019j38130r1591J64680k81753j41564l64837j48964K1591
$$ 568716049 568322296 567760277 567622147 567530556 567695236 567413483 567271919 566907082 566758118 566779709
2773.5E66779709k91901n43556q41293k28386m48113j41258k96059o94809n03959o33927
$$ 566779709 566487808 565944252 565102959 564874573 564426460 564285202 563989143 563294334 562790375 562156448
2783.2E62156448J28212O5537m2992n54619p77588l40576l21388l16887r01947o05202
$$ 562156448 562284660 562350197 562307205 561752586 560974998 560634422 560313034 559996147 559094200 558488998
2792.8E58488998m25338j50948n52521r58328k66075n03159m70047q48541q88672q46863
$$ 558488998 558063660 557912712 557360191 556401863 556135788 555632629 555162582 554314041 553425369 552578506
2802.5E52578506p15065p56835j031876j22681n02243o33316p66411o29844m15497
$$ 552578506 551863441 551106606 550074730 549952049 549449806 548816490 548050079 547420235 547004738
2811.2E47004738q88291l70216q75282q45490p08694p08618q83179j245842o62727
$$ 547004738 546116447 545746231 544870949 544025459 543316765 542608147 541724968 540479126 539816399
2819.8E39816399r38797p93457q95386q68683j019096j106759p02247j398811j198807
$$ 539816399 538877602 538084145 537188759 536320076 535300980 534194221 533491974 532093163 530894356
2828.5E30894356j104927o57578o45180j060409q56056j215134r73473j181678j164551
$$ 530894356 529789429 529131851 528486671 527426262 526570206 525355072 524381599 523199921 522035370
2837.2E22035370j298790j229019j052361j357307j246758j816444j460838j626702
$$ 522035370 520736580 519507561 518455200 517097893 515851135 514034691 512573853 510947151
2844.9E10947151j854324j522255j453972j285629j796074j509133j581382j113663
$$ 510947151 509092827 507570572 506116600 504830971 503034897 501525764 499944382 498830719
2852.6D98830719r64584j312714j211700j586762o87981n19104n95855j185608j591187
$$ 498830719 497866135 496553421 495341721 493754959 493066978 492547874 491952019 490766411 489175224
2861.3D89175224r36508j324730j534614j538353j390114j949310j890526j807900
$$ 489175224 488238716 486913986 485379372 483841019 482450905 480501595 478611069 476803169
2869D76803169k058029j473274j894646k033806k222709k058220k158432k276192k155266
$$ 476803169 474745140 473271866 471377220 469343414 467120705 465062485 462904053 460627861 458472595
2877.7D58472595k453956j642914j560745j137276j561661j872787j073151j397743
$$ 458472595 456018639 454375725 452814980 451677704 450116043 448243256 447170105 445772362
2885.4D45772362r67293p08427k99988q80356r26132k76947q70438n12733k99569M22898
$$ 445772362 444805069 444096642 443796654 442916298 441990166 441713219 440842781 440330048 440030479 440453377
2895.1D40453377j84403r93004o56127o49720k28691l71017J34201m9858p13501j081276
$$ 440453377 440268974 439275970 438619843 437970123 437741432 437370415 437504616 437454758 436741257 435659981
2904.7D35659981o17447m70276r98306j03035q24089q64144j239166j651916o54030
$$ 435659981 435042534 434572258 433573952 433470917 432646828 431782684 430543518 428891602 428237572
2913.4D28237572j179123j386681k187462j779670j552163j669807j200981j773911
$$ 428237572 427058449 425671768 423484306 421704636 420152473 418482666 417281685 415507774
2921.1D15507774j099929j057663j011239j255722o93893k75078r55810j18904m51355
$$ 415507774 414407845 413350182 412338943 411083221 410389328 410114250 409158440 409039536 408588181
2929.8D08588181O0043M55055J54076L47938M97628J133041J113624J590424J856690
$$ 408588181 408648224 409103279 409257355 409605293 410102921 411235962 412349586 413940010 415796700
2938.5D15796700K022972J861915K169571K565880J934471K101708J952171K231598
$$ 415796700 417819672 419681587 421851158 424417038 426351509 428453217 430405388 432636986
2946.2D32636986K011413J777115K287712K452774K317467J912918K253037K032051
$$ 432636986 434648399 436425514 438713226 441166000 443483467 445396385 447649422 449681473
2953.9D49681473K417793J937676J538543K341042K020569K028236J646233K292480
$$ 449681473 452099266 454036942 455575485 457916527 459937096 461965332 463611565 465904045
2961.6D65904045K207604J630439J637116J094970J520119J370506J340828J100655
$$ 465904045 468111649 469742088 471379204 472474174 473994293 475364799 476705627 477806282
2969.3D77806282J495781J283836R22890J921349J574707J566391P34825R89227J682625
$$ 477806282 479302063 480585899 481508789 483430138 485004845 486571236 487306061 488295288 489977913
2978D89977913J576614K030182J168099J491928J479416J152382P94982Q74405J708985
$$ 489977913 491554527 493584709 494752808 496244736 497724152 498876534 499671516 500545921 502254906
2986.7E02254906J265297J419410Q07801R48829J331101R25102J060333O13213O38771
$$ 502254906 503520203 504939613 505747414 506696243 508027344 508952446 510012779 510625992 511264763
2995.3E11264763P74345J060066P79648K17629j63498K84920N78842k78626M273j54915
$$ 511264763 512039108 513099174 513878822 514096451 513932953 514217873 514796715 514518089 514522362 514367447
3005E14367447J9302R3041L23143N24482m28237O8969k19764p60727o30799o4163j3351
$$ 514367447 514386749 514479790 514802933 515327415 514899178 514968147 514748383 513987656 513356857 513292694 513279343
3015.6E13279343q24166q75740q78448j29814m08898p66411j070976p93953K94953
$$ 513279343 512455177 511579437 510700989 510571175 510162277 509395866 508324890 507530937 507825890
3024.3E07825890p61795j277924j223412q41293q00705o18286m84467j128540m15191
$$ 507825890 507064095 505786171 504562759 503721466 502920761 502302475 501818008 500689468 500274277
3033E00274277r05037j160851j131248r11942n92231q24776o40488j231003n76210
$$ 500274277 499369240 498208389 497077141 496165199 495572968 494748192 494107704 492876701 492300491
3041.6D92300491j009483j202888o12412j060181j051941j651382q32710q17299j104164
$$ 492300491 491291008 490088120 489475708 488415527 487363586 485712204 484879494 484062195 482958031
3050.3D82958031j137581j249695n05486j181221j023521j166916j181755j022987
$$ 482958031 481820450 480570755 480065269 478884048 477860527 476693611 475511856 474488869
3058D74488869j015549o54793j216087j058540j230660r00879r97848r60350j095810
$$ 474488869 473473320 472818527 471602440 470543900 469313240 468412361 467414513 466454163 465358353
3066.7D65358353j566849m72756j343078j456795r53216j062355q92029p36389q92449
$$ 465358353 463791504 463318748 461975670 460518875 459565659 458503304 457611275 456874886 455982437
3075.4D55982437j963081j102867p03507p02629r70497j389961j006050j090699n19409
$$ 455982437 454019356 452916489 452212982 451510353 450539856 449149895 448143845 447053146 446533737
3084.1D46533737j381798j110229p79533j238785j162300j809540j102905j222268
$$ 446533737 445151939 444041710 443262177 442023392 440861092 439051552 437948647 436726379
3091.8D36726379q64601p34291r65385p62329j287003p36008o99806n11627j663551
$$ 436726379 435861778 435127487 434162102 433399773 432112770 431376762 430676956 430165329 428501778
3100.5D28501778j605492n87654j377106q73833j276206j176796p83158n69191o89888
$$ 428501778 426896286 426308632 424931526 424057693 422781487 421604691 420821533 420252342 419562454
3109.1D19562454j487655j126595j223183r10377j040077j238480j187248n80979r4757
$$ 419562454 418074799 416948204 415725021 414814644 413774567 412536087 411348839 410767860 410673103
3117.8D10673103j411667j375808r15375j117401j443367q56362q78334j453437q89130
$$ 410673103 409261436 407885628 406970253 405852852 404409485 403553123 402674789 401221352 400332222
3126.5D00332222j159287o65740o27518q88977j054878j369935r93728j047630n52369
$$ 400332222 399172935 398507195 397879677 396990700 395935822 394565887 393572159 392524529 391972160
3135.2C91972160j013527j033706p34596j004372j073685j172905q51517j264266m87633
$$ 391972160 390958633 389924927 389190331 388185959 387112274 385939369 385087852 383823586 383335953
3143.9C83335953o48461j305389q02269p96394p52640j031761m35944j161995j148681
$$ 383335953 382687492 381382103 380579834 379783440 379030800 377999039 377563095 376401100 375252419
3152.5C75252419l88337j129341q12988r92279j241341j544494q54836l71513j039467
$$ 375252419 374864082 373734741 372921753 371929474 370688133 369143639 368288803 367917290 366877823
3161.2C66877823q38051o22597k06680q18138j251373j170769p40013p67060j156616
$$ 366877823 366039772 365417175 365210495 364392357 363140984 361970215 361230202 360463142 359306526
3169.9C59306526m39300n83153o41174j158371q75473p71103j030007k25525j102409
$$ 359306526 358867226 358284073 357642899 356484528 355609055 354837952 353807945 353582420 352480011
3178.6C52480011j122742o81114j12076m48951j113549o98356j119919r03053q22144
$$ 352480011 351357269 350676155 350564079 350115128 349001579 348303223 347183304 346280251 345458107
3187.3C45458107k77939j014290q96530j33743j401787p90749p01484j52550m30984
$$ 345458107 345180168 344165878 343269348 343135605 341733818 340943069 340241585 340089035 339658051
3195.9C39658051j059647o71349j130371o6490o49681p90749m48074q71735o62536
$$ 339658051 338598404 337927055 336796684 336730194 336080513 335289764 334841690 333969955 333307419
3204.6C33307419n60417k65847j059837o74705p22199o01730j66512r86252o05659
$$ 333307419 332747002 332481155 331421318 330746613 330024414 329422684 329256172 328269920 327664261
3213.3C27664261r08051p92427l10974l89824n11513r3994o4163j087723q46748q03452
$$ 327664261 326756210 325963783 325652809 325262985 324751472 324657478 324593315 323505592 322658844 321855392
3222.9C21855392o29539n77202m30450m03176n59692J21098m01650r92832j132755
$$ 321855392 321225853 320648651 320218201 319815025 319255333 319376431 318974781 317981949 316849194
3231.6C16849194k62490p6217k39125j81427j096019m78783n57022n27458m31290n81932
$$ 316849194 316586704 316510487 316271362 316089935 314993916 314515133 313958111 313430653 312999363 312417431
3241.3C12417431n35793o99902J26915n28488m74129n76878r04273o09742n44033K94819
$$ 312417431 311881638 311181736 311308651 310780163 310306034 309729156 308824883 308215141 307671108 307965927
3250.9C07965927k83260k632k70729r82933o37379k74315j6270j109066o81858l48453
$$ 307965927 307682667 307680035 307409306 306426373 305788994 305514679 305498409 304389343 303707485 303359032
3260.5C03359032k57244o82946p15084N10559l10230l46794k36607k2831j74903n30243
$$ 303359032 303101788 302418842 301703758 302214317 301904087 301557293 301320686 301297855 301122952 300592709
3270.2C00592709k74506n05924J92547k37637k10667q55827j374416n2243q6441l8433
$$ 300592709 300318203 299812279 300004826 299767189 299556522 298700695 297326279 297274036 297187595 297149162
3279.8B97149162k52628j78375o21319p44991j65978k98118m34227p05948N9547l32260
$$ 297149162 296896534 296718159 296096840 295351849 295185871 294887753 294453526 293747578 293807125 293474865
3289.5B93474865k98023J76639l13911l7365n36842r09806l23066O76078j19381p48100
$$ 293474865 293176842 293353481 293039570 293002205 292465363 291555557 291232491 291908569 291789188 291041088
3299.1B91041088k96898n74665m18186m66347j91154k87438J50338k05708q44307p2708
$$ 291041088 290744190 290169525 289751339 289284992 289093838 288806400 288956738 288751030 287906723 287834015
3308.8B87834015m19045j14059k87437l15114k98614n93338m02203o69937m310k03648
$$ 287834015 287414970 287300911 287013474 286698360 286399746 285806408 285404205 284734268 284729958 284526310
3318.4B84526310l97415q06370q55942j92051k0446M79183j72177k49557p84702o99749
$$ 284526310 284128895 283322525 282466583 282274532 282254086 282733269 282561092 282311535 281526833 280827084
3328.1B80827084k03495p13444m61884p03678m28924o04649J25866J13048o97498j38702
$$ 280827084 280623589 279910145 279448261 278744583 278315659 277711010 277836876 277949924 277252426 277113724
3337.7B77113724p40528k11544m32110q00724n07164k82650L5438o71196l90396k87838
$$ 277113724 276373196 276161652 275729542 274928818 274421654 274139004 274174442 273503246 273112850 272825012
3347.3B72825012R4834o44513j167087j93138m0875M20609l19844q39347q31910n3901
$$ 272825012 272919846 272275333 271108246 270915108 270874233 271294842 270974998 270135651 269303741 269249840
3357B69249840L20606q64658j229630q51421J06773k91767j00594l3168p95861o45065
$$ 269249840 269570446 268705788 267476158 266624737 266731510 266439743 266339149 266305981 265510120 264865055
3366.6B64865055m28257J66569j21460J8597q32062m75750L40118r41410k22034j42308
$$ 264865055 264436798 264603367 264481907 264500504 263668442 263192692 263532810 262591400 262369366 262227058
3376.3B62227058k11124o33507o68754Q7680m74414j54190j08109J37577o16627q88290
$$ 262227058 262015934 261382427 260713673 260801353 260326939 260172749 260064640 260202217 259585590 258697300
3385.9B58697300k8801j39923j55335m50820J33991J77574j20430p18803o65780K44713
$$ 258697300 258668499 258528576 258373241 257922421 258056412 258233986 258113556 257394753 256728973 256973686
3395.6B56973686K3709o6567m44221k42234k87666M978O8150k64454j3065m78096P0724
$$ 256973686 256997395 256930828 256486607 256244373 255956707 255961685 256029835 255765381 255752316 255274220 255344944
3406.2B55344944n14221j21308L24288l19634L64247j81847j78051n99365k92378K66190
$$ 255344944 254830723 254709415 255033703 254714069 255078316 254896469 254718418 254119053 253826675 254092865
3415.8B54092865O5708J22090l11280L92494m42504l26214L16009j12018J75285L03192
$$ 254092865 254158573 254280663 253969383 254361877 253919373 253593159 253909168 253797150 253972435 254275627
3425.5B54275627M31023n34687j38951J43052J41296m5166m92306L77598K93446N94158
$$ 254275627 254706650 254171963 254033012 254176064 254317360 254272194 253779888 254157486 254450932 255045090
3435.1B55045090j36776K9526M63008j89552j28231k29835O79435j23138K71454J73855
$$ 255045090 254908314 254937840 255400848 255211296 255083065 254853230 255532665 255409527 255680981 255854836
3444.7B55854836l49923R43795k65122L27110O22597M99287M38556J05248L93238j56765
$$ 255854836 255504913 256448708 256183586 256510696 257133293 257632580 258071136 258176384 258569622 258412857
3454.4B58412857N06077K21805K00348M7112J02424R05514J94988J76869l41950J75496
$$ 258412857 258918934 259140739 259341087 259388199 259490623 260396137 260591125 260767994 260426044 260601540
3464B60601540R12723R86653M09050j3619Q51460k01626n1289Q82282Q26168K77195
$$ 260601540 261514263 262500916 262909966 262896347 263747807 263546181 263494892 264377174 265203342 265480537
3473.7B65480537l20549N4875N76191P84435k17571K76260Q49209N66845j54209n73368
$$ 265480537 265159988 265214863 265791054 266575489 266357918 266634178 267483387 268050232 267896023 267322655
3483.3B67322655J018123P33643M97932N27363M69532M03691O26182J473942J29261
$$ 267322655 268340778 269074421 269572353 270099716 270569248 270972939 271599121 273073063 273202324
3492B73202324m673K98653N78041N18551k08092P27443N67646N41058M60587O20365
$$ 273202324 273197651 273496304 274074345 274592896 274384804 275112247 275679893 276220951 276681538 277301903
3501.6B77301903O75258R9755L29704M54235O01597K61173J317635O58397m05025Q68492
$$ 277301903 277977161 278076916 278406620 278860855 279462452 279723625 281041260 281699657 281294632 282163124
3511.3B82163124O01750P90519P15218J068020P04536J97888M26769m04320O6242Q17433
$$ 282163124 282764874 283555393 284270611 285338631 286043167 286241055 286667824 286263504 286329746 287147179
3520.9B87147179J448421N18570l01189Q61549Q16822M79775K41546J029339N96962
$$ 287147179 288595600 289114170 288812981 289674530 290491352 290971127 291212673 292242012 292838974
3529.6B92838974K96326N07259O62003J205291O01960Q61740n4207l30372J489906
$$ 292838974 293135300 293642559 294304562 295509853 296111813 296973553 296919346 296588974 298078880
3538.3B98078880J141777J40725O07833J622868R14192Q86364K08607k93980J026078
$$ 298078880 299220657 299361382 299969215 301592083 302506275 303392639 303601246 303307266 304333344
3547C04333344J60427J652965J921387J053276O95133j048202L31745R48963J640148
$$ 304333344 304493771 306146736 308068123 309121399 309816532 308768330 309100075 310049038 311689186
3555.6C11689186J792164M74987J420612J440659M99592O41098J955929J232090K91442
$$ 311689186 313481350 313956337 315376949 316817608 317317200 317958298 319914227 321146317 321437759
3564.3C21437759K245179p05758l23066J662826j602K554665J626167J371651K027206
$$ 321437759 323682938 322977180 322654114 324316940 324315338 326870003 328496170 329867821 331895027
3573C31895027J447563Q69561J014175J795578O92101K156066J710205P06292K244072
$$ 331895027 333342590 334212151 335226326 337021904 337714005 339870071 341580276 342286568 344530640
3581.7C44530640J843300J035308j69525L578835K611084k054901J627845n69992L721352
$$ 344530640 346373940 347409248 347239723 350818558 353429642 351374741 353002586 352432594 356153946
3590.4C56153946L971329K530517P35626m5509L620033j439018K212563L320961m01688
$$ 356153946 360125275 362655792 363391418 363345909 366965942 365526924 367739487 371060448 370658760
3599C70658760K919540Q96645J543961K852134K096176J925469K362900K027473j033897
$$ 370658760 373578300 374474945 376018906 378871040 380967216 382892685 385255585 387283058 386249161
3607.7C86249161L274688q36257K09083P203102O68450j443787M636230M15459L311615
$$ 386249161 389523849 388687592 388896675 396099777 396768227 395324440 399960670 400376129 403687744
3616.4D03687744M487534j1368R80530p73583J811905L911019K219276K404289K424698
$$ 403687744 408175278 408163910 409144440 408370857 410182762 414093781 416313057 418717346 421142044
3625.1D21142044K364502K581215N632019k433357j2205887O457024O267547N943375
$$ 421142044 423506546 426087761 431719780 429286423 417080536 423537560 429805107 435748482
3632.8D35748482J474838j370468K865715L267860K475891K1439J369782K187805K115402
$$ 435748482 437223320 435852852 438718567 441986427 444462318 444483757 445853539 448041344 450156746
3641.5D50156746J311951L82080K580299L490639N145569l347664n016747N772248
$$ 450156746 451468697 451850777 454431076 457921715 463067284 459719620 454702873 460475121
3649.2D60475121j080628j921387L330384P008438L810692L197479L902893p796364
$$ 460475121 459394493 457473106 460803490 467811928 471622620 474820099 478722992 470926628
3656.9D70926628K935753N983925J695328J713790R70116J501618Q01887J677017K273827
$$ 470926628 473862381 479846306 481541634 483255424 484225540 485727158 486529045 488206062 490479889
3665.6D90479889J117630M032936K455254j884194r52606n287476L897095Q823357
$$ 490479889 491597519 495630455 498085709 496201515 495248909 489961433 493858528 502681885
3673.3E02681885Q738746j206436j9314232M310036Q447647N353012j293373P10068
$$ 502681885 511420631 510214195 490899963 495209999 503657646 509010658 507717285 508427353
3681E08427353L332176J791229K015572P13768M00925L781929M279060j1210632j396408
$$ 508427353 511759529 513550758 515566330 516280098 516681023 520462952 524742012 513531380 512134972
3689.7E12134972R875946m740754J333733N899620J339340K058831K95448K18162J391755
$$ 512134972 522010918 517270164 518603897 524503517 525842857 527901688 528197136 528415298 529807053
3698.4E29807053N87997K290649K984848m975776j936569N804519J664849N23147R05304
$$ 529807053 530395050 532685699 535670547 530694771 528758202 534562721 536227570 536750717 537656021
3707E37656021K168961L127937q161354L626175K647285j2384224O183472M790917
$$ 537656021 539824982 542952919 534791565 538417740 541065025 528680801 534864273 539655190
3714.8E39655190P49359J880035L028336J909103k741013P89681O630707l496094n081749
$$ 539655190 540404549 542284584 545312920 547222023 544481010 545270691 551901398 548405304 543323555
3723.4E43323555N579834P88078m41398l308297J172219N332680J017684M790612m942551
$$ 543323555 548903389 549691467 549250069 545941772 547113991 552446671 553464355 558254967 553312416
3732.1E53312416p289619J0744438J294174j1778107O50940L469963J272545L118820
$$ 553312416 546022797 556767235 558061409 546283302 546934242 550404205 551676750 554795570
3739.8E54795570K871209l306656L508415J1073570j5140991j5581093J2545815P182388
$$ 554795570 557666779 554360123 557868538 568942108 553801117 538220024 550765839 557948227
3747.5E57948227P019615l418960j1510582R712677o344147n295143Q044395N811958
$$ 557948227 564967842 561548882 550038300 559750977 553406830 548111687 556156082 561968040
3755.3E61968040K212487n522042K793427O000404q026504j637345M643593J310654
$$ 561968040 564180527 558658485 561451912 567452316 559425812 557788467 562432060 563742714
3763E63742714Q72917L503571l421364m726639M208679N708809o447r124260K244950
$$ 563742714 564615631 568119202 564697838 559971199 564179878 569888687 569882240 560757980 563002930
3771.7E63002930L810730O05735J648484l42522M49181L84292K628670L30887q734398
$$ 563002930 566813660 567419395 569067879 568725357 569174538 569558830 572187500 572518387 563783989
3780.3E63783989L185730K314873M66499K834053k910500l52172J593666J451645O36215
$$ 563783989 566969719 569284592 569751091 572585144 569674644 569322472 570916138 572367783 573003998
3789E73003998J907J316338n51682N02243P1259J694031L828926m158745n073090J394043
$$ 573003998 573005905 574322243 573770561 574272804 574344063 576038094 579867020 575708275 570635185 572029228
3798.7E72029228M762421N060882o564674q453751M479142L504295M452171O498070
$$ 572029228 576791649 581852531 575287857 566834106 571313248 574817543 579269714 585767784
3806.4E85767784j0884514n209999O247788L377876L59306r9945M54025O99959M880181
$$ 585767784 574883270 569673271 575921059 579298935 579658241 579558296 580012321 580712280 585592461
3815.1E85592461j868477j3414612N670586N362663L852615m8065j6383781M563369
$$ 585592461 583723984 570309372 575979958 581342621 585195236 585147171 568763390 573326759
3822.8E73326759O522599K001609K520066p7668m714317P20902K988319M400711Q22411
$$ 573326759 579849358 581850967 584371033 584293365 579579048 580299950 583288269 587688980 588511391
3831.4E88511391j0168190K880935P186890o515350o81076R121627r033393l791123
$$ 588511391 578343201 581224136 588411026 581895676 581214600 590336227 581302834 577511711
3839.2E77511711R607048o277580n30930P876816k044906m379006K982979J923981
$$ 577511711 587118759 580841179 580310249 588187065 586142159 581763153 584746132 586670113
3846.9E86670113O12335J513290j924553J563874N126571o102791P10907j5162429
$$ 586670113 587282448 588795738 586871185 588435059 593561630 587458839 588169746 573007317
3854.6E73007317J941261J1825333O17637j707001K379876K206077L000984o067161
$$ 573007317 574948578 586773911 587391548 585684547 588064423 590270500 593271484 587204323
3862.3E87204323q5449P924652p289658n658417M109345N915413P531395q956795j1028709
$$ 587204323 587118874 595043526 587753868 582095451 586204796 592120209 599651604 590694809 579666100
3871E79666100M488105P668305L936119r028969J443596L818588l92761J784325L582840
$$ 579666100 584154205 591822510 595758629 586729660 588173256 591991844 591599083 593383408 596966248
3879.7E96966248o566353o339493O647720J720658Q50448N307846j1771965P41654
$$ 596966248 590399895 584060402 590708122 592428780 593279228 598587074 586815109 587556763
3887.4E87556763N064087N59463L882179j182098q370705K953835M064255j439133
$$ 587556763 592620850 593180313 597062492 595880394 587509689 590463524 594527779 593088646
3895.1E93088646M26102N94673J786461K240791r515953N239296K734566o824494N530434
$$ 593088646 593514748 594109421 595895882 598136673 588620720 593860016 596594582 589770088 595300522
3903.8E95300522l443031k043915P67784J378021L016853m34112J316872J04179r2392
$$ 595300522 591857491 589813576 590581360 591959381 594976234 594542122 595858994 595963173 595870781
3912.5E95870781l04642j181946J639901J831245k201652l540917M356117M06914m420929
$$ 595870781 595566139 594384193 596024094 597855339 595653687 592112770 596468887 596875801 592454872
3921.1E92454872L171425K029877M10461k856979k231026K489815J789856J524238
$$ 592454872 595626297 597656174 598066635 595209656 592978630 595468445 597258301 598782539
3928.8E98782539q83216o61927J292839k510376j050949K374192l88299r4032J271439
$$ 598782539 597899323 597237396 598530235 596019859 594968910 597343102 596954803 596860771 598132210
3937.5E98132210j323090l41034K55127J776047K099113m314804j194076J786880J124268
$$ 598132210 596809120 596468086 596723213 598499260 600598373 596283569 595089493 596876373 598000641
3946.2E98000641J017189j933975J77765N41801j667824K307549J049919j366921M88434
$$ 598000641 599017830 597083855 597261620 597803421 596135597 598443146 599493065 598126144 598614578
3954.9E98614578M9668k42310m98390L03993J67160j11160M86603r21746N77736J060486
$$ 598614578 598664246 598421936 597923546 598227539 598394699 598283539 598770142 597848396 598426132 599486618
3964.5E99486618K42195k93770n09491O54908n53742k29225R01947L44543k72598n9395
$$ 599486618 599728813 599435043 598925552 599580460 599026718 598797493 599699440 600043983 599771385 599711990
3974.2E99711990K00196o67420j05133L87459P97005L81660j06354J57013n52826N2109
$$ 599711990 599912186 599244766 599139633 599527092 600324097 600705757 600599403 600756416 600203590 600255699
3983.8F00255699L28789J44310l1548o24542o88324N81322R49859j33171M36287j91650
$$ 600255699 600584488 600728798 600697250 600072708 599384384 599965706 600915565 600782394 601218681 601027031
3993.5F01027031k13623k5978j53580O67420K51503M91142k20909
$$ 601027031 600813408 600787430 600633850 601301270 601552773 602043915 601823006
4000.2F01823006
$$ 601823006
##END=$$ End of the data block
