##TITLE=$$ Begin of the data block
##JCAMP-DX=5.00 $$ ACD/SpecManager v 10.08
##SPECTROMETER/DATA SYSTEM=Varian
##DATE=20 Nov 2012 15:26:42
##DATA TYPE=INFRARED SPECTRUM
##DATA CLASS=XYDATA
##ORIGIN=
##OWNER=
##NPOINTS=3735
##FIRSTX=399.26403809
##LASTX=4000.35498047
##MAXX=4000.35498047
##MINX=399.26403809
##MAXY=72.49568939
##MINY=20.60350990
##XFACTOR=1.0000000000
##YFACTOR=0.000000100000000
##FIRSTY=51.51821899
##DELTAX=0.96440572
##XUNITS=1/CM
##YUNITS=TRANSMITTANCE
##XYDATA=(X++(Y..Y))
399.3E15182190K5459061m0412026p096786j2765503J768303N311088K529488Q185425
407D98161240q780785l999596o422615J48621m61426L29704r25407Q91838P835808
415.7D86777382o831780p877616j8395768J3326073J1881027L327561N168724n467682
423.4D81907921J563949o776962j120491j472320j420594j210518n337219L198815
431.1D69332581k614251M571228l221511n220948J837998n851364J242714J135101
438.8D61211548M882622j490631k657700L69415L096009R390907J501617O428490l430710
447.5D79301567k057304L393287L5515k55432k738571N135040l023376K93197J753388
456.2D81837311n250817k127533K137604M975701m35830L802453K434043j745071q004913
$$ y = [515182190, 540641251, 500229225, 493132439, 480366936, 482135239, 487446327, 489975815, 498161240, 489380455, 485380859, 478958244, 479106865, 478645439, 478975143, 478049736, 478941574, 486777382, 479945602, 472067986, 453672218, 466998291, 478879318, 482206879, 487375603, 481907921, 483471870, 476694908, 475574417, 474102097, 472681503, 471470985, 466133766, 469332581, 466718330, 471289558, 468068047, 462847099, 464685097, 458833733, 460076447, 461211548, 466094170, 464603539, 461945839, 462315254, 465411263, 474802170, 476303787, 482732277, 479301567, 477244263, 480637550, 480673065, 480417633, 477679062, 482814102, 479790726, 480083923, 481837311, 476586494, 474458961, 476596565, 481572266, 481136436, 484938889, 487372932, 485627861, 477622948]
464.8D77622948o727257M953651k75230J093445k272263m028511n084724p81212L861351
473.5D68362198m692764O62117j299706k44484p90176j364861k662163k919502L339844
482.2D58390503j757736J118850k66799J543426J019516k382584k19726m382935K186356
490.9D55248871o8665m06761R3689k790527j111107j156311M321861j846619k891006
499.6D49393425k286034k803154q43429l401299J787148Q29162M62532l195076m154663
508.2D35788612o12945O21376Q03757k873002o94656m032593m129944k748909j981048
516.9D20140648K881889j141243l605995m156189K75879l70255k148551k276230k433663
525.6D07166290L100891q59565j345330m72221j235962R8801K187423K988167p28988
$$ y = [477622948, 470895691, 475849342, 475574112, 476667557, 474395294, 470366783, 465282059, 464500847, 468362198, 463669434, 464331551, 463031845, 462787361, 461997185, 460632324, 457970161, 455050659, 458390503, 456632767, 457751617, 457484818, 459028244, 460047760, 457665176, 457445450, 453062515, 455248871, 455180206, 454773445, 454867134, 452076607, 450965500, 449809189, 454131050, 452284431, 449393425, 447107391, 444304237, 443460808, 440059509, 441846657, 442675819, 443138351, 439943275, 435788612, 435175667, 435797043, 436600800, 433727798, 433033142, 429000549, 424870605, 422121696, 420140648, 423022537, 421881294, 418275299, 414119110, 414394989, 414024734, 411876183, 409599953, 407166290, 410267181, 409407616, 408062286, 407590065, 406354103, 406452904, 408640327, 411628494, 410899506]
534.3D10899506J045990J783638P87506J921768K851677K609672N03922L813095O545563
543D32762337K190246m055786n87959J711502j61705J595230j00937J672402k920762
551.6D32104568m187545M60090L56255l81126m031754k061844j243706p14035m05121
560.3D19895782k098312l169632m586182j943664l269463k490654k903518l680916
568C95753441l538094l528328L26920j893082j778946j698227j311378J07460M33655
576.7C82873421K987175Q87489R97696J691780J897507L487396L616714L549004K256470
585.4D04244652L272400L635482L251153J526985Q76999K009925j2970J028786J910858
594.1D21744270R45473j679039n56450R75495m45366J496276o8244o57998l24325p18651
$$ y = [410899506, 411945496, 413729134, 414516640, 416438408, 419290085, 421899757, 422403679, 426216774, 432762337, 434952583, 430896797, 430308838, 432020340, 431858635, 433453865, 433352928, 435025330, 432104568, 427917023, 428377113, 428733368, 428352242, 424320488, 422258644, 421014938, 420300903, 419895782, 417797470, 414627838, 410041656, 408097992, 404828529, 402337875, 399434357, 395753441, 392215347, 388687019, 389013939, 387120857, 385341911, 383643684, 382332306, 382439766, 382873421, 385860596, 386748085, 387745781, 389437561, 391335068, 394822464, 398439178, 401988182, 404244652, 407517052, 411152534, 414403687, 415930672, 416807671, 418817596, 418804626, 419833412, 421744270, 422689743, 421010704, 420454254, 421429749, 420984383, 422480659, 422412415, 421754417, 421430092, 420711441]
603.7D20711441j227913o72684J312638n02739m95644q19893P44515J353035O56738
612.4D21059494J907578L31878J120300J028557J927605J312714Q3809J542663O05774
621.1D30920372J875000K322617L128891K034454P35207K101097J217613J324577J411019
629.8D47070847J993751n08842l30506J548805J043625L019638J340943P06940l20321
638.4D55564880p04574L70407O31676J162223O3935Q84361k25220J124077J177178
647.1D60048943L57208J616630q09936M36630P52182J381607J217308N51834N05944
655.8D66058350j219445L26424m46777n21775m23431Q58078R06410l1929J144600m7836
665.4D66602669K194328M399757J2521401n769730p352028p18803J24931M45404J149025
$$ y = [420711441, 419483528, 418810844, 420123482, 419620743, 419125099, 418305206, 419049721, 420402756, 421059494, 422967072, 423298950, 424419250, 425447807, 427375412, 428688126, 428771935, 430314598, 430920372, 432795372, 435117989, 438246880, 440281334, 441016541, 443117638, 444335251, 445659828, 447070847, 449064598, 448555756, 448225250, 449774055, 450817680, 453837318, 455178261, 455885201, 455564880, 454860306, 455230713, 455862389, 457024612, 457088547, 457972908, 457747688, 458871765, 460048943, 460406151, 462022781, 461212845, 461649475, 462401657, 463783264, 465000572, 465552406, 466058350, 464838905, 465165329, 464718552, 464196777, 463773346, 464631424, 465537834, 465505905, 466650505, 466602669, 468796997, 473196754, 485718155, 479948425, 472596397, 471877594, 472002525, 472447929, 473596954]
674.1D73596954J760331N43136M20799K174836n49889J25618n82123N56488J815109
682.8D79861259Q75321J409874J7166N75485k85110j93215p29103l93142l2502j307029
692.4D79799004L70636l14103n93872j898346j801986r92813j530610j988410k998581
701.1D68050919m26827j418114j733360o73942p76673l08189j076813O1722o03829
709.8D61094894M3221Q14934J533928K370338J354637J711884J169090J945305J018448
718.5D73056679K282791M214821K607803K554512R76753J853753K999610L648606K052345
727.2D96247673J078453L430290K111931K013474J557808J734733R15985J224823K645035
735.8E12960205Q85010K075767R06792N99899l27415n88799N10750j389351l91082
$$ y = [473596954, 475357285, 475900421, 476321220, 478496056, 477946167, 478071785, 477489662, 478046150, 479861259, 480736580, 482146454, 482163620, 482739105, 482453995, 482260780, 481531677, 481138535, 481106033, 479799004, 480169640, 479855537, 479261665, 477363319, 475561333, 474568520, 473037910, 471049500, 468050919, 467624092, 466205978, 464472618, 463798676, 463022003, 462713814, 461637001, 461698723, 461094894, 461138115, 461953049, 463486977, 465857315, 467211952, 468923836, 470092926, 472038231, 473056679, 475339470, 479554291, 482162094, 484716606, 485693359, 487547112, 490546722, 494195328, 496247673, 497326126, 500756416, 502868347, 504881821, 506439629, 508174362, 509090347, 510315170, 512960205, 513845215, 515920982, 516827774, 517427673, 517100258, 516511459, 517022209, 515632858, 515241776]
744.5E15241776j200104j209030j491661n09110P00722j253853l314133n038604j937256
753.2D99988747k008057j735382k140579m021416k487030k047958j94130j541291j666221
761.9D82146683j984749j495857J358795M16221J138268O97899J650772J656456J720428
770.6D87304916L308525L103714M646683K735634L063164M055862M224892M182434
778.3E16625824K349129L920974L590622L879433K930527J618957J256943J669769
786E37842178L022881J039238K003479J577568K039185J993370J056823K545967Q34465
794.7E53955154J181488J354790K717972K015686P35207J776313J708832L157311J128692
803.4E69731445J529694J956329J059037K09350O3667K313919L77884M23775R8610
$$ y = [515241776, 514041672, 512832642, 511340981, 510831871, 511532593, 510278740, 506964607, 501926003, 499988747, 497980690, 496245308, 494104729, 490083313, 487596283, 485548325, 485354195, 483812904, 482146683, 480161934, 478666077, 480024872, 480441093, 481579361, 482277260, 483928032, 485584488, 487304916, 490613441, 493717155, 498363838, 501099472, 504162636, 508218498, 512443390, 516625824, 518974953, 522895927, 526486549, 530365982, 533296509, 534915466, 536172409, 537842178, 540865059, 541904297, 543907776, 545485344, 547524529, 549517899, 550574722, 553120689, 553955154, 555136642, 556491432, 559209404, 561225090, 561960297, 563736610, 565445442, 568602753, 569731445, 571261139, 573217468, 574276505, 574485855, 574549522, 576863441, 577241325, 577665100, 577763710]
812E77763710Q98933J386185N17197Q42209p86820M79851l18451M24767k35291j400909
821.7E79571381J43928r76448m62837j439934o87790j190872j629181q07800j007309
830.4E71513138j555367m479751k675591k532120j836090j549949l007241k546310
838.1E51330719l388901j265983j689911j702309k306785k023964m58260k246017j655999
846.8E34592590k313499p88841r85909j902428p37838j760788k449951l319321j535721
855.4E18798294j818466j694870j601601j757049q09594j468849R46122J078872K404938
864.1E14077797L988991M393806N321465M102211N386390M765969M738846M268264
871.8E51043739L893242M610100L048019K859803J293029J621933M11301q4762n44243
$$ y = [577763710, 578662643, 580048828, 580566025, 581408234, 580621414, 581101265, 580782814, 581207581, 580972290, 579571381, 579715309, 578738861, 578276024, 576836090, 576148300, 574957428, 573328247, 572520447, 571513138, 569957771, 565478020, 562802429, 560270309, 558434219, 556884270, 553877029, 551330719, 547941818, 546675835, 544985924, 543283615, 540976830, 538952866, 538494606, 536248589, 534592590, 532279091, 531490250, 530504341, 528601913, 527864075, 526103287, 523653336, 520334015, 518798294, 516979828, 515284958, 513683357, 511926308, 511116714, 509647865, 510593987, 511672859, 514077797, 518066788, 522460594, 527782059, 531884270, 537270660, 542036629, 546775475, 551043739, 554936981, 559547081, 562595100, 565454903, 566747932, 568369865, 568781166, 568696404, 568152161]
880.5E68152161k131043r96780k844086l095436l765984k578964k418213k972946j096153
889.2E46252556k182350j709175k284279j922608k259826k021981j152954j894989
896.9E30824394l88641j589241j614189k108498j817169j498947k979737j789665k434158
905.6E14604149l130074m437027l684539k670823k878379l658905n802727m681664
913.3D83660011m203491l863029m621010m718857m388886m198265l020668l728218
921D50917587k599220k657928j207772r2125j468544r49516l67165L69835m07486N15023
930.7D42052689K71797M11300J892472Q53386K014808J722298J688652J808586K069702
939.3D54785690K874031J718331K378273J974869J599121L76625J7204j64413k301255
$$ y = [568152161, 566021118, 565024338, 562180252, 559084816, 555318832, 552739868, 550321655, 547348709, 546252556, 544070206, 542361031, 540076752, 538154144, 535894318, 533872337, 532719383, 530824394, 530435753, 528846512, 527232323, 525123825, 523306656, 521807709, 518827972, 517038307, 514604149, 511474075, 507037048, 503352509, 500681686, 497803307, 494144402, 488341675, 483660011, 479456520, 475593491, 470972481, 466253624, 461864738, 457666473, 454645805, 450917587, 448318367, 445660439, 444452667, 444360542, 442891998, 441942482, 441575317, 441945152, 441537666, 442052689, 442324486, 442735786, 444628258, 445481644, 447496452, 449218750, 450907402, 452715988, 454785690, 457659721, 459378052, 461756325, 463731194, 465330315, 465706940, 465724144, 465559731, 463258476]
948D63258476k263031m037018m619865m589386n032997n825844o457634n781288o685486
956.7D17965927o673126p021294p041931p097015o994362p259636p682571p092934
964.4C61103058p837982p549401p739639p472954o971588p645683q930950q624420
972.1B98330441p609272q437558p337837p248192p472324p150116o042824n705032
979.8B41327286n974159m714776n034866l943443l626156k798863k385673k181397
987.6B10667953j359539j829032k10305p80105m53873K50473L06473J18427l10001
996.2B06400471P64656n6553J066112N90382O3286Q80718J072197P14722j393051k87819
1005.9B09815121k37866O70033M03099p98359o6490j170769j22070p07646k59685J44539
$$ y = [463258476, 460995445, 456958427, 452338562, 447749176, 442716179, 436890335, 430432701, 424651413, 417965927, 411292801, 404271507, 397229576, 390132561, 383138199, 375878563, 368195992, 361103058, 353265076, 345715675, 337976036, 330503082, 323531494, 315885811, 306954861, 298330441, 290721169, 282283611, 274945774, 267697582, 260225258, 253075142, 247032318, 241327286, 235353127, 230638351, 225603485, 221660042, 218033886, 215235023, 212849350, 210667953, 209308414, 207479382, 207269077, 206488972, 206035099, 206285572, 206592045, 206710472, 206400471, 207165127, 207108574, 208174686, 208765068, 208828354, 209709072, 210781269, 211495991, 210102940, 209815121, 209577255, 210247288, 210650387, 209852028, 209785538, 208614769, 208492699, 207785053, 207525368, 207669907]
1015.5B07669907M13742R57336m41666P77245K92149M56791O57691J690674J578274
1024.2B14052143L03249J508275J231613K243023N47676N93013J176396R33132K082443
1032.9B24670963P26319K057323O68068P32670J403122K99511M20398j027698N64156
1041.6B30514832M50897N83343j4953m59404Q55655Q59871J367188l31841O58684J038704
1051.2B35522976J781311K130585K075958K571068j25275K793655L462563K971535
1058.9B53184376M262085L585357L497506K882156M380131M382992M992198M369507
1066.6B85536308K707997J825790j283436k827911l753262l503074n618973n659084
1074.4B67424355l770161l588009j872940k453213o24943n19332L81145P32937N1594
$$ y = [207669907, 208083649, 209040985, 208599319, 209376564, 209668713, 210125504, 210783195, 212473869, 214052143, 214355392, 215863667, 217095280, 219338303, 219885979, 220478992, 221655388, 222588520, 224670963, 225397282, 227454605, 228122673, 228855343, 230258465, 230557976, 230978374, 229950676, 230514832, 230965729, 231549072, 231534119, 231074715, 231930370, 232790241, 234157429, 233825588, 234484272, 235522976, 237304287, 239434872, 241510830, 244081898, 243956623, 246750278, 250212841, 253184376, 257446461, 261031818, 264529324, 267411480, 271791611, 276174603, 281166801, 285536308, 288244305, 290070095, 288786659, 285958748, 282205486, 278702412, 273083439, 267424355, 263654194, 260066185, 258193245, 255740032, 255115089, 254595757, 254976902, 255709839, 255761433]
1083B55761433J318779M65278K410221J363736J214695J833076K304440K995452J338559
1091.7B71005669L187694K309284K144032K470245K420731K096538Q59375K076550
1099.4B88570118J46675L23219K72599M14962J203499m10175N30300L70064O36139
1108.1B92057400O65531K032165K323952J210442K035599J812610K071953O15902J272888
1116.8C06098442J596241J373425K031650M65584J042595P71732J310959J129208O44149
1125.5C16463985J323224J037483J726303J262741K394714K336960K253952K752648
1133.2C31552010J394844O96411k17781N78918k97928j623268k429848l005104k800712
1141.9C23847542m024944k938500l311176l761769l838882l436985k701855l089542
$$ y = [255761433, 257080212, 257545490, 259955711, 261319447, 262534142, 264367218, 266671658, 269667110, 271005669, 274193363, 276502647, 278646679, 281116924, 283537655, 285634193, 286493568, 288570118, 288716793, 289040012, 289312611, 289727573, 290931072, 290520897, 291051197, 291421261, 292057400, 292722931, 294755096, 297079048, 298289490, 300325089, 302137699, 304209652, 304825554, 306098442, 307694683, 309068108, 311099758, 311565342, 312607937, 313379669, 314690628, 315819836, 316463985, 317787209, 318824692, 320550995, 321813736, 324208450, 326545410, 328799362, 331552010, 332946854, 333643265, 333425484, 334004402, 333706474, 332083206, 329653358, 326648254, 323847542, 319822598, 316884098, 313572922, 309811153, 305972271, 302535286, 299833431, 296743889]
1149.6B96743889j787090k308979j745492j992187j372929m75521o57634N17940q0490
1158.3B86841507P65285J44749N01022Q07820R08108K323265K026233L188534K459335
1166.9B99965858K921505L745156M185543M698963M632397O086540N394592N720558
1174.6C37351112N651322N421371N854531N234031N982056N890999N566253N648079
1182.4C82599754N889244N536461M870987M970055M360390M508132M035759K869034
1190.1D19639816K944374K721329K846603K425347J744919J322288P25594O00891K79350
1198.8D35250511N32189R87968J116219K66990L22876J221352J108169J234971R80186
1207.4D43021431J313744J448631Q81233J251297K256546K508812K149162K635537
$$ y = [296743889, 294956799, 292647820, 290902328, 288910141, 287537212, 287061691, 286404057, 286921997, 286841507, 287606792, 287751541, 288252563, 289060383, 289968491, 292291756, 294317989, 297506523, 299965858, 302887363, 306632519, 310818062, 315517025, 320149422, 326235962, 331630554, 337351112, 343002434, 348423805, 354278336, 359512367, 365494423, 371385422, 376951675, 382599754, 388488998, 394025459, 398896446, 403866501, 408226891, 412735023, 416770782, 419639816, 422584190, 425305519, 428152122, 430577469, 432322388, 433644676, 434370270, 434971161, 435250511, 435782700, 436770668, 437886887, 438153877, 438476753, 439698105, 440806274, 442041245, 443021431, 444335175, 445783806, 446665039, 447916336, 450172882, 452681694, 454830856, 457466393]
1215.1D57466393J691398J268120K088203J649857J529045J070671O42243L18832N46265
1223.8D68271027K23693n58204k78549p65191n73272n08957l97263q48846j248894
1232.5D63315544n33142j047287j084938q85735m22668m67339o94770m95110n84412
1241.2D57100143j56402l6202L95203J67732J64528M02641J35689O86264R51691Q35991
1250.8D60647278M98543J076469J199837J068115J176376L42293P16171O22216N36956
1259.5D67884254M85001J4649J92909J54457P09648P08771R69467R58900Q64830J032524
1269.2D73975410Q33588J229744O61964P48711O07453L76548M51775J74026N52826
1277.8D79612045k35481l83377q58154o78292j77459m63295J02157n18875p7515k30026
$$ y = [457466393, 459157791, 460425911, 462514114, 464163971, 465693016, 466763687, 467405930, 467724762, 468271027, 468494720, 467936516, 467657967, 466892776, 466319504, 465810547, 465413284, 464564438, 463315544, 462782402, 461735115, 460650177, 459764442, 459341774, 458874435, 458179665, 457684555, 457100143, 456943741, 456907539, 457302742, 457470474, 457635002, 458037643, 458173332, 458859596, 459811287, 460647278, 461145821, 462222290, 463422127, 464490242, 465666618, 466008911, 466725082, 467347298, 467884254, 468369255, 468383904, 468576813, 468731270, 469440918, 470149689, 471119156, 472078056, 472942886, 473975410, 474808998, 476038742, 476700706, 477449417, 478056870, 478433418, 478885193, 479059219, 479612045, 479376564, 478993187, 478135033, 477456741, 477279282, 476815987, 476918144, 476399269, 476321754, 476091728]
1287.5D76091728o29234k05956n30738o07987r72633m62113o75583o58340p54242j093559
1297.1D69501343o89430r34296o97861q56857o77643j144028q64792j07955q17070
1305.8D62711411q53959j111679n27725n96390q46786n23796q10166q60366p46727
1314.5D55833817J08222n06553p75337n16129q94775m24156p02706q87375q14667q16383
1324.1D49603958j912498k181626j674156k183914k176857k373734k174949j809654
1331.8D33116570j798478k027855j676330j435852j434899r53979q08754n67894m81911
1340.5D21930618N38254M28200P7553K975o7634N50613L38707J4419j29814J79520
1350.2D23863411R2354j10512j16768q54454n87883k78587J02997j15509p91474l86352
$$ y = [476091728, 475462494, 475256538, 474725800, 474117813, 473145180, 472683067, 472007484, 471349144, 470594902, 469501343, 468811913, 467877617, 467179756, 466322899, 465645256, 464501228, 463636436, 463528481, 462711411, 461857452, 460745773, 460218048, 459621658, 458774872, 458251076, 457440910, 456580544, 455833817, 455942039, 455435486, 454660149, 454144020, 453249245, 452825089, 452122383, 451235008, 450420341, 449603958, 447691460, 445509834, 443835678, 441651764, 439474907, 437101173, 434926224, 433116570, 431318092, 429290237, 427613907, 426178055, 424743156, 423789177, 422980423, 422412529, 421930618, 422468872, 422897072, 422974625, 422977600, 422909966, 423460579, 423799286, 423813705, 423683891, 423863411, 423955765, 423845253, 423728485, 422874031, 422286148, 422007561, 422110558, 421995049, 421203575, 420817223]
1359.8D20817223o58532j086502j225738k29416L57895j99776m48151r8915o34536
1368.5D16593552r40285J47743o3820O01692m8790j028099O43769R29222R19266J45530
1378.1D17899780P55348O26336L57704P43828P45506J344795J020050J482086J119423
1386.8D26094856J407242K266502K028733J951103J196060J166001L94401j040649
1394.5D35464249r41010Q88291Q46824n91812j619263n51223O27670k13661q56934
1403.2D33053131r37462j344986j68647m02413p09686r48258j077079o75583m80004
1411.9D26309013o53534p69004n10369m51278m55399j198692q25310j932526R32770
1420.6D20445671J946030N4474M13208l03765K92816Q83980K1858O89469k11754J05820
$$ y = [420817223, 420158691, 419072189, 417846451, 417617035, 417974930, 417775154, 417327003, 417228088, 416593552, 415653267, 415801010, 415737190, 416338882, 416290092, 415261993, 415905762, 416834984, 417754250, 417899780, 418655128, 419281464, 419639168, 420382996, 421128502, 422473297, 423493347, 424975433, 426094856, 427502098, 429768600, 431797333, 433748436, 434944496, 436110497, 436504898, 435464249, 434523239, 435411530, 436258354, 435666542, 434047279, 433496056, 434123726, 433910065, 433053131, 432115669, 430770683, 430602036, 430199623, 429489937, 428541679, 427464600, 426789017, 426309013, 425655479, 424886475, 424376106, 423924828, 423469429, 422270737, 421445427, 419512901, 420445671, 422391701, 422446175, 422859383, 422555618, 422848434, 423732414, 423754272, 424443741, 424231987, 424337807]
1430.2D24337807N25627J212196Q65288M33197J491394k70996q26302J381913K228393
1438.9D31378517J152840M54445Q11767K2621J324044N92422P31392M08783o73447
1447.6D36203384p33223k75383N95780o47354j23177n00030r8763l38325k255478l260575
1457.2D28566856k720871L682633L75557J394310M10232L93982K241555n05600K223892
1465.9D36062546J283951K596893K831192L053131L680992J439591L228187K306824
1473.6D56483307N936279L694306L512573M889107L913955M043579K579041L427086
1481.3D88479233K402420L571548K979813J773643K639809R60426L038292J604119
1489E07449303R55619L040200L521003L089409J359024K220040O35223n68237K688713
$$ y = [424337807, 424863434, 426075630, 426940918, 427374115, 428865509, 428594513, 427768211, 429150124, 431378517, 432531357, 432985802, 433797569, 433820190, 435144234, 435736656, 436468048, 436876831, 436203384, 435470161, 435194778, 435790558, 435143204, 435020027, 434519997, 434421234, 434082909, 431827431, 428566856, 425845985, 429528618, 429904175, 431298485, 431708717, 432102699, 434344254, 433838654, 436062546, 437346497, 439943390, 442774582, 445827713, 449508705, 450948296, 454176483, 456483307, 462419586, 466113892, 469626465, 474515572, 478429527, 482473106, 485052147, 488479233, 490881653, 494453201, 497433014, 499206657, 501846466, 502806892, 505845184, 507449303, 508404922, 511445122, 514966125, 518055534, 519414558, 521634598, 522269821, 521701584, 524390297]
1497.7E24390297K217331J211929J717644K072487Q58879J449203J007080M23508o479797
1506.4E28868561k187767P363167K100524K699967J818733J405296J70479J177292
1514.1E43416252M67148j009254Q45832p93686L524857J684303l548469j14098M37164
1522.8E44910049L327141R27620l18031J316337J084061K70615N29861J564331l37295
1531.5E53274689K12631j249733k196159K699318Q23707O09856k00844p039299o069450
1540.1E40864716O317634K477341P2479L695603M21524j241036J407967O13670J67580
1548.8E54797478j253128j452484P53135O58417k99721k308998k77672J692314k74963
1557.5E52034378j8288231o835480J5597268O225586K314147K03476j72844j596984
$$ y = [524390297, 526607628, 527819557, 529537201, 531609688, 532468567, 533917770, 534924850, 535348358, 528868561, 526680794, 534043961, 536144485, 538844452, 540663185, 542068481, 542238960, 543416252, 543883400, 542874146, 543719978, 542926292, 546451149, 548135452, 544586983, 544472885, 544910049, 548237190, 549164810, 548846779, 550163116, 551247177, 551517792, 552047653, 553611984, 553274689, 553487320, 552237587, 550041428, 552740746, 553564453, 554174309, 553973465, 546934166, 540864716, 547182350, 549659691, 549732170, 553427773, 553849297, 552608261, 554016228, 554629898, 554797478, 553544350, 552091866, 552845001, 553503418, 553203697, 550894699, 550617027, 552309341, 552034378, 533746147, 526910667, 542507935, 548733521, 551047668, 551251144, 551078300, 549481316]
1565.2E49481316J71432P03278l0670j159287l855782K110596J494560M67759k9183
1573.9E49354019m35905k177887l875695L884621J780930p4044n02853n17311P5684
1582.6E47511559k69471k67143o13213p88497o21338m05197n10254q67920l15132r40514
1592.2E41912880m05502p43180j233062m98200q38394l18031j314125j214905q71010
1600.9E34476471q87260r22127j688576r27353j228561j012307j515197q60558j290970
1609.6E24143562k035331m81835j697082j512146k124367r39064j855049p678871J783409
1618.2E07603226K73590q99239k054558o39686j509476m385452P7286q17452n28374
1626.9D97119865l011894j880340p0610j333237j196823j107826K7656n72472n577392
$$ y = [549481316, 549652748, 550356026, 550325356, 549166069, 545310287, 547420883, 548915443, 549383202, 549354019, 548918114, 546740227, 542864532, 546749153, 548530083, 548456039, 547953186, 547435875, 547511559, 547242088, 546974945, 546361732, 545573235, 544951897, 544546700, 544036446, 543168526, 542853394, 541912880, 541507378, 540764198, 539531136, 539032936, 538194542, 537876511, 536562386, 535347481, 534476471, 533589211, 532667084, 530978508, 530051155, 528822594, 527810287, 526295090, 525434532, 524143562, 522108231, 521626396, 519929314, 518417168, 516292801, 515353737, 513498688, 505819817, 507603226, 507876816, 506977577, 504923019, 504283333, 502773857, 498388405, 498465691, 497648239, 497119865, 494107971, 492227631, 492157021, 490823784, 489626961, 488519135, 488546791, 487974319, 482396927]
1635.6D82396927j725502K141189J96190L87650O40640j039886N27572m63752N73730
1644.3D83634758L39241l272858m0893J009407K873230J155014J862106J367836o331215
1653D82596626p94639N648994M453049K840271K412987Q84780J243592J055069J285515
1661.6E01626244J487693J292000L120880K050171K202950J701393J349411m71649
1669.4E14359093J882171M115830J655311K844201L038139J690407P9574L298950L062897
1678E36026573J574135K035713J056824L291016K657623k795868o66161N624619N163154
1686.7E53967628K987252J635055J803131J778908K230797K248459J640739K070275
1694.4E70362244J446266l188286L300972L082657L157501k24495k060394M399605
$$ y = [482396927, 480671425, 482812614, 483008804, 483396454, 484037094, 482997208, 483524780, 483061028, 483634758, 483973999, 480701141, 480660248, 481669655, 484542885, 485697899, 487560005, 488927841, 482596626, 481801987, 487450981, 491904030, 494744301, 497157288, 498042068, 499285660, 500340729, 501626244, 503113937, 504405937, 507526817, 509576988, 511779938, 513481331, 514830742, 514359093, 516241264, 520357094, 522012405, 524856606, 527894745, 529585152, 529664726, 532963676, 536026573, 537600708, 539636421, 540693245, 543984261, 546641884, 543846016, 543179855, 548804474, 553967628, 556954880, 558589935, 560393066, 562171974, 564402771, 566651230, 568291969, 570362244, 571808510, 568620224, 571921196, 575003853, 578161354, 577936859, 575876465, 580276070]
1702.1E80276070K659759J511307Q9378J785012O54678Q49838J640053M34151O84585
1710.8E90584831P23419J197281J133728p70149o11648K040138J081428l630371L800659
1719.5E95549316K725068J228561P67326N34401O79856Q73794J016159O03562J027641
1728.2F05005684Q29315j087303o0425K261200J427040l399772p06444L233833K594605
1736.9F10097733Q95996J104507k60696j398087K838555J540336l88107L22189J574173
1745.5F16326599J274300M59213M36974K3002L402405O74934n84945K871627J083413
1754.2F25967522R67712J109238k93885J176644J485786P71675J565285m37889l853
1762.9F32308235K626991R50737N67704R59282Q10279j320800P49397K330780j382942
$$ y = [580276070, 582935829, 584447136, 584536514, 586321526, 586976204, 587826042, 589466095, 589900246, 590584831, 591308250, 592505531, 593639259, 592869110, 592257462, 594297600, 595379028, 591748657, 595549316, 598274384, 599502945, 600270271, 600804672, 601484528, 602358322, 603374481, 603978043, 605005684, 605834999, 604747696, 604687271, 606948471, 608375511, 604975739, 604269295, 607503128, 610097733, 610993729, 612098236, 611837540, 610439453, 613278008, 614818344, 614430237, 614752426, 616326599, 617600899, 618060112, 618497086, 618520088, 621922493, 622597427, 622012482, 624884109, 625967522, 626935234, 628044472, 627750587, 628927231, 630413017, 631184692, 632749977, 632312088, 632308235, 634935226, 635885963, 636453667, 637412949, 638223228, 636902428, 637651825, 639982605, 638599663]
1771.6F38599663j948052L10631L312264J938018o50024J674347M36172O08750O7673
1780.3F44349442p11213J260224J076660O45218q52204R5368R94339P20596K56119
1788.9F47834549L32642l65983o71005m96139k94113K663955Q13980o63376J156006
1797.6F50310516Q12455j1292q72879J437073j84021n9204J429138J58615M49524j20163
1807.3F53349762N5618N81513M47082q80661J15662J274643J73187O12793k4185M99039
1816.9F56204453j37177j38702J209259k06299J30844l41568M76837P31812j733780
1825.6F56195679M86297J238404J107635k36206k088394Q37326J472855Q8958K08893
1834.3F59311447M76074o9885J13297m12293N24979K40173J60980R4300p0038p0801
$$ y = [638599663, 636651611, 636962242, 640274506, 642212524, 641562500, 643236847, 643673019, 644281769, 644349442, 643638229, 644898453, 645975113, 646620331, 645768127, 645863495, 646857834, 647578430, 647834549, 648167191, 647801208, 647130203, 646634064, 646339951, 649003906, 649817886, 649154510, 650310516, 651122971, 651111679, 650238800, 651675873, 651491852, 651432648, 652861786, 653020401, 653469925, 653349762, 653405380, 653986893, 654433975, 653553314, 653668976, 654943619, 655116806, 655729599, 655705414, 656204453, 656067276, 655928574, 657137833, 656931534, 657062378, 656720810, 657197647, 657929459, 656195679, 656681976, 657920380, 659028015, 658791809, 656703415, 657540741, 659013596, 659102554, 659311447, 659787521, 659717636, 659830933, 659418640, 659943619, 660183792, 660344772, 660439072, 660369034, 660298233]
1843.9F60298233l409271J774521J876144r2544j08109J43204Q11767K2354N20935
1852.6F61837234r2773k70386P630n04837M93316j01852n3558j69983J82342L73459
1862.2F61700592N6839K96860l20664J15738o66351q7509l80860q87069J189270P81631
1871.9F61798477P55081L30582O16074r1629o87943P2327j22910K97852P5683M73023
1881.5F63516617J49765l51639j18866J01242L25852l87726P76748J94855j402817
1890.2F62804031O81076Q58002j80435M883J04828m90952Q21610M59213j29395J00098
1899.8F65032959N5542L27148m26178J79444q545J8005L15628o48727q8577L46298
1909.5F65102997L738k81906P34482J82724l47672j56631m21829O38733j544571k27661
$$ y = [660298233, 656888962, 658663483, 660539627, 660447083, 660338974, 660482178, 661293945, 661316299, 661837234, 661744461, 661474075, 661481705, 660976868, 661470184, 661368332, 661314774, 661144791, 661327133, 661700592, 661757431, 662054291, 661733627, 661849365, 661183014, 661095505, 660714645, 659827576, 661016846, 661798477, 662553558, 662884140, 663500214, 663408585, 662720642, 662792969, 662670059, 662967911, 663043594, 663516617, 663666382, 663314743, 663195877, 663297119, 663622971, 663235245, 664011993, 664206848, 662804031, 663485107, 664343109, 664162674, 664167557, 664272385, 663781433, 664603043, 665062256, 664932861, 665032959, 665088501, 665415649, 664989471, 665168915, 665160370, 665178375, 665494003, 664845276, 664756699, 665102997, 665106735, 664824829, 665559311, 665742035, 665394363, 665237732, 664815903, 665454636, 663910065, 663682404]
1919.1F63682404J526947J24282J61744o79017j20849N42984L06015O9580K3804R0332
1928.8F65728226j99662j33056j6709N37491j95312j6175K88849j61438K66343q6976
1938.4F66011581j39617n64881L74756L5477j306382R11255O71769J55487j02921k08206
1948.1F65838318Q39k9449J99203N2338J15127N0736K34909K5940K46200K06757k86942
1958.7F66653976L0594J8845J34277l43017J20392K31781j85776L07083m33807j90812
1968.3F66343536N59540N04990j29776j49002J4190n8136J70365l0060O26068j99737
1978F67651978o84968L7003J42517M82102j03074p0114j06811q011J3046j96533j05972
1988.6F67051163k37656O21872j80969r29566L0518N94025L57742k48642M06189P6446
$$ y = [663682404, 665209351, 665333633, 665495377, 664816360, 664695511, 665238495, 665544510, 665614090, 665637894, 665728226, 665528564, 665395508, 665378799, 665916290, 665720978, 665704803, 665993652, 665832214, 666098557, 666011581, 665871964, 665307083, 665681839, 665717316, 664410934, 665322189, 665993958, 666149445, 666046524, 665838318, 665839157, 665809708, 666008911, 666061249, 666176376, 666227112, 666462021, 666487961, 666734161, 666940918, 666653976, 666684570, 666703415, 666837692, 666494675, 666615067, 666846848, 666661072, 666968155, 666534348, 666343536, 666903076, 667408066, 667278290, 667129288, 667143478, 667085342, 667255707, 667225647, 667851715, 667651978, 666967010, 667004013, 667146530, 667628632, 667525558, 667455444, 667348633, 667340622, 667353668, 667157135, 667051163, 666813507, 667435379, 667254410, 666324844, 666355362, 666949387, 667307129, 667058487, 667464676, 667541122]
1998.2F67541122r0637l47748m11148l9596k70844K37046j22681Q5678K24228k07672
2007.8F66597748r3460p7820n9281l58047O8512o9885k61307m0512k01874m69208k43835
2018.5F64791031K96020k44598m8218j75857l00141k6855l84445r8496l1586K05155
2028.1F63982010l10593m54788j24512j24206M4479n30548k69241k41547m6310J33819
2037.7F62058563k04849k78625n12314j84861j58920J56860l48052l71323K84347J1979
2047.4F60452805J18331l88259O8817K57415j41296m00314k12937O16379k76718l65372
2057F59728851j70288Q1253K80609q0032L8681k88696O1722k39487p3853J77308k1821
2067.6F59494247J61972k91366L96194L11890j21231r0332M6081K38419r0256J14670
$$ y = [667541122, 667450485, 667102737, 666691589, 666651993, 666381149, 666618195, 666495514, 666581192, 666805420, 666597748, 666504288, 666426468, 666367187, 666009140, 666077652, 666007767, 665746460, 665705948, 665504074, 665034866, 664791031, 665087051, 664842453, 664794235, 664618378, 664318237, 664291382, 663906937, 663808441, 663776855, 663982010, 663671417, 663216629, 663092117, 662967911, 663012390, 662481842, 662212601, 661971054, 661924744, 662058563, 661853714, 661575089, 661062775, 660877914, 660718994, 660875854, 660527802, 660156479, 660440826, 660452805, 660571136, 660182877, 660251694, 660509109, 660367813, 659967499, 659754562, 660370941, 660094223, 659728851, 659558563, 659639816, 659920425, 659840393, 659879074, 659590378, 659652100, 659412613, 659338760, 659516068, 659494247, 659656219, 659364853, 659761047, 660072937, 659951706, 659861374, 659907455, 660145874, 660055618, 660170288]
2077.3F60170288r8495m8142j89590L7765K04544j05133J59607l18222j5640J96991
2086.9F59993973J67389J09863q1635j98059m21676L25088J60904M00620L68576m02603
2096.6F60422440j76239j43433J831Q5907L17383M5776J64948K84881J65329K33612
2106.2F61402435m32586k7542J0604J23825P0420k10495K18582M7531J97907j13907
2115.9F61286774j28632m06876N875O31790k4795k0752n72281j02844K27737K37732
2125.5F61133728L02963j97906Q6059k40402J29089m4403j07345P1869J6250M03977
2135.1F61553879o19889m04052J27716L75595K60467j7318K1515m40751K32697N5695
2144.8F61145554P9879n2490k58331J74026k00805J81198j37558r7275K80609L03040
$$ y = [660170288, 660071793, 660023651, 659834061, 659871826, 660076370, 659971237, 660130844, 659812622, 659796982, 659993973, 660161362, 660271225, 660189590, 659991531, 659569855, 659894943, 660055847, 660456467, 660825043, 660422440, 660246201, 660102768, 660104599, 660190506, 660507889, 660553665, 660718613, 661003494, 661168823, 661402435, 660969849, 660942307, 660952911, 661076736, 661147156, 660936661, 661155243, 661202774, 661400681, 661286774, 661158142, 660751266, 660757141, 661388931, 661364136, 661343384, 660771103, 660668259, 660895996, 661133728, 661436691, 661238785, 661324844, 661084442, 661213531, 661169128, 661061783, 661133652, 661149902, 661553879, 660933990, 660529938, 660657654, 661033249, 661293716, 661276398, 661297913, 660857162, 661089859, 661145554, 661225433, 661172943, 660914612, 661088638, 660887833, 661069031, 660931473, 660834198, 661114807, 661417847]
2154.4F61417847n3788k15606M15802K5406K26211M3259J38931N8670l17840J49002
2164.1F61887894J4953M85535N1651K40860J88980l06778J54419l8376N31540J66702
2173.7F63377380P4082O5918K24991O00509K1134M84008O4164J46408O7062j16501
2183.4F65009155M37622J93329K25830j23977N7144r5749j38855p0038J76849P17087
2193F66388397L31574N62668k26899l42025J73950J44501M8217p4386N97381K34070
2202.6F67837448L30734j449N2871L94669j08795J86310j64795L60489K25448J53351
2212.3F69266281K88849j33972J76849q3771M28620m6311l9749L54386J36795J08871
2221.9F70456848l07693L36914P8125M35867J15891k12098M48838j69373J19400k09274
$$ y = [661417847, 661364059, 661148453, 661564255, 661589661, 661815872, 661859131, 661998062, 662056732, 661738892, 661887894, 661902847, 662388382, 662440033, 662680893, 662869873, 662563095, 662717514, 662679138, 663210678, 663377380, 663451462, 663517380, 663742371, 664342880, 664364014, 664848022, 664912186, 665058594, 665125656, 665009155, 665446777, 665640106, 665865936, 665741959, 665799103, 665703354, 665564499, 665494461, 665671310, 666388397, 666719971, 667282639, 667055740, 666713715, 666887665, 667032166, 667080383, 667005997, 667603378, 667837448, 668168182, 668166733, 668219604, 668614273, 668505478, 668691788, 668526993, 668887482, 669112930, 669266281, 669555130, 669421158, 669598007, 669514236, 669942856, 669896545, 669856796, 670211182, 670347977, 670456848, 670149155, 670486069, 670564194, 671000061, 671115952, 670903854, 671352692, 671183319, 671302719, 671093445]
2231.6F71093445K40784M29000K6474Q9798q9950L68728o2179K71072q6212k04544
2241.2F72076416J67313j70594J450n6000O74210J26037R2545J39389k22549j01090
2250.9F72727127l08609Q79822K12250k11487j04065j8234K48565k01416P63245L21808
2260.5F74309006J69449j2665j46408J51748j59912J97830k31552M61884K84653P7514
2270.2F75101547J74179j22375J05362j83182O54907m69970l57590N62439J21765j297
2279.8F75585785n27573L46146p7210J92032j48925j89591R02710L9597L77655k38419
2289.4F76262207P25479P11670M3564P93152j68610J052857N19943L60718K66800k20490
2299.1F80347290Q54569m9668M79508K11410O28662Q46176N37644J458969R14307J344375
$$ y = [671093445, 671334229, 671763229, 671789703, 671879501, 671789551, 672158279, 672096100, 672367172, 672280960, 672076416, 672243729, 672073135, 672074585, 672018585, 672692795, 672818832, 672911377, 673050766, 672828217, 672727127, 672418518, 673298340, 673510590, 673299103, 673195038, 673176804, 673425369, 673223953, 673987198, 674309006, 674478455, 674465790, 674319382, 674471130, 674311218, 674509048, 674277496, 674739380, 675024033, 675101547, 675275726, 675153351, 675258713, 675075531, 675730438, 675260468, 674902878, 675465317, 675587082, 675585785, 675058212, 675404358, 675327148, 675519180, 675370255, 675180664, 676083374, 676122971, 676500626, 676262207, 676987686, 677699356, 677742920, 678536072, 678367462, 679420319, 679940262, 680300980, 680567780, 680347290, 681201859, 681152191, 681631699, 681843109, 682471771, 683317947, 683855591, 685314560, 686228867, 687573242]
2308.7F87573242K80991P72018J093979K94418P15104l59879P72553N03006P80334
2317.4F92425766J815338J969452K554474J014252J012115R02100O27060j18332O52542
2326.1G02854767J748657L60336J221009P39441P75833J90963O1493M30375j160889
2334.8G07221985R22394J028442L42026K93121j13144P83539K61536L88565n90515
2343.4G10537949r62754k088470l256836m008103n198135J21994N221405L826142L177948
2352.1G07371140K174682J403427M378128L822251K418213q12149J828384K372818
2359.8G24956894j697388j260757j269303J153260q35800k255021k558593l281250
2367.6G12952042k108384l337249k926178l143921k489090k573166l491898k899932
$$ y = [687573242, 687854233, 688626251, 689720230, 690014648, 690729752, 690369873, 691142426, 691645432, 692425766, 694241104, 696210556, 698765030, 699779282, 700791397, 701693497, 702320557, 702202225, 702854767, 704603424, 704963760, 706184769, 706924210, 707700043, 707891006, 707952499, 708382874, 707221985, 708144379, 709172821, 709514847, 709807968, 709694824, 710478363, 710739899, 711128464, 710537949, 709575195, 707486725, 704229889, 700221786, 695023651, 695145645, 700367050, 704193192, 707371140, 709545822, 710949249, 715327377, 719149628, 721567841, 720755692, 722584076, 724956894, 723259506, 721998749, 720729446, 721882706, 721046906, 718791885, 716233292, 712952042, 710843658, 707506409, 704580231, 701436310, 698947220, 696374054, 692882156, 689982224]
2375.3F89982224k630692j132202j458588k093735j989593k014160j852570j880264
2383F74930420j196442j241684q84933m87061n26275m13132l54843L0289q2856M1123
2392.6F69814606j67847j34354k07748M3793L73153n68389j55335j54266q1559N7221
2402.3F68819275k65808k0218n68009k93426N0049K23694n2414l23487k02407m07181
2411.9F66960068l05J5029K31019l24250m89502R9488J91879m5548r02328k71683k20032
2422.5F65243835M0284K03170m72869j78223o25076k34528j16806q0566k30637o05087
2432.2F62943497J29165k56805j06354j8768m61044l79105j48773j67618j93253r1705
2441.8F61249237n62668l04031n24597m0741L94745l43399k52915l16162l5858n49698
$$ y = [689982224, 687351532, 686219330, 684760742, 682667007, 680677414, 678663254, 676810684, 674930420, 673733978, 672492294, 671607361, 671120300, 670594025, 670180893, 669826050, 669856339, 669773483, 669814606, 669646759, 669512405, 669304657, 669348450, 669721603, 669153214, 668997879, 668843613, 668762054, 668819275, 668553467, 668533249, 667965240, 667671814, 667721863, 667945557, 667893143, 667569656, 667367249, 666960068, 666959763, 666974792, 667205811, 666881561, 666392059, 666491547, 666683426, 666637878, 665735550, 665463867, 665243835, 665284119, 665487289, 665014420, 664836197, 664211121, 663976593, 663859787, 663779221, 663548584, 662943497, 663072662, 662815857, 662709503, 662690735, 662229691, 661850586, 661701813, 661534195, 661340942, 661249237, 660686569, 660382538, 659857941, 659817200, 660211945, 659868546, 659615631, 659299469, 659263611, 658713913]
2451.5F58713913m83093l6469j14288K48794l32489n63888o14777M7455J60370k46506
2461.1F56779022j09482m19616m45175o09513J58768p2022l53927L1509k27890O5232
2470.7F54796906l46070o790k98767o21262j95465k4795K58255o35910j77536K45971
2480.4F52994537p171k06452l82614k04468m84771j7319k30103p7667m1504l09448
2490F51033020k37885n64727J50833P3395r7123m45404k13775M24804j00021R4528
2499.7F50117645q9340j18561j48239j56784n70373m17634M28467m34570k78626j71356
2509.3F48160629K7237P5379m46854N6152k06985l12119l84369J29853J20773m29382
2519F46790314l4104j1673J14365j77002j79062l49274l17001j68610k94647J05210
$$ y = [658713913, 658230820, 658194351, 658080063, 658328857, 657996368, 657432480, 656817703, 656865158, 657025528, 656779022, 656669540, 656249924, 655804749, 655195236, 655354004, 655281982, 654928055, 654959564, 654731674, 654796906, 654450836, 654444046, 654145279, 653524017, 653328552, 653303757, 653562012, 652926102, 652748566, 652994537, 652987366, 652780914, 652398300, 652193832, 651709061, 651691742, 651461639, 651383972, 651342468, 651033020, 650795135, 650230408, 650381241, 650454636, 650357513, 649912109, 649698334, 650123138, 650023117, 650117645, 650028305, 649909744, 649761505, 649604721, 649034348, 648616714, 649045181, 648610611, 648331985, 648160629, 648187866, 648263245, 647816391, 647872543, 647665558, 647353439, 646969070, 647098923, 647219696, 646790314, 646756210, 646744537, 646858902, 646681900, 646502838, 646153564, 645836563, 645667953, 645373306, 645478516]
2528.6F45478516n04761n90057k50779P6371j6251k75574K6398l738J51138n91278
2538.2F43499985p94068l74756O3553J9455m84771K1286m35715n60913k15225J26724
2547.9F40865555K0981l91007n0049l86886l46298p41539m55933P4577k16560j6060
2557.5F38356781k75002p7743k82517l09715l27987m22707l15018m65011m2954j91421
2567.2F35646706J75323k63786m67644K4796j16463K5482q41980m01878m0474k22283
2576.8F33517799k35786m01421O5766l22991J10016J02310m6997k63824q21991k04239
2586.5F31498642r7008K0294l53355m46854l35540J0643K30903k29835o3095o03753
2596.1F29631042k35176l8719j23634p9155l70407o6033l29475K17743k23503n14221
$$ y = [645478516, 644973755, 644383698, 644132919, 644209290, 644193039, 643917465, 643943863, 643940125, 644091263, 643499985, 642705917, 642331161, 642394714, 642414169, 641929398, 641950684, 641514969, 640954056, 640738831, 640865555, 640886536, 640495529, 640445480, 640058594, 639712296, 638970757, 638514824, 638589401, 638372841, 638356781, 638081779, 638004036, 637721519, 637411804, 637083817, 636661110, 636346092, 635881081, 635838127, 635646706, 635822029, 635558243, 635090599, 635115395, 634998932, 635024414, 634182434, 633780556, 633740082, 633517799, 633282013, 632880592, 632946358, 632623367, 632733383, 632835693, 632788696, 632524872, 631702881, 631498642, 631401634, 631421928, 631068573, 630621719, 630286179, 630296822, 630527725, 630297890, 630234795, 629631042, 629395866, 629357147, 629233513, 629154358, 628783951, 628717918, 628388443, 628606186, 628382683, 627868462]
2605.7F27868462j82534j32675K02179o84929k07023j69487l59955L8566l76281n00832
2615.4F25495491l23105R270n31387n8403l73230q15239k11068m83512J02539j25695
2625F22685661l51906o69174p44095m82139q94470m20380j19781L76052l85360p45850
2634.7F18248558l83415n44243j76201p30972n12696m88090m12674j61209m07982m33083
2644.3F13997993o36711l76930q12302m51393l41873m38537j79520n47981k45781o37818
2654F09329147n21545p88231o88782n5008m36706k76375l97873k59933o71349l96843
2663.6F04836502j47629l67241J24741n99556p37228o66733l23677k70882j79901r9792
2673.3F01568604o39458j2245l41797j68152l97415o26183k56538p48940j57776n34553
$$ y = [627868462, 627685928, 627553253, 627755432, 627070503, 626863480, 626693993, 626334038, 626372604, 625996323, 625495491, 625172386, 625181656, 624650269, 624591866, 624218636, 623403397, 623192329, 622708817, 622811356, 622685661, 622333755, 621664581, 620920486, 620438347, 619543877, 619123497, 619003716, 619379768, 618994408, 618248558, 617865143, 617320900, 617144699, 616413727, 615901031, 615412941, 615000267, 614839058, 614431076, 613997993, 613361282, 612984352, 612172050, 611720657, 611378784, 610940247, 610760727, 610212746, 609966965, 609329147, 608807602, 608019371, 607330589, 607275581, 606838875, 606562500, 606164627, 605904694, 605233345, 604836502, 604688873, 604321632, 604446373, 603846817, 603109589, 602442856, 602119179, 601848297, 601668396, 601568604, 600929146, 600916901, 600575104, 600406952, 600009537, 599383354, 599126816, 598377876, 598220100, 597685547]
2682.9E97685547m13742l00446l52592R117m44107l54195q12835l98407k45247k38991
2692.5E94134102q3008o03981k40288l26881j29471k86064m38461l07427m52614n92155
2702.2E90673752p40318k10762m88091l68156l13912l27072l87764n19600K55814q80890
2711.8E86693001j310539m12827l4103L2501l47977o08101n80101q1367n02243j52130
2721.5E82696114j14327o00777q773l37296n54123q15582o38390k15950P9117p4158
2731.1E79415855p89642n42412l12690o257k59285j73149n32989p86514L44886p4196
2740.8E76283607k65769j33706r117k93464m39530P3013n40199l91311l64190l65943
2750.4E73553391m72374m26789M0245m35562k71339j82724n7564q5716m8485k04620
$$ y = [597685547, 597271805, 596971359, 596618767, 596627884, 596183777, 595829582, 595016747, 594618340, 594373093, 594134102, 594051094, 593447113, 593206825, 592879944, 592750473, 592464409, 592025948, 591718521, 591265907, 590673752, 589933434, 589722672, 589234581, 588866425, 588552513, 588225441, 587837677, 587318077, 587573891, 586693001, 585382462, 584969635, 584935532, 584968033, 584620056, 584011955, 583431854, 583350487, 582848244, 582696114, 582581787, 581981010, 581972237, 581634941, 581080818, 580265236, 579626846, 579410896, 579490013, 579415855, 578626213, 578083801, 577771111, 577764854, 577505569, 577332420, 576799431, 576012917, 576357803, 576283607, 576017838, 575884132, 575875015, 575581551, 575142021, 575215034, 574674835, 574283524, 573919334, 573553391, 573081017, 572654228, 572694473, 572258911, 571987572, 571804848, 571747284, 571661568, 571613083, 571408463]
2760E71408463n58854k70271l15361J37749j99013k83585m31060o12297L52592K04315
2769.7E69432678l46489r11979j70441r3842k99339L06740p09381q49915n77507k64625
2779.3E65515900k93694l61557j19171k38037l7689n18380l67240m55971j51139k10189
2789E62762833j050148m49601m84428l56255n29213m96215l68576p91245p14455n39207
2798.6E56983490O4964p11097j003228p77473n52216n07507j148415j81732l26614
2807.3E51840172o43501n80178p80830q85697j418914o97251l54500n34286q61702
2816E45083313o88934p11708j413155j147575p84645p22580j145783m36897m04434
2824.7E37627602j152115j115303j149216n91392j156998j176872r31397r02214p36237
$$ y = [571408463, 570849609, 570579338, 570263977, 570401726, 570202713, 569919128, 569488068, 568875771, 569228363, 569432678, 569086189, 568174210, 568003769, 567909927, 567610588, 567917328, 567207947, 566358032, 565780525, 565515900, 565222206, 564860649, 564741478, 564503441, 564465752, 563947372, 563580132, 563124161, 562973022, 562762833, 561712685, 561263084, 560778656, 560422401, 559893188, 559396973, 559028397, 558237152, 557522697, 556983490, 557048454, 556337357, 555334129, 554556656, 554004440, 553496933, 552348518, 552166786, 551840172, 551196671, 550616493, 549835663, 548949966, 547531052, 546833801, 546479301, 545945015, 545083313, 544394379, 543682671, 542269516, 541121941, 540337296, 539614716, 538468933, 538032036, 537627602, 536475487, 535360184, 534210968, 533619576, 532462578, 531285706, 530354309, 529452095, 528715858]
2833.3E28715858j290359j152916j312103q60253j018295j458092j421203j561013
2841.1E18641624j272583j774139j333466j311416j586952j760102j843071j110077
2848.8E06649818j742553j872902j736374j304779j358948j238556q5754q86688j487999
2857.4D94935265j100426k58789q08525j557427j142120j496925j557274j595269j277198
2866.1D84141312j984101k393493j476632j403312j673012k201920j995277k144890
2873.8D68868675k196731k042847k402229k359543k003174j483002j972885j872520
2881.6D52535744j602860j554642j296043j146355o27670q62045p11098q21533o13976
2890.2D43299522m41742q19587n42259l30391M30641l97988q07495n16090o02532J80092
$$ y = [528715858, 527425499, 526272583, 524960480, 524100227, 523081932, 521623840, 520202637, 518641624, 517369041, 515594902, 514261436, 512950020, 511363068, 509602966, 507759895, 506649818, 504907265, 503034363, 501297989, 499993210, 498634262, 497395706, 497309952, 496423264, 494935265, 493834839, 493576050, 492767525, 491210098, 490067978, 488571053, 487013779, 485418510, 484141312, 482157211, 479763718, 478287086, 476883774, 475210762, 473008842, 471013565, 468868675, 466671944, 464629097, 462226868, 459867325, 457864151, 456381149, 454408264, 452535744, 450932884, 449378242, 448082199, 446935844, 446308174, 445446129, 444735031, 443913498, 443299522, 442857780, 442038193, 441495934, 441165543, 441596184, 441198196, 440390701, 439874611, 439272079, 439452171]
2899.9D39452171l05481m69246k33650l27377q93059p71675n36270n16472J06049j299553
2909.5D34205437j369705j112099j476975j249351j271591p26166j872749j758385
2917.2D23368416j498604k139893j476860j234474j153450j429558j341705j471062
2925D11622810p51342k41051m65088Q1940K9640j18218o14509L23715R23882P36007
2934.6D11527786J200447J406250J793366J400719J816444J870880K002068K123603
2942.3D25141563J658097K403831K272339K127113K150612K373619J938515J882629
2950D41948318K782135K550087K162171J304397K141266K337303K186966K609444J672936
2958.7D61695023K021942J909828K028809J907310J688690J374703R38453J752129
$$ y = [439452171, 439146690, 438677444, 438443794, 438116417, 437223358, 436451683, 435915413, 435398941, 435504990, 434205437, 432835732, 431723633, 430246658, 428997307, 427725716, 426999550, 425126801, 423368416, 421869812, 419729919, 418253059, 417018585, 415865135, 414435577, 413093872, 411622810, 410871468, 410630417, 410165329, 410247269, 410276909, 410158691, 409544182, 409867897, 410791779, 411527786, 412728233, 414134483, 415927849, 417328568, 419145012, 421015892, 423017960, 425141563, 426799660, 429203491, 431475830, 433602943, 435753555, 438127174, 440065689, 441948318, 444730453, 447280540, 449442711, 450747108, 452888374, 455225677, 457412643, 460022087, 461695023, 463716965, 465626793, 467655602, 469562912, 471251602, 472626305, 473564758, 475316887]
2966.4D75316887J323814J363411J037026J200828J664162J561813K009049J305885
2974.1D86782875J135140Q20007J512909J917724J393509J491242J109619J560364
2981.8D97723389J214904J188393J276207J321602J176414R13659J880760J042709
2989.6E07738037P21665Q64219J153832J436195P07626N73769M35982J012726O83937
2998.2E15327988L55644J30844K36053N47638K900N37490j35955j83487L3607P4692
3007.9E16927414K78244l74260l2806l97377q9837j64413j12381q0337j107865p41615
3017.5E14104767q89778o37017o72302m93812m23203n50461k60620j195946j117515
3026.2E07864113r71489j31950l05100j046371j007920j369896k72827q85887j037331
$$ y = [475316887, 476640701, 478004112, 479041138, 480241966, 481906128, 483467941, 485476990, 486782875, 487918015, 488738022, 490250931, 492168655, 493562164, 495053406, 496163025, 497723389, 498938293, 500126686, 501402893, 502724495, 503900909, 504814568, 506695328, 507738037, 508459702, 509323921, 510477753, 511913948, 512621574, 513195343, 513631325, 514644051, 515327988, 515683632, 515814476, 516050529, 516598167, 516601067, 517138557, 517002602, 516819115, 516852722, 516927414, 517205658, 516831398, 516798592, 516401215, 516311378, 516146965, 516034584, 515954247, 514846382, 514104767, 513214989, 512577972, 511905670, 511411858, 510988655, 510438194, 510177574, 508981628, 507864113, 506892624, 506760674, 506455574, 505409203, 504401283, 503031387, 502758560, 501872673, 500835342]
3034.9E00835342q91304j446495q91876l79639o01921j580505m90952p56454j160889
3043.6D92635307p60116j372490j021080j236191n66406r43489j271859r79728j189080
3052.2D83294868r15069j297760o86798j321106j399994q12645q35304o62194j236190
3060.9D74127808r27735j188621j121712j634712r06983k20832j611443o04286q05893
3069.6D65105591j276856j141853j163559j072235j215973q88443j451530j094819
3077.3D55800323j177368j020775r68551j143227o09855j085129o71158j204224j200027
3086D46720009j091957j408158r46045j125450r62791j325302o56357j038857j280136
3094.7D36884956p58476j259384q08220j405258q10776r13658j607132j434822j322746
$$ y = [500835342, 499944038, 498497543, 497605667, 497226028, 496624107, 495043602, 494552650, 493796196, 492635307, 491875191, 490502701, 489481621, 488245430, 487679024, 486735535, 485463676, 484483948, 483294868, 482379799, 481082039, 480395241, 479074135, 477674141, 476861496, 476026192, 475363998, 474127808, 473200073, 472011452, 470889740, 469255028, 468348045, 468127213, 466515770, 465911484, 465105591, 463828735, 462686882, 461523323, 460451088, 459235115, 458346672, 456895142, 455800323, 454622955, 453602180, 452633629, 451490402, 450880547, 449795418, 449124260, 447920036, 446720009, 445628052, 444219894, 443273849, 442148399, 441185608, 439860306, 439203949, 438165092, 436884956, 436126480, 434867096, 434058876, 432653618, 431842842, 430929184, 429322052, 427887230, 426564484]
3103.4D26564484l59841p82776o17561j089210j241761j087455j252671n60646j459465
3112D18113098j156731r36508j060257j076316j125412q24852j281205o20804p65419
3120.7D09265594r61799j380425j335334p24564j521149j309776o97746m38767j129989
3129.4C99766045p74537p32078j509667j127319j174583k44828r89341j433754p63283
3138.1C91016655j010857n53970j058693j175384r58138q30574j042137j056709q48580
3146.8C82481613q72078m51050q53309p52983j331673j131439o06766j087456o10237
3155.4C74784622r29375q45489j130753r99679p17545j114349p85332r54704r64813
3164.1C66342583j013184k34642q22716j339798m04052r28498q38852p88116p49474
$$ y = [426564484, 426204643, 425421867, 424804306, 423715096, 422473335, 421385880, 420133209, 419572563, 418113098, 416956367, 416019859, 414959602, 413883286, 412757874, 411933022, 410651817, 410031013, 409265594, 408303795, 406923370, 405588036, 404863472, 403342323, 402032547, 401334801, 400896034, 399766045, 398991508, 398259430, 396749763, 395622444, 394447861, 394203033, 393213692, 391779938, 391016655, 390005798, 389451828, 388393135, 387217751, 386259613, 385429039, 384386902, 383330193, 382481613, 381609535, 381158485, 380305176, 379552193, 378220520, 377089081, 376482315, 375394859, 374784622, 373855247, 373009758, 371879005, 370879326, 370161781, 369047432, 368262100, 367307396, 366342583, 365329399, 365094757, 364272041, 362932243, 362528191, 361599693, 360760841, 359972725, 359223251]
3172.8C59223251j010589q95081r51233j208420m36325p76291j35269o35032j475525
3181.5C51699486q31681l64952j42593j309738j493950j118546q39309r17816k54174
3190.1C44426727L44200p63282p80373r77249n72205n84259p56149m72450r52339q29926
3199.8C38082695j076164j61324l28102q80775n48973p75185o31104j096992o33316
3208.5C31950760o45104n67855m35677m60892K1668r90219j012421p06711k43034j65711
3218.1C26744804p10144q80661q44192n19829j031723j80092o3133o58913q03070p84302
3227.8C20268745q6708n46302m35086p84301m35105l67050q80890j91803p14569l80096
3237.4C15446835l67432n33371q67443q64544j31187k61899K27108m85210m94633q13045
$$ y = [359223251, 358212662, 357317581, 356366348, 355157928, 354721603, 353945312, 353810043, 353175011, 351699486, 350867805, 350502853, 350360260, 349050522, 347556572, 346438026, 345598717, 344680901, 344426727, 344770927, 344007645, 343227272, 342250023, 341677818, 341093559, 340337410, 339864960, 338912621, 338082695, 337006531, 336845207, 336517105, 335636330, 335087357, 334312172, 333681068, 332584076, 331950760, 331305656, 330737801, 330302124, 329841232, 329862900, 328872681, 327860260, 327153549, 326910515, 326744804, 326034660, 325153999, 324309807, 323789978, 322758255, 322578163, 322515030, 321856117, 321053047, 320268745, 320182037, 319635735, 319200649, 318416348, 317981243, 317614193, 316733303, 316541500, 315826931, 315446835, 315079403, 314546032, 313678589, 312814045, 312682858, 312420959, 312648067, 312162857, 311668224, 310855179]
3247C10855179j031742k98844o42109p7076n53092k79732j62983p83749n71346o89812
3256.7C05764694l21865m68521N2757l89366q73146k30408l0498l09849q43277J81217
3266.3C02531738j10111k47555J04542p31258q58269l99094J42708n36251k84367k69432
3276B99342651n78746l6202m35066q97827q69980P2708j43414r2067Q6727l56484k3994
3286.6B96068306n94139o60648n23491p6237j20525l63961l9177m53872l24307l82614
3296.2B92529335j91517o02856m51850K30560j06011j23252n01271l03421l57723j03188
3305.9B90018806k14290o10104n28393j043148l70521k58846l0823m31843p05357q9988
3315.5B85735493k93274p9422p00836r6188k08969o93627k73609o56509P0782q1997
$$ y = [310855179, 309823437, 309524593, 308882484, 308805408, 308252316, 307972584, 307809601, 307025852, 306454506, 305764694, 305442829, 304974308, 305027065, 304637699, 303764553, 303534145, 303503647, 303193798, 302350521, 302531738, 302421627, 302174072, 302278614, 301547356, 300689087, 300289993, 300432701, 299896450, 299612083, 299342651, 298763905, 298727703, 298292637, 297394810, 296524830, 296597538, 296454124, 296362057, 296448784, 296092300, 296068306, 295474167, 294813519, 294290028, 294213791, 294093266, 293729305, 293690128, 293236256, 292911949, 292529335, 292337818, 291734962, 291283112, 291513672, 291407661, 291284409, 290783138, 290479717, 290121994, 290018806, 289804516, 289194412, 288666019, 287622871, 287252350, 286993504, 286962681, 286530838, 285825481, 285735493, 285442219, 285362797, 284661961, 284565773, 284356804, 283663177, 283389568, 282733059, 282803841, 282721844]
3325.2B82721844n28469j269703p06730K97317q9149k94342r99909k4261q6842n24997
3334.8B78494759m10691o00109K2068l41396j93176o85711n62687l75481n38120k21081
3344.4B74588375p25632J8082j34163l98941n36976m62780j87855p49359j37806l40557
3354.1B70932388n40447p89490o55441k17457l48568R1763k43702m16508p53612k41127
3363.7B66817799k0276m03232j29929l91121l91082p91130r3155j01548o62498p18975
3373.4B63114853p90138J50661j40991J6327m08344q87738m64840k74429K12307m97189
3383B60030479l60546k86312l14560j58119k02560m3450k38075J55601k47135k63805
3392.7B58071518m39682p4139K96536l32031m1714m42143j35383l44200m42696l31268
$$ y = [282721844, 282193375, 280923672, 280216942, 280514259, 280425110, 280130768, 279130859, 279106598, 279019756, 278494759, 278084068, 277483959, 277506027, 277164631, 276971455, 276285744, 275723057, 275347576, 274809456, 274588375, 273862743, 273880825, 273746662, 273347721, 272810745, 272347965, 272160110, 271410751, 271272945, 270932388, 270391941, 269602451, 268947010, 268729553, 268380985, 268472748, 268229046, 267812538, 267058926, 266817799, 266797523, 266394291, 266264362, 265873241, 265482159, 264691029, 264597874, 264496326, 263833828, 263114853, 262324715, 262475376, 262334385, 262350712, 261942368, 261054630, 260589790, 260315361, 260527668, 260030479, 259669933, 259383621, 259069061, 258910942, 258708382, 258664932, 258426857, 258582458, 258335323, 258071518, 257631836, 257557697, 257854233, 257522202, 257480488, 257038345, 256902962, 256558762, 256116066, 255784798]
3402.3B55784798j83354L83988m16088J44844j36280l43647j66836P2841J66817r32255
3412B54374828J32408Q0071L37486J44806m49657K41127l18203J80473o91204l82996
3421.6B53649139L97377j7185K94647K480J72901n03826r2773J02138J66969J54839
3431.2B54326706k90890O68068J17626L01819j07517n75962J18980N26352M03919p1354
3440.9B55417747R11847j64204J26171N93109L0461O09760r01699o2123P41692P56798
3450.5B58059559K43282j04809M00391j42574N56736L04794N55801M63791l65734M2820
3460.2B60014057L03745R10931m7550p8373N75695O72283L91617J63975O21509n4435
3469.8B63473454L39889O22597L44543J4763L42140J014920K97126M08993K39353J07308
$$ y = [255784798, 255601444, 255985432, 255569344, 255714188, 255577908, 255234261, 255067425, 255140266, 255307083, 254374828, 254507236, 254587307, 254924793, 255069599, 254619942, 254861069, 254542866, 254723339, 254032135, 253649139, 254046516, 254029331, 254323978, 254326458, 254499359, 253995533, 253902760, 254004898, 254171867, 254326706, 254035816, 254703884, 254821510, 255123329, 255015812, 254439850, 254558830, 255085182, 255489101, 255417747, 256329594, 256165390, 256291561, 256884670, 256915131, 257524891, 256623192, 256561069, 257302761, 258059559, 258302841, 258198032, 258598423, 258455849, 259012585, 259317379, 259873180, 260336971, 259971237, 260014057, 260317802, 261228733, 261181183, 261102810, 261678505, 262350788, 262742405, 262906380, 263527889, 263473454, 263813343, 264435940, 264780483, 264795246, 265137386, 266152306, 266449432, 266858425, 267097778, 267205086]
3479.5B67205086J73092P08198J85414k64054J130314L95680N17883Q35190L86753
3488.1B71273556R4356N9777Q72497Q88233J098976Q7529j70994L62911L97034O10561
3497.8B75574436K09046Q23745P13539R70955P69539j37424k58179K86045J097145
3506.5B80048847N3635Q75759K98176k76108J596203O00719K8973k976J134224J274701
3516.1B85632153J60694M50878O69460O15425N17884J325931M45461q640Q33817M74090
3525.7B91117153M28887L07235Q67787N2089O46935J053734M05330P77131L78284J326218
3535.4B97360783K70137m11281J548328J209584O98604P57523J079902R46198P49321
3544.1C04209099n72758k62203J455383O4011J324940J915855J445885R62124r02100
$$ y = [267205086, 267378178, 268086376, 268271790, 268007736, 269138050, 269533730, 270051613, 270886803, 271273556, 271367912, 271427689, 272300186, 273188419, 274287395, 274374924, 274203930, 274566841, 274963875, 275574436, 275783482, 276607227, 277320766, 278291721, 279061260, 278923836, 278665657, 278951702, 280048847, 280102482, 280978241, 281276417, 281000309, 282596512, 283197231, 283226204, 283223228, 284357452, 285632153, 285792847, 286243725, 286913185, 287528610, 288046494, 289372425, 289817886, 289809246, 290643063, 291117153, 291546040, 291853275, 292721062, 292773151, 293420086, 294473820, 294879150, 295656281, 296034565, 297360783, 297630920, 297219639, 298767967, 299977551, 300676155, 301433678, 302513580, 303459778, 304209099, 303636341, 303374138, 304829521, 304893532, 306218472, 308134327, 309580212, 310542336, 309640236]
3552.7C09640236R74483J497841Q87432J311646R48620J399383J376362n6972J35517
3561.4C18114548K550163J274719K48451L127785k63710q69484J134453k59972L253289
3570.1C28310242K126732J227760J712074Q26225Q24700J405296K151718L12958J765137
3578.8C40662842K129135J35803J746712J926803J826745J233520L363228K036743
3586.5C55061531k660599J016503J43814L499603L221283K525558J318322j19553L632279
3595.2C67638741o81763K264671L441200j5525K673568M95758J703263K690925K000580
3603.9C82211418K249756K467422K255784j418038L122902k23007k09923P099800J359062
3612.5C98915176j200180L242302m43725M794120N288239q14056K92816j215515K209434
$$ y = [309640236, 310614719, 312112560, 312999992, 314311638, 315260258, 316659641, 318036003, 317979031, 318114548, 320664711, 321939430, 322187881, 325315666, 325051956, 324182472, 325316925, 325056953, 328310242, 330436974, 331664734, 333376808, 334203033, 335027733, 336433029, 338584747, 338897705, 340662842, 342791977, 342927780, 344674492, 346601295, 348428040, 349661560, 353024788, 355061531, 352400932, 353417435, 353561249, 357060852, 360282135, 362807693, 364126015, 364006462, 367638741, 366956978, 369221649, 372662849, 372647324, 375320892, 375816650, 377519913, 380210838, 382211418, 384461174, 386928596, 389184380, 387766342, 390889244, 390666237, 390456314, 397556114, 398915176, 397714996, 400957298, 400513573, 405307693, 410595932, 409781876, 410074692, 408859177, 411068611]
3621.2D11068611M472847K700729K606698K111969J554985J843261N826798q76312
3628.9D31309586r692879N702629M425850N243416J778450j680680K605286L967285
3636.6D43658943K845268l46984J155052K326088L077888J761513K79350K644272L327828
3645.3D60729218N562782k668801m961471M928322r15909j981278J421433O919365
3653D69033661M078178L995133M156952r439507K959023O475448K588234J540680N21393
3661.7D85909195J725540Q49152K268028K427711O83823L321114J817474o45218P09610
3670.4D99066429n796776K722817Q387680P273903n111580j6127472P324219R022140
3678.1E06761360N203972j526413M89426L096695J327476J889420J529388P26280L406182
$$ y = [411068611, 415541458, 418242187, 420848885, 422960854, 424515839, 426359100, 432185898, 431309586, 421616707, 427319336, 431745186, 436988602, 438767052, 437086372, 439691658, 443658943, 446504211, 446157227, 447312279, 449638367, 452716255, 454477768, 454757118, 457401390, 460729218, 466292000, 463623199, 458661728, 463590050, 462674141, 460692863, 462114296, 469033661, 473111839, 477106972, 481263924, 471824417, 474783440, 481258888, 483847122, 485387802, 485909195, 487634735, 488483887, 490751915, 493179626, 493863449, 497184563, 499002037, 498356819, 499066429, 493269653, 495992470, 504380150, 511654053, 506542473, 490415001, 497739220, 506761360, 511965332, 510438919, 510928345, 514025040, 515352516, 517241936, 518771324, 519497604, 522903786]
3686.8E22903786M211006j0177841j779862R366265m685936J242256N781555O86455
3694.5E27547684J912918O21605O21032J601105J96991K344513K574883m847413j225395
3703.2E31347923N247765J709709K50816K87323L020745M402198p831878L308868K656479
3711.9E44399948j3139877N766334N061722L87116J300201L441849J385727l794747
3719.6E44808273J470146O654816l823013m058876O523971J462136k63977l056260
3727.3E49717216M17672M420891Q53919N472451l187790q635178Q748474Q85163j2663193
3736E46029625O69136M537506K115402M017182K646827m934845L144684J2608643j1576729
3744.7E59257431j7332115J1679573O525192P220726m107704j3316612J0734291n264778
$$ y = [522903786, 527114792, 516936951, 515157089, 524523354, 519837418, 521079674, 526861229, 527547684, 529460602, 530082207, 530703239, 532304344, 532501335, 534845848, 537420731, 532573318, 531347923, 536595688, 538305397, 538556213, 538843536, 541864281, 546266479, 538434601, 541743469, 544399948, 531260071, 537026405, 542088127, 542475243, 543775444, 547217293, 548603020, 544808273, 546278419, 552933235, 549110222, 545051346, 551575317, 553037453, 552773476, 549717216, 550134888, 554555779, 555409698, 560882149, 557694359, 549059181, 557807655, 558692818, 546029625, 546698761, 551236267, 553351669, 557368851, 560015678, 555080833, 558225517, 570834160, 559257431, 541925316, 553604889, 560130081, 567350807, 563243103, 549926491, 560660782, 555396004]
3752.4E55396004m231606Q015442N166779K243385n701180K377778N595817q197479
3760.1E60664940j209984M808960J403885P96699L463288k981568m619178L848114
3767.8E66175156M962692l80783p580414K218285L281135O60095J612091j22413N56259
3776.5E71382103Q64296K735863l12157q142433K965202K405243N55267K245331k352714
3785.2E72346001J03492J371193J071244P79228m04701N89180q01M46662j90658J702766
3794.8E77813606L319931m343605m399757J872444M121399M619980o005135q519134
3802.5E68479729M749870L996277M968452N714798j1196251l703575N835381K400512
3810.2E81245193j01928K17361Q87261O43844M787216j994705j3811226N775986N802994
$$ y = [555396004, 551164398, 559179840, 564346619, 566590004, 560888824, 563266602, 568862419, 560664940, 559454956, 564263916, 565667801, 566464500, 569927788, 566946220, 562327042, 566175156, 571137848, 570757065, 563176651, 565394936, 568676071, 569336166, 570948257, 570825844, 571382103, 572246399, 574982262, 574670105, 566527672, 569492874, 571898117, 572453384, 574698715, 572346001, 572449493, 573820686, 574891930, 575671158, 575266457, 575855637, 575854836, 576301498, 576110840, 577813606, 581133537, 576789932, 572390175, 574262619, 578384018, 583003998, 576998863, 568479729, 573229599, 577225876, 582194328, 587909126, 576712875, 573009300, 578844681, 581245193, 581143265, 581360626, 582247887, 582891731, 587678947, 585684242, 571873016, 577649002, 583451996]
3818.9E83451996M294052o69670j8200913N492173P112732K289085L079147n3100m461174
3827.6E82334328M82292K183494M080658R36203q947448L358268P534523o959076j811752
3836.3E83191490J0104408q347816n935516Q350944n703621j11236P556114j311531
3844E87793236l945465L674469K099533L96766K557297k173195R14116N328560q519134
3852.7E88126183k344132j1959381M666100J1319847J52855j738739K114028K209359
3860.4E92546120K578811o321296p8583P519531p196808m588966M544258N103493O068268
3869.1F00174828q638878q758126M783554Q313904M400788j2513962P91321N342559
3876.8E93895988L41835J707726L714829o578522p124367O513977J478500J038819
$$ y = [583451996, 587746048, 587076378, 568875465, 574367638, 581480370, 583769455, 586848602, 586795502, 582334328, 582816620, 585000114, 589080772, 590016975, 581069527, 584427795, 591962318, 585003242, 583191490, 593295898, 584948082, 579012566, 587363510, 581659889, 581548653, 589104767, 587793236, 583847771, 587522240, 589621773, 590018539, 592575836, 590402641, 591316757, 596645317, 588126183, 585782051, 573822670, 578488770, 589808617, 589961472, 588222733, 590336761, 592546120, 595124931, 588803635, 588725052, 596244583, 589047775, 584458809, 589003067, 594106560, 600174828, 591535950, 582777824, 587561378, 595875282, 600276070, 587762108, 588553429, 593895988, 594237823, 595945549, 599660378, 593081856, 585957489, 592471466, 593949966, 594988785]
3884.5E94988785O122703j1963272O05011N062447O61468M475823p23000r527206J801071
3893.2E91503830M020538r15222R16062J180076J801758J453247r628372N472336K537384
3901.8E98341637o942635N579491l464508j611443J850014J709747L263931m54101
3909.6E98272133k46697r76410L57514P21245p38983J497650K138138l007927m357109
3918.2E93659554M762458O86264m230156L153267J984101L64036l040085j973343K722130
3926.9E98088226J476021Q27751j179123K3804J855774l158989j519699K869415N33829
3935.6E99817009J41983N57365j431541j27945R8953J893235K035064m433098j002235
3944.3E97548790J344681Q95157J910972j286468K88963K12822k932472J726341J203308
$$ y = [594988785, 601111488, 589148216, 589753227, 594815674, 595477142, 599952965, 599229965, 589702759, 591503830, 595524368, 594609146, 595525208, 596705284, 598507042, 599960289, 590331917, 595804253, 598341637, 591399002, 596978493, 593513985, 591902542, 593752556, 595462303, 598726234, 598272133, 598025436, 597049026, 597406540, 598127785, 597388802, 598886452, 601024590, 598016663, 593659554, 598422012, 599108276, 594878120, 598031387, 600015488, 600379524, 597339439, 595366096, 598088226, 599564247, 600391998, 599212875, 599236679, 601092453, 597933464, 596413765, 599283180, 599817009, 599958992, 600516357, 599084816, 598956871, 599055824, 600949059, 602984123, 598551025, 597548790, 598893471, 599788628, 601699600, 600413132, 600702095, 600914917, 597982445, 599708786, 600912094]
3953F00912094j099319P25364M48151m05769r10797J102828Q26493k21596k65274k032585
3962.6E99079590P18727J723747M04892k63901J374P00607q62808J20430Q18596K12326
3972.2F02653580j90239o5041K86980n96771K365k2278Q65364M69856j181144l56026
3981.9F01866646J07651P58209M539m23050K10152J59264j564L78723M07638p66029
3991.5F02702179L40195O93168J25771p93305j040229O59217P05605J003227O4888
4000.2F04460716
$$ y = [600912094, 599812775, 600538139, 600986290, 600580521, 599669724, 600772552, 601599045, 601377449, 601112175, 599079590, 599798317, 601522064, 601926956, 601663055, 601664429, 602365036, 601502228, 601622658, 602441254, 602653580, 602463341, 602398300, 602685280, 602088509, 602090874, 602068596, 602933960, 603403816, 602222672, 601866646, 601974297, 602732506, 602737045, 602313995, 602524147, 602683411, 602681847, 603060570, 603468208, 602702179, 603042374, 603735542, 603861313, 603068008, 602027779, 602686996, 603392601, 604395828, 604460716]
##END=$$ End of the data block
