##TITLE=$$ Begin of the data block
##JCAMP-DX=5.00 $$ ACD/SpecManager v 10.08
##SPECTROMETER/DATA SYSTEM=Varian
##DATE=20 Nov 2012 15:26:38
##DATA TYPE=INFRARED SPECTRUM
##DATA CLASS=XYDATA
##ORIGIN=
##OWNER=
##NPOINTS=3735
##FIRSTX=399.26403809
##LASTX=4000.35498047
##MAXX=4000.35498047
##MINX=399.26403809
##MAXY=72.49358368
##MINY=20.61643028
##XFACTOR=1.0000000000
##YFACTOR=0.000000100000000
##FIRSTY=53.38307953
##DELTAX=0.96440572
##XUNITS=1/CM
##YUNITS=TRANSMITTANCE
##XYDATA=(X++(Y..Y))
399.3 533830795 534134750 498097420 479719810 462397232 475673714 488508835 499659119 496547356
407 496547356 488344460 496478386 495084190 500258026 493391800 488778267 481733093 482668762 494927750
415.7 494927750 489408264 484148026 461163445 481423225 486942558 487032661 495752563 494474068
423.4 494474068 494567261 485042229 485577011 480705643 481903114 484180870 473317108 472498360 472017097
432.1 472017097 477529793 473682404 475351639 478853111 473764381 474718323 466587143 467117119 464046631
440.7 464046631 463087234 464160767 465573997 478233452 479784889 486087227 485741615 486375122 487931633
449.4 487931633 483522949 482056313 481584244 487305489 484582291 487554436 486795845 479133606 484135551
458.1 484135551 485232887 481557999 477358017 482755394 482100220 481884117 477430801 472890968 477262230
466.8 477262230 478197975 482854996 475298042 474885254 479393044 476137314 474340286 467535019 464695511
475.5 464695511 461440315 464234810 461147690 457689781 457919312 456600609 462398720 458177376 455055695
484.1 455055695 456164360 458089447 458273392 458787155 462967911 460175743 461480904 457395821 456375771
492.8 456375771 457032585 454716835 455731888 450461845 451553459 452963638 452771568 450137062 446494865
501.5 446494865 448058739 445920029 446722336 447993050 450403900 448962975 445725632 441967316 437105827
510.2 437105827 436765099 433235664 431612015 428294296 425982399 424282532 420476875 422540207 422437592
518.9 422437592 420158577 417073059 416300392 413836098 412395554 413256607 411281853 411461678 410868797
527.5 410868797 411599312 411460800 411087036 411256485 411008911 412366295 411044121 412703285 414310074
536.2 414310074 414824333 417767792 420242043 423631630 426008453 429809608 436304436 440594025 437210045
544.9 437210045 433891296 434665565 434010963 434784927 434831123 437036362 435729599 430875854 429421349
553.6 429421349 429511490 429579506 426394348 425624123 424792328 421861916 419351273 416246796 414001999
562.3 414001999 411856995 409935188 406221352 403749886 401848145 399306068 396169586 393305206
570 393305206 392259827 389054108 387774887 387380791 385453339 383186264 384223175 387242699 387438431
578.6 387438431 388691177 390359764 392645416 394899826 397839508 403026886 405980110 408576660
586.4 408576660 412427559 416575165 417589188 417618065 420074196 421585197 423557701 424682961 424699249
595 424699249 423972855 423451767 422821960 422165985 423747520 423414841 422471123 422520790 423491325 423249931
604.7 423249931 421931343 421204834 419904976 420374146 420832748 422573280 423193665 422688370 423749847
613.4 423749847 423949890 424543266 425372505 428947449 430076141 430286064 433327560 435148010 437202950
622 437202950 437431259 438503113 439325371 441354752 444838181 445623398 447678833 448310051 449970665
630.7 449970665 451511307 452090034 453632278 453612480 454048958 453360100 454755135 455965538 456495399
639.4 456495399 458115387 458074951 458854332 459557076 460832939 460920067 461322556 462604904 463670464
648.1 463670464 464619141 463398933 464228859 465119896 466299820 467166138 467269478 467816391 467195129
656.8 467195129 468062325 467651901 466636734 466001892 467674026 469183006 468417397 469221764 468774872
665.4 468774872 470708427 477037277 489066849 481439018 474667587 473115120 472583694 474562912
673.2 474562912 477343674 478422318 478436356 478449440 478830376 478289299 480060387 480575066 481004486 481960983
682.8 481960983 482828255 484332504 484290276 484996071 484030685 482983551 482281876 482454872 483170509 482154579
692.4 482154579 481816940 480925217 481491203 480700684 477788849 475440521 473354340 471792374 470332718
701.1 470332718 470257874 468214226 466651306 466827202 466109276 464744453 463519402 464207497 463762512
709.8 463762512 463899002 464596291 465218086 466301765 467353973 469895706 471931190 475028191 477150726
718.5 477150726 478843536 481311035 482766228 485486870 487442207 489909058 492680092 496136475
726.2 496136475 499577103 501791840 503991280 504922104 507061310 508456039 509975853 511335640 512494278
734.9 512494278 514521103 515145569 517671204 518998032 519131546 519352722 519896431 519690094 517067719
743.6 517067719 516737823 516509399 515699196 513789825 512580872 511586151 509521523 508503685 505253601
752.2 505253601 502474060 499409218 498209686 497629509 493919907 491155014 488114014 486653137 485212784
760.9 485212784 482678947 480422707 480037460 481331673 481541138 482958031 484089584 485796089 487540016
769.6 487540016 489597816 492863464 495050964 498710442 502706146 506866951 510295181 514538689
777.3 514538689 519222488 521747551 525289383 528414879 532239342 535126076 536853180 538611717
785 538611717 540904541 544227943 544826622 546216888 547912674 550188103 551660881 551864166 554223251
793.7 554223251 555625114 557748184 559460716 561474304 563089752 563982162 565939903 567220497 569997253
802.4 569997253 571741905 573240128 574221840 575396461 577267570 577376137 578320236 579158325 580765114
811.1 580765114 580861893 579959602 579723663 580300484 581692581 581895790 582939606 581971703 581523666 581705818
820.7 581705818 581364326 580949821 578963356 579033737 577922935 576684723 575783157 575027809 574522972
829.4 574522972 572549019 570898056 567413521 564530869 561883736 559529762 557328682 554657822
837.1 554657822 552630959 549810524 548223686 545928535 544353027 542480278 539624596 538217316
844.8 538217316 536621399 535564957 533929405 532980309 531116066 529168930 528164215 526317787 525170631
853.5 525170631 522548027 519755096 517706299 516416435 515230408 513825111 511788826 510138779
861.2 510138779 511586494 513227806 516051102 519088249 523006897 528283424 532933693 538592262
868.9 538592262 543217697 548852425 552970047 555894318 560347328 563284378 565760193 567137527
876.7 567137527 569270248 569780083 569030113 567861023 565786018 564726524 561952667 559236107 555899849
885.3 555899849 553769150 551334343 548067169 546333542 543826942 542522202 540551949 538903427
893 538903427 536553383 534065208 533009682 530768433 529001465 527441025 527081985 525183868 523154221
901.7 523154221 521853981 519222717 517104607 513883705 510881996 506747665 503147736 500387840
909.4 500387840 496986313 493647995 488963547 485060730 480368805 475643120 471153679 466841888
917.2 466841888 462647362 457143593 453135529 450364151 448364639 446147881 444473495 443511848 442630539
925.8 442630539 442585945 442354088 442141495 441389351 442000542 443277740 443606567 444173965 445398140 447518768
935.5 447518768 448853378 450740662 452671509 454659386 457637177 459773712 461662941 463515396
943.2 463515396 465495987 465852470 465489998 464591217 462399216 460209007 456121445 451913834 447559395
951.9 447559395 442458992 436830368 430740585 424517860 417704201 410824699 403334351 396875496
959.6 396875496 390380554 383384171 375587120 367545815 360876198 353592339 345676155 337341805
967.3 337341805 329740601 321797256 313704910 305970497 298522320 291029282 282409935 275309639
975 275309639 268250675 261106930 253557549 246469173 240545120 234773808 230504513 225938931 222169380
983.7 222169380 218546848 215359592 212610626 210616074 209692421 208045635 207333355 206472511 207034988
992.4 207034988 207009468 206164303 206310158 206276588 207558956 207952290 208240414 208213158 208706875 209350128
1002 209350128 209269409 210113010 210387611 211205482 210595798 210004139 209726009 209479370 210034180 209403534
1011.7 209403534 209021378 207520390 207948780 208290691 207749767 208595905 208326530 209523735 210418434
1020.3 210418434 211173248 212034798 212926903 213714161 214647522 216506157 217081299 218571758 219418488
1029 219418488 220950127 222358246 223495426 225899277 226604862 228427544 229153099 229364300 229655190
1037.7 229655190 229858780 230199394 230035229 231709023 231229248 231270294 231799393 231711655 232051315 232517319
1047.4 232517319 234025249 233762665 235076294 235994911 237615547 239952545 240987568 243810253 245489178
1056 245489178 247914391 250218067 253535156 257418518 260548916 265047188 269020500 273347321 276807346
1064.7 276807346 280957546 284321728 286780338 288980064 288720627 287505417 283065071 278435955
1072.4 278435955 273152027 267530785 263877773 260508728 258575535 256273365 255796795 255530777 255954494
1081.1 255954494 256201630 256263103 257714119 258322220 260751057 261534214 262979908 265181389 267078400
1089.8 267078400 269585629 270860023 274657364 277412434 279528027 281462364 283512363 286378822
1097.5 286378822 287250080 288111553 288342419 289153423 289408951 290092793 290984573 290353012 290747681 291188469
1107.1 291188469 292798443 293874702 295143471 296627655 298493919 300949345 301880779 303816700
1114.9 303816700 305188541 307442913 309146671 309502449 310585842 311196404 312875633 313721695 314958305
1123.5 314958305 316059532 316726990 317998676 319022408 320459595 321781082 324942436 327130127
1131.2 327130127 328743820 331213264 332873497 333924065 333649101 333536606 332180824 330901794 329641647
1139.9 329641647 327439117 324754677 320444565 316790466 312836800 310178089 307138271 303362293
1147.6 303362293 300555344 297449379 295252094 292649174 291625004 289994469 288664951 288136959
1155.4 288136959 287160511 287693081 287471981 288064365 287782745 288278713 289328384 290098305 292694874
1164 292694874 294900551 297826405 299950809 303429890 307753601 311748829 316728191 321351624 326578293
1172.7 326578293 331481056 337356377 342801247 347893448 354078979 360045815 365978127 371461792
1180.4 371461792 377947617 383933334 389375572 394912186 399221535 404053116 408704567 412817688
1188.1 412817688 416703262 420084953 423304596 426426430 429405289 430889549 432064896 433223648
1195.9 433223648 434235001 435474701 435653381 435940704 436885452 438171310 438778572 439494438 440585136
1204.5 440585136 440977020 441915207 442763329 443992081 445689392 447330017 449138794 451031685 453227539
1213.2 453227539 455031433 457218132 459055214 460545502 462558289 464189377 465724411 466742516
1220.9 466742516 467666283 468069115 468242607 468759499 468452034 467810745 467114143 466444435 465613899 465034256
1230.6 465034256 463954048 462921028 462467918 461649246 461265182 460511894 459842186 459143906 458356934
1239.3 458356934 457952919 457533226 457196960 456807442 457564087 457880440 457877884 458756065 459248238 459624786
1248.9 459624786 460234032 461332359 461881561 462572861 463761749 464583168 465522957 466144409 466936989
1257.6 466936989 467511139 467881851 467994537 468366165 469525681 469853477 470193863 471010818 472014084
1266.3 472014084 472694550 473360329 474417191 475021935 475820351 476786728 477922554 478536835 479157715
1274.9 479157715 479793358 479536858 479485741 479169655 478998566 478443718 477994766 478007050 477792168 477855186
1284.6 477855186 477130203 476642609 476100616 475572395 475278893 474547348 474216385 473715858 473410339 472939453
1294.2 472939453 472212677 471020164 469980850 469568214 468590622 467812653 466892319 465997009 464903412
1302.9 464903412 463839188 463250122 462747231 462384224 461480484 460894775 460222168 459514465 458829384
1311.6 458829384 457618713 456754532 456729088 457119980 456174469 455122566 454568977 453900375 453660088
1320.3 453660088 453086777 452129936 450703545 449298210 447683525 446179237 444537468 442383804 440206680
1328.9 440206680 437878876 436025276 433893661 431798782 429802170 427997322 426571960 425260201
1336.7 425260201 424215393 423170204 422586784 422398338 423028946 423277283 423480415 423742828 423819962
1345.3 423819962 424275093 424270859 424565277 424422417 424048729 424165726 423983192 423667450 423143768 423182678
1355 423182678 422902107 422732010 422532158 421706390 421450462 420703697 419940071 419362411 418298454 417990799
1364.6 417990799 418064423 417749367 417482567 417299805 416754913 416714363 416408691 416813965 416982994 416040306
1374.3 416040306 416445198 417400208 418293152 418547630 419376183 419823532 420222015 421140823 421660423 422642860
1383.9 422642860 423606873 425383987 426786270 427906456 430125084 432121010 433829727 434903069
1391.6 434903069 435910492 436248856 435407410 435014000 436054726 436523743 435822563 434451256 434092255
1400.3 434092255 434811287 434321899 433431587 432878189 431335831 430811462 430554276 429957352 429137230
1409 429137230 428181686 427098122 426227417 425924568 425543747 424989357 424157867 423511620 422751427 422422104
1418.6 422422104 420696068 421039658 422688446 422818794 422870979 422263069 423217049 424336853 424177551
1427.3 424177551 424873466 424726448 425099144 425709648 426752281 427790375 428061218 429360199 429740868
1436 429740868 429058189 429663124 431824112 433140945 433461952 434160385 434525261 435867195 436345444
1444.7 436345444 436921463 437369423 437151146 436195908 436007996 436854210 435790596 435164909 434542809
1453.3 434542809 434350510 433804169 431982918 430272141 425925179 428499794 430038071 432315140 432828751
1462 432828751 433116341 435323372 434564705 436528854 438357124 440960579 442950249 445937271 449846687
1470.7 449846687 451467972 455297394 457222900 463419991 467628746 471361694 475730438 478957291
1478.4 478957291 482802773 485588570 489139824 491872940 495172539 497834778 499876060 502759857
1486.1 502759857 504164505 506757088 507997971 509714127 512478294 515653534 518699799 520026398
1493.8 520026398 521954575 522129936 521624985 524750290 527107086 528028374 530110130 532045746 532482567
1502.5 532482567 534414368 535776863 536379166 528445206 525300598 534305191 536798096 539985161
1510.2 539985161 541746216 542556534 542837753 544537048 544923515 543035889 543164749 543169174 546807098
1518.9 546807098 548255768 544661407 545269699 546388779 549083710 550702324 551740532 551646843 552408676
1527.6 552408676 552647209 552980652 554650421 554010468 553743172 552208328 551411667 554146423 554687996
1536.3 554687996 555452766 555252151 547578087 538621864 545880051 549987106 551224251 554801750 554460564
1545 554460564 553072624 554349670 555304031 555964470 554242554 552294350 553131599 553995934 553648109
1553.6 553648109 551353302 551405144 552716141 552345543 538970947 534514885 543725357 549335327 551871567
1562.3 551871567 552380791 552673683 551110649 550800552 551077843 550844727 550051689 546116104 548041687
1571 548041687 549746208 550195503 550042114 549726944 547895737 543665276 547063370 548682556 549028664
1579.7 549028664 549036827 548317184 548122826 547804680 547640495 547199287 546524582 546129494 545742149 545169220
1589.3 545169220 544087181 543581161 542710686 542299538 541570549 540073395 539461021 538564262 538060722
1598 538060722 536991882 536041183 535227699 534245338 533219109 531485710 530821571 529961090 528883247
1606.7 528883247 527262650 526266365 525059814 522876282 521967964 520627518 519688339 517794876 516846809
1615.4 516846809 515197563 507344360 508258629 508258400 507898941 506265717 505088844 502866631 498236885
1624 498236885 498966827 498845634 498296890 495343666 493190727 492748566 491878166 491093597 489945107
1632.7 489945107 490050850 489486732 483607864 482198448 483679428 483685570 484434128 485300522 484405479
1641.4 484405479 484716873 484107971 484504089 484851723 482095032 481117744 482032623 485487633 487295761
1650.1 487295761 489703064 491156998 485555000 482878494 489362564 493870087 495874825 497846565
1657.8 497846565 499144287 500958710 502378998 503999367 505718803 506302986 509089851 511216965
1665.5 511216965 513366356 515100250 516585770 515978851 517937202 522323608 524160576 526955299
1673.2 526955299 529975662 531645432 531660576 534746056 537791443 539637871 541508179 542461243 545856857
1681.9 545856857 548554344 547046814 546928940 551088943 555714722 558437729 559792519 561346550
1689.6 561346550 563096771 565397034 567632523 569407082 571766052 572786560 569245071 573200264
1697.3 573200264 576617165 580886612 581436424 576124344 580969467 584254875 585958023 585310249 586686211
1706 586686211 587413979 588670120 590957794 591920547 592318878 592628860 593602867 594188423 592867928
1714.7 592867928 592235298 594000587 595271873 593581352 597327652 599887581 601094856 601616783 602134056
1723.4 602134056 602768593 603498802 604663887 605052643 605773277 606799469 605953255 605711746 607765312
1732 607765312 609000473 605006943 604483681 608553848 611365585 612096329 613230934 612703247 611236954
1740.7 611236954 614585724 616347427 616100159 616568604 618077774 618996162 618895073 619581413 619709892
1749.4 619709892 622529259 623041725 622411156 625416222 626836815 628004608 629682693 629434776 629813843
1758.1 629813843 630997200 631678505 633454323 633293762 633325577 636196404 637449150 637990952 638557701
1766.8 638557701 639076500 637858315 639061279 641458817 639321632 637586975 638477859 641810608 643515701
1775.4 643515701 642387848 643961868 644384232 645048828 645243759 644520035 645646210 646793976 647836304
1784.1 647836304 647398376 647576370 648522644 649046707 648960495 649301758 649217072 648347549 647588654 647328491
1793.8 647328491 649722595 650577927 650390930 651398849 651946335 651911697 651144257 652902756 652906036 652473068
1803.4 652473068 653647003 654044952 654713974 654629822 654547119 654989853 655599442 654832306 654865570 655956573
1813 655956573 656137543 656865158 656652298 657106400 657288361 657243500 658142776 657795105 658003082 657652130
1822.7 657652130 658011322 658486710 656796494 657521057 658895874 659917755 659189835 657199478 658689880
1831.4 658689880 660459061 660409470 660406036 660749130 660852356 661199722 660642166 661250381 661598282 661521988
1841 661521988 661054916 660660324 660750427 657617035 659589462 661571655 661497955 661318436 661764832 662988358
1850.7 662988358 662753448 662783813 662609711 662422180 662336197 661982040 662527847 662258835 662427216 662352295
1860.3 662352295 662339859 662535324 662687912 663243027 663103867 663096771 661975784 661982346 661779938 660604095
1869.9 660604095 661879654 663024979 663875427 663822174 664240112 664479904 664008255 663756714 663785324 664495544
1879.6 664495544 664394760 664451370 664252625 664320374 664412003 664199219 664766083 664502411 665169601 665259933
1889.2 665259933 664099426 664885483 665482864 665348816 665396118 665289459 664641037 665532837 666152039 666139221
1898.9 666139221 666114807 665743790 666152191 666149597 666207123 666032028 666207657 666413651 665670090 665546265
1908.5 665546265 665604401 665998688 666227417 666670761 666506729 666414871 666781540 666566849 667129974 665159912
1918.2 665159912 664525146 666158524 666613770 666919327 666306458 666207504 666586838 666870804 666911240 666734085
1927.8 666734085 666653976 666626663 666908493 666768646 666960144 666758881 666663132 666694717 666425095 666480026
1937.5 666480026 666183777 666581802 666639328 667123947 667038574 665487671 666651001 667282486 666561279 666442871
1947.1 666442871 667047729 667216568 666907272 666844025 666998215 667635956 667713776 667389374 667045212 667280197
1956.7 667280197 667445221 667366562 667754211 667477188 667488098 667676620 668050919 668235855 667891464 667830048
1966.4 667830048 667488937 667849808 668332291 668563995 668503342 668418198 668485947 668263626 668104019 667939148
1976 667939148 668499680 668688278 668531799 668455200 668421631 668784790 668504486 668427353 668279724 668420105
1985.7 668420105 668666382 668451385 668179321 667830276 668716431 668839645 667612610 667412109 668121490
1994.3 668121490 668542175 668468399 668794250 668559341 668439636 668125916 667928162 668152618 668015976 668152237
2004 668152237 667750549 667689819 667789688 667710495 667627487 667459335 667555542 667174072 667091751 666966095 667125854
2014.6 667125854 667379837 667022934 666570206 666244354 666238556 665652771 665609131 665595245 665496140 665742874
2024.2 665742874 665275955 665030441 664654541 664736176 664862137 664625168 664396286 664029083 664091949 663622742
2033.9 663622742 663211899 663144150 663392258 663477478 662892532 662312317 661859131 661985016 661999130 662108612
2043.5 662108612 661882248 661662598 661862564 661863022 662079086 661700668 661629257 661569672 661501846 661492920 661151505
2054.1 661151505 661437836 661356430 661312408 660720062 660276642 660875931 661307831 661311417 660847015 661084900
2063.8 661084900 660807800 660591354 661152420 661296921 661264114 660965271 661253357 661440277 661503754 661324844
2073.4 661324844 661097031 661326370 661302261 661511536 661468811 661640472 661642609 661533432 661538086 661239395 661295013
2084 661295013 660951996 660900955 660917740 661072693 661601105 661657639 661430130 661181183 661572418 661681290
2093.7 661681290 661852875 662016373 661646805 661421814 661578217 662093735 661833420 661684570 661802597 662138824
2103.3 662138824 662387238 662162018 662346344 662110748 662019348 662007217 662328033 662640686 662293701 662363739
2113 662363739 662524796 662689514 662442017 662583237 662634125 662591019 663093338 662931824 662680740 662300339
2122.6 662300339 662501526 662593231 662414169 662646408 662441940 662514877 662487335 662626801 662739792 662640457
2132.3 662640457 662383881 662208252 662457047 662263336 662395859 662298355 662392426 662769623 662908096 663020859
2141.9 663020859 662785568 662901764 662478256 662416687 662581177 662410812 662464066 662426605 662740097 662400131
2151.5 662400131 662236710 662289734 662508774 662836151 662645187 662702560 662566147 662972488 663133926 663345184
2161.2 663345184 663602676 663454056 663752213 663482361 663767471 664017715 664052811 664108124 664073334 664520340
2170.8 664520340 664605713 665086212 665069809 664930649 665122299 665366287 665899887 665985184 666169739 666037216
2180.5 666037216 666218643 666419449 666473618 666742554 666843185 667118912 666968002 667189789 667466736 667783203
2190.1 667783203 667967300 667746506 667944107 668244476 668679047 668445129 668420410 668642578 668798523 668760529
2199.8 668760529 668616791 669277115 669309998 669727173 669888763 669714813 670240784 670496445 670576401 670119553
2209.4 670119553 670542679 670719147 670428238 670702820 671065140 671593170 671499557 671734695 671549072 671393204
2219 671393204 671620255 671769638 672135086 672060394 672505188 672497940 672493591 672464142 672396698 672846680 672815704
2229.7 672815704 673111572 672989120 673206482 673647156 673770676 673573990 672994003 673369598 673644638 673859787
2239.3 673859787 673570557 673518372 673968658 673813400 673625412 673407135 673945694 674169235 674233627 674312973
2248.9 674312973 674448318 674607925 674335861 674933090 675030518 675299225 675501556 675172348 674968033 674940262
2258.6 674940262 675771179 675818176 675877533 675656509 675572662 675699387 675351257 675935974 676330566 676769257
2268.2 676769257 676577911 676642303 676807556 676688614 677132874 677097702 677597351 676957626 676810760 677186890
2277.9 677186890 676760330 676862411 676601334 676814651 676363068 676637726 677167664 677365341 677926331 677688293
2287.5 677688293 678512573 678427582 678661652 679076080 679058609 679908829 679920502 680691833 680866318 681794434
2297.2 681794434 682599640 682195206 682864685 682853775 683430939 683671875 684347610 685360794 686049271 687392120
2306.8 687392120 687884064 688831024 689192352 690343857 691472321 691541138 691994324 691896515 693250275
2315.5 693250275 694209824 695536880 696826401 697949295 700614853 701368027 702481918 704190826 705000229
2324.2 705000229 705022354 706202469 707930069 707996445 708498840 707670975 708545532 709894104 709740982
2332.8 709740982 709519653 708622513 710560074 711282654 709756851 709150848 709848633 711638718 712127838
2341.5 712127838 712137909 711016235 710305176 708963013 706145554 701977692 696849518 697790222 703551636
2350.2 703551636 707064743 709627075 711475067 712999115 716513672 718776932 721494980 722197266
2357.9 722197266 723415833 724935837 724112625 723400421 722504501 723260651 721735077 719421921 717012787
2366.6 717012787 714075241 711708069 708417130 705751724 702637100 700715332 698732910 695936203
2374.3 695936203 693913116 691247635 688794098 686345444 684205246 682280121 680522156 678648758
2382 678648758 676411285 675162125 674359970 674170380 673622131 672702026 672448959 672294006 672114563 671609726
2391.7 671609726 671610565 671327438 670949707 670941315 670891418 671104965 670811691 670817184 670709839 670588837 670481720
2402.3 670481720 670336380 670637817 670362549 670299454 670058289 669851837 669701538 669319153 669140320 668604813
2411.9 668604813 668443375 668608551 669146500 668942947 668289032 668249588 668074493 667934875 667511902 667381744
2421.6 667381744 666765366 666174316 666548538 666740494 666558456 665993805 665912094 665475082 664920731 664676895
2431.2 664676895 664406433 664469833 664400940 664722900 664521179 663925095 663448639 663303680 663512268 663164368
2440.8 663164368 662801056 662364044 662405243 662046585 661363220 661511536 661611176 661441803 660861740 660495758
2450.5 660495758 660144348 660147095 660299988 660013885 659782181 659393845 659262772 658938522 659070740 659183197
2460.1 659183197 658761444 658558807 658158264 657776184 657184677 657222900 657265244 657138519 657126160 656815491
2469.8 656815491 657027130 656630249 656081238 655635986 655309677 655289307 655168533 655271225 655049057 654998169
2479.4 654998169 654805374 654654388 654481812 654324112 654240341 653692093 653676529 653319626 653312912 653169174
2489.1 653169174 652511063 652580414 652484665 652839508 652850342 652482758 652152328 651706390 651446075 651097641
2498.7 651097641 651117859 651182556 651335526 651243973 651454773 651378098 650714188 650668030 650357819 650390930 650427017
2509.3 650427017 650412140 650199814 649707260 649952087 649825897 649529572 649366302 649592438 649474335 648988724
2519 648988724 649037476 648734894 648289185 647791367 647798767 647852859 647763290 647850189 647681046 647747345 647487183
2529.6 647487183 647053070 646614227 646401215 646490326 646405106 645954514 645516739 645451584 644823151 644614105
2539.2 644614105 644543381 644176178 643879547 643505936 643693237 643363266 643033752 642726288 642198257 642168884
2548.9 642168884 642290802 642204590 641623993 641396255 641100998 640906677 640720673 640520096 640700607 640229034
2558.5 640229034 639782219 639551811 639718361 639406891 638710594 638403206 637967682 638198204 638172951 638087387
2568.1 638087387 638030663 637541466 636881981 636614914 636997910 636578560 636230164 635889969 635595818 635292320
2577.8 635292320 634706993 634916534 635129433 635216713 634670296 634406166 634403915 633938828 633595810 633171005
2587.4 633171005 633222198 632811012 632875481 632913170 632336922 632484169 632283821 632081337 631592751 631340523
2597.1 631340523 631411781 631311722 631246529 630975685 631001778 630622406 630474739 630263519 629845200 629587746
2606.7 629587746 629298058 629611473 629551773 629399261 629004898 628331375 627822533 627621040 627755775 627492523
2616.4 627492523 627201424 626624947 626472244 626196136 625523529 625382805 624955025 624640808 624610062 624616470
2626 624616470 623989792 623306885 622828789 622165680 621748161 621201935 621196442 621061134 620721550 620326881
2635.6 620326881 619641190 618987312 618239136 617854843 617151489 616904373 616806831 616415176 616023293 615228577
2645.3 615228577 614836311 614303322 613984413 613432541 613138313 613170280 612337875 611795273 611280937 611183739
2654.9 611183739 610841637 610379677 610035896 609006004 608545609 608410378 608215103 607338066 606742439
2663.6 606742439 606703644 606657600 606712608 605807571 605165291 604739380 604355087 604258423 604174728 603800545
2673.3 603800545 602885437 602655678 602649193 602787132 602531204 601775818 601048470 600300484 600003510 599604988
2682.9 599604988 599475288 599080887 598679695 598508530 598417625 598463821 597401733 596670609 596716194 596818924
2692.5 596818924 596461296 596035576 595982704 595592690 595332489 594545212 593838959 593452530 593226013 593168716
2702.2 593168716 592517548 592055779 591615143 591070747 590700417 590737190 590143433 589323883 589076004 588299065
2711.8 588299065 587940598 587609673 587260704 586942940 586611176 586501350 586175117 585952225 585211868 585124016
2721.5 585124016 585060501 584588776 584414101 584018631 583644485 582497253 581816483 581691589 581904793 582017632
2731.1 582017632 581473389 581187134 580590782 580558853 580220642 579736671 579368553 578758850 578866386 578637581
2740.8 578637581 578346252 577787399 577721367 577591209 577285194 577711716 577208366 576845779 576378937 575935707
2750.4 575935707 575788345 575601768 575442047 574886971 575032730 574556999 573712502 573670845 573970757 573632011
2760 573632011 573007851 573121758 572777557 572627945 572257919 572032585 572082062 571674576 571744537 571726761
2769.7 571726761 571877975 571474991 570927696 570545998 570241051 570218620 569551506 569281044 568744812 568116493
2779.3 568116493 567856750 567743149 567524605 566970215 566826630 566333580 566172333 565704689 565278358 564963799
2789 564963799 564011459 564034424 563524437 562761536 562465134 562253838 561685295 560536804 559953384 559326706
2798.6 559326706 558780937 558093300 557515411 557106552 556746025 556347809 555222321 554467430 553841286
2807.3 553841286 553370895 552544746 551613350 550965195 550070457 549941521 549449158 548557587 547612877 546859550
2816.9 546859550 546099625 544917336 544424477 543751411 542674904 541311378 540294456 539525795 538568306
2825.6 538568306 537750473 536737099 535996094 534752083 533946419 533528366 532367096 531187630 530050659
2834.3 530050659 529077492 527805557 526819801 525448074 523770523 522312660 520605278 519545288 518114395
2843 518114395 516577187 514910126 513230362 512091293 510558395 509107285 507281952 505447350 504174232
2851.7 504174232 503119965 501889305 500457687 499226379 498099594 497183914 496257362 495687332 494676590
2860.3 494676590 493168221 491909561 490691566 489499741 488064270 486584282 484442329 482145844
2868.1 482145844 480053101 478301353 476975708 475173454 473195038 470631523 468232498 466048355
2875.8 466048355 463978882 462106934 459929733 458202400 456318970 454689445 453270607 452141342
2883.5 452141342 450892067 449048424 448046761 447045174 445945778 445003662 444938393 444797630 443721542
2892.2 443721542 443309708 443150864 443544807 443139915 442291451 442178688 441623421 440934525 440451317 440601501
2901.8 440601501 440559883 440093155 438986130 437960854 437366409 436441002 436085815 435423851 434580307
2910.5 434580307 433210258 431796989 430817528 429490204 428541412 426859169 424978561 423405190 422106094
2919.2 422106094 420365257 418441353 417438278 416096840 415001984 413613434 412816010 412265282 411601791
2927.8 411601791 411928062 411456909 411239395 411206932 411435280 412046738 412884827 414218788 415332413
2936.5 415332413 417096252 418835716 420912209 422735329 424412460 426834412 429018898 431219063
2944.2 431219063 433061714 435453644 437840157 439858017 441797104 443825912 446920967 449696541
2952 449696541 451630745 452986717 455077057 457277832 459447594 462024345 463682518 465557289 467117844
2960.6 467117844 468815231 470868263 472764702 474580879 475740814 477053108 478345757 479713631
2968.3 479713631 480880432 482509270 484294167 485690536 487506065 488804016 489891815 490948753
2976.1 490948753 492624588 494400101 495946579 497705841 498859978 499802971 500661583 502500839 504041290
2984.7 504041290 505003357 506474495 507652588 509072037 510277748 511398430 512379837 513766518 514890518
2993.4 514890518 515053711 515812950 516685066 517741737 518388748 518628387 518791389 518949051 519478035
3002.1 519478035 519884415 520122261 520190659 520869408 520927582 520379829 519784203 519397736 520073128 520244370
3011.7 520244370 519710693 518816719 518964500 518820763 517812462 517482300 516689873 516185455 515459785
3020.4 515459785 515088959 514459152 513519135 513475113 512444725 511381798 510655441 510301666 509385147
3029.1 509385147 508462982 508056183 506782379 506305008 505671272 504863853 503768959 502431526 501616516
3037.8 501616516 500599518 499550667 498546143 498106270 497001877 496151924 495387039 494239426 493346062
3046.5 493346062 491951752 491331215 489832535 488692665 488088646 486970825 486393776 484928627 483942680
3055.1 483942680 482879639 481782112 480906601 479601021 478188477 476799736 476363602 475534935 474849815
3063.8 474849815 473488235 471929626 471011124 469738007 469328041 468076477 466568489 465334167 464233360
3072.5 464233360 463698883 462963371 461784058 460347481 459685326 458541451 457706299 456846657 455728035
3081.2 455728035 454684601 452861404 452153816 451136398 450089340 448834229 447371292 446611748 445378456
3089.9 445378456 444577827 443424950 442768097 441679573 440219002 439379234 438029022 437194214 435977631
3098.5 435977631 435407143 434318542 432484894 431664124 430940475 430140495 428664360 427737427 426465569
3107.2 426465569 425345268 424618797 423321571 422493439 421175385 420265846 419383278 418490181 417465858
3115.9 417465858 416278458 415692291 414403877 413366203 412351494 411262703 409930840 408391113
3123.6 408391113 407343826 406466675 405826263 404716263 403868065 402908554 401917725 401112823 400242615
3132.3 400242615 399326096 398100815 397387276 396154709 395168343 393981285 392527275 391698227 390458298
3141 390458298 390013542 389262886 387944069 387020493 386329002 385297737 384244499 383670998 382664337
3149.6 382664337 382157974 381200714 380024033 378753510 377490196 377017288 376169739 375432892 373958664
3158.3 373958664 373412628 373348732 372300987 371183281 369687119 369187660 368369637 367590637 366595993
3167 366595993 365134430 364080849 362843437 362835960 362625465 362207375 361271973 360057640 359209785 358120995
3176.6 358120995 357686157 356247368 355370369 354845009 353829041 353253365 352638855 352298012 351205940
3185.3 351205940 350738029 350334167 349270248 348117256 346852112 346254272 345437775 344805756 344137650
3194 344137650 343651772 343115044 342396317 341696930 340627060 340269585 339473152 338769264 338086815 337090950
3203.6 337090950 336489868 335885315 335762787 335110664 334160881 333300056 332602654 331760788 331053047 331023331
3213.3 331023331 330446472 329732628 328755722 328259125 328290520 328012085 327210007 326336060 325923157 324893074
3222.9 324893074 324651222 324234238 323292923 322798157 321918411 321497154 321016006 320422897 319719257 319597435
3232.6 319597435 319563580 318820705 317977657 317180367 317185936 316553593 316173820 315753479 314666424 314276695
3242.2 314276695 314153423 314244461 313086624 312247753 312026939 311708069 311726456 310956326 310281048 309591579
3251.9 309591579 309081707 308502045 308190842 307963448 307366829 306952896 306035748 306186943 306204720 305601921
3261.5 305601921 305006847 304245491 304298077 303950825 303412151 302658863 302382278 302698135 302651024 302408180
3271.2 302408180 302063160 301737690 300670681 300213566 299868698 299438305 299397202 299153328 299241848 298780613
3280.8 298780613 298445168 297910652 297310772 297063560 296746998 296543808 296051064 295847549 295269356 295502357
3290.4 295502357 295767365 294875164 294178448 293387623 293262501 293172207 293248787 293115234 292418995 291829472
3300.1 291829472 291540356 291909180 291374798 290842438 290423927 290129585 290629139 290574474 289620209 288633366
3309.7 288633366 288693581 288357754 287858143 287439442 286788578 286417446 286155396 286328812 285653706 284875603
3319.4 284875603 284483910 284415760 284232693 283571129 283434010 282909412 282800922 282347107 281801720 281678543
3329 281678543 280917797 280388393 279729328 279446239 279134998 279179745 279348793 278833389 278115044 277307606
3338.7 277307606 277396793 276939926 276285954 275840263 275592632 275613480 275022449 274774399 274161549 273603382
3348.3 273603382 273296547 273401375 273250351 272530861 272099686 271230488 271211643 270597000 270004311 269875793
3357.9 269875793 269125328 268890686 268198795 268037872 267644711 267492504 267485962 266396141 265720100 265235462
3367.6 265235462 265568199 265439529 265024624 264640160 264014587 263647251 263092976 263146000 262584496 262289028
3377.2 262289028 262148972 261615200 261460438 260881653 260757008 260771828 260844707 260333748 259694157 259590397
3386.9 259590397 259306450 259349289 259341145 259397869 259058037 258382511 257548733 257150173 257242165 257125950
3396.5 257125950 256635647 255848179 256659355 257334652 257270470 256930161 256280289 256190987 255691242 256040268
3406.2 256040268 255604610 254674416 254894485 255338650 255550442 254926567 255384331 255352840 254861145 254974442
3415.8 254974442 255006256 255346622 255029087 254889526 254599266 254728909 254696903 254376640 254732704 254488125
3425.5 254488125 254381294 254099693 254099960 254372196 255151997 255566387 254481297 254122543 254174709 254834957
3435.1 254834957 255153503 255072021 255251560 255372944 255716343 255644512 256023464 255772858 255874310 256426392
3444.7 256426392 256698952 257202187 256341190 256294613 256850929 257506466 257536392 257068768 257958736 258688946
3454.4 258688946 258856163 258779240 259341049 259863586 260141048 260632935 260684280 261051159 261552734 262098885
3464 262098885 262088680 262492161 263204498 263605595 264297810 264576550 265117168 264825382 264380722 265106411
3473.7 265106411 266085587 265932865 265343094 266368179 267152538 267346878 267366924 268122501 268773632 268472996
3483.3 268472996 269251537 269568539 270265408 271096249 271225109 271204281 271477356 272683277 272965374 273508320
3493 273508320 274305725 274693565 274903965 274677105 275326118 276343346 277140160 277546120 278607712 278731728
3502.6 278731728 277670307 278150826 279185371 280290527 280912762 282041225 282177105 281825562 283099728
3511.3 283099728 283317795 283504696 284129696 285095787 286165962 286649342 287078438 287436428 287974472
3520 287974472 288947544 290432186 290358791 289371319 289981861 291644878 292967854 292620316 292608547 293377495
3529.6 293377495 294740448 295495567 295824795 296486454 296824055 297989178 297737141 297434540 298881454
3538.3 298881454 300085945 301298485 301969910 303113651 304204998 304886513 304858093 304544163 306038094
3547 306038094 306535950 307299595 308659401 310437870 312132397 311150227 311486778 312478008 313516712
3555.6 313516712 314898415 315394783 317295074 318999672 319170265 319878063 322229500 323461380 323121414
3564.3 323121414 325808792 326322670 324610291 324849625 325623055 329271736 331288834 332838097 334881706
3573 334881706 335736160 336512985 337529984 339130478 339867477 341945343 343652573 344439735 346360321
3581.7 346360321 347722969 349677658 351287804 355152931 356756058 353047485 354041710 354162750 358052330
3590.4 358052330 361970673 365093307 366978645 367159309 369814224 368125534 370755463 374938240
3598.1 374938240 375647278 378177299 378258820 379507942 382280693 384385338 385944481 388278732 390433998
3606.8 390433998 388936806 392828712 392993050 392221107 399020004 400772705 399144478 402645912 403138161
3615.4 403138161 407179337 412141190 412204285 412913246 411490822 413079185 417773590 420719681 422953873
3624.1 422953873 425500183 427792702 429785423 435684013 434253082 422999840 428694077 434428787
3631.8 434428787 440115738 440993271 439523506 441991882 445154533 447774315 447995186 449753113 451980324
3640.5 451980324 454654083 455950279 455866928 458690300 462446671 468135529 465902939 460625038 464909554
3649.2 464909554 465355148 463652802 464545670 471377869 475742111 479916801 483963203 474745293 477599869
3657.9 477599869 483802185 485701027 487433281 488607140 490352707 491448898 493414497 495629234
3665.6 495629234 496435509 500061684 502425652 501140747 501306114 495382233 498614655 506817627 513565216
3674.3 513565216 509905624 492387695 499435043 508691406 513490181 512044678 513033257 516517754
3682 516517754 518315353 520114517 520507507 521527596 526275253 531270256 520427780 517568169 528243980
3690.6 528243980 523527870 523335152 529405174 530505409 532408409 533074188 533183861 534126320 534741173
3699.3 534741173 537600937 540267220 534700928 533042984 539149513 541168518 541478043 542028389 544621353
3708 544621353 548373871 539492302 542797775 547076683 535219460 540013733 544589119 545360832 546194191
3716.7 546194191 548963585 551312790 548236809 549164925 556189003 552653465 547961006 554336586
3724.4 554336586 555612030 555799179 553041954 552906265 557091980 558055305 562865448 558081512 550759392
3733.1 550759392 560629578 562250443 551342049 551666946 555094337 556048012 559571457 562879181
3740.8 562879181 558667793 561190834 572384148 560326767 544949493 556628914 562858238 568750877
3748.5 568750877 563601799 552270317 562622795 557040253 553566208 560990105 565944710 568689346
3756.2 568689346 564143944 566914787 572275276 563951111 562635231 567150917 568082275 569178925
3763.9 569178925 573419838 570167580 564715271 568318214 573653412 573637810 565281487 567594757 571422157
3772.6 571422157 572184563 573903694 574226570 574604950 574358864 576542320 576750031 569316750 573023186
3781.3 573023186 575369263 575152626 577672157 575383568 574847374 576204948 577064362 577588234 577631035
3790 577631035 579078178 579415779 579404449 578971062 580927696 584373627 579719238 575051727 577195282
3798.7 577195282 581902199 586429710 577814560 569138870 575540161 579748650 584183884 589627724
3806.4 589627724 579080124 575876122 581818008 584274483 584079971 584066315 584592590 585476494 591127739
3815.1 591127739 588319054 573800163 581038399 587724762 591983986 590800591 572417984 577441101
3822.8 577441101 584271507 586257706 588777580 588778229 584974060 585824127 587501526 590601158 591552505
3831.4 591552505 583611145 586992989 594132729 587209854 585290604 595143013 587494774 582050591
3839.2 582050591 590705032 585412102 585963707 593634834 590948868 586330605 589831924 591691933
3846.9 591691933 591713066 593654213 591817169 593561745 599886017 594599609 594794464 578219223 580130272
3855.6 580130272 591343575 591331367 589814987 592473488 595036163 597982712 591767197 591485329 599327965
3864.2 599327965 591919594 586833305 591897011 597541275 604040337 594453354 584030571 588887787
3871.9 588887787 596994247 602041130 592146454 592056808 595942459 596483955 598862762 602774086 595695686
3880.6 595695686 589053917 596354485 598003845 599705658 605859032 591388817 591993561 597466545
3888.3 597466545 598178787 602675552 601665268 592241707 594272118 598492546 597376328 597819748 599097481
3897 599097481 601633453 603633957 592201080 596690369 600529976 594595451 599642563 596003799
3904.7 596003799 594895630 596916313 598437500 601583366 600957336 601097412 600816040 600761986 600696487
3913.4 600696487 599805336 601097183 602794151 599009171 594415932 600009880 601221428 597082939
3921.1 597082939 600117683 601747665 602802162 600375366 598031044 600219994 601694450 603717651
3928.8 603717651 603016243 602585068 604245682 601287956 599501877 601335869 601812897 602354393 603549118
3937.5 603549118 602856522 602216225 601929703 603938255 605842400 601512566 600897255 602499161 603404465
3946.2 603404465 604923630 602933617 603087692 603737030 600970154 602165985 603403511 603143425 603753662
3954.9 603753662 603614731 603501472 602839012 603357468 604132957 604558907 604670410 602428780 602820015
3963.6 602820015 604684296 605242157 604753036 604239044 605041466 604433670 604052277 604710121 605114479
3972.2 605114479 605321312 605167580 605606041 605603333 605264091 605237503 605605583 605768318 605572433 605439339
3981.9 605439339 605315399 606038933 606065865 605169640 605348969 605854416 605398254 605794258 606120110 605357246
3991.5 605357246 605862961 606030464 606426163 606540756 605741005 606003609 606291504 606960678 606836700
4000.2 606836700
##END=$$ End of the data block
