##TITLE=$$ Begin of the data block
##JCAMP-DX=5.00 $$ ACD/SpecManager v 10.08
##SPECTROMETER/DATA SYSTEM=Varian
##DATE=20 Nov 2012 15:14:08
##DATA TYPE=INFRARED SPECTRUM
##DATA CLASS=XYDATA
##ORIGIN=
##OWNER=
##NPOINTS=3735
##FIRSTX=399.26403809
##LASTX=4000.35498047
##MAXX=4000.35498047
##MINX=399.26403809
##MAXY=80.28475952
##MINY=35.68756485
##XFACTOR=1.0000000000
##YFACTOR=0.000000100000000
##FIRSTY=57.07188797
##DELTAX=0.96440572
##XUNITS=1/CM
##YUNITS=TRANSMITTANCE
##XYDATA=(X++(Y..Y))
$$ plain form
399.3 570718880 577284317 603005371 605517426 602366447 600982819 590857544 581532898 589378166
407 589378166 603451118 600686874 594789276 598280792 602476463 604241409 598389893 594490128 598858757
415.7 598858757 595385246 587567253 573739128 555255775 579933205 596696701 602529831 603362999
423.4 603362999 597920532 596000366 596795425 591552773 586715355 591403122 594189072 589441757 589817543
432.1 589817543 588458824 583189240 586231270 589248009 581085205 581955261 591169205 592453575 591529121
440.7 591529121 590625687 592798462 596343193 592852287 593379936 595384102 591615677 590892601 594859238
449.4 594859238 598465271 602468109 604925194 602771111 603792229 604527855 602454224 596808243 593033600
458.1 593033600 604469833 607666397 602696953 601351547 601510429 599884338 596934471 595527267
$$ packed form
399.3E70718880O565437K5721054K512055l150979j383628j0125275r324646P845268
407E89378166J4072952k764244n897598L491516M195671J764946n851516l899765M368629
415.7E98858757l473511p817993j3828125j8483353K4677430J6763496N833130Q33168
423.4F03362999n442467j920166P95059n242652m837418M687767K785950m747315L75786
432.1E89817543j358719n269584L042030L016739q162804Q70056R213944J284370r24454
440.7E91529121r03434K172775L544731l490906N27649K004166l768425p23076L966637
449.4E94859238L606033M002838K457085k154083J021118P35626k073631n645981l774643
458.1E93033600J1436233L196564m969444j345406J58882j626091k949867j407204
$$ plain form
465.8 595527267 595079384 595597687 597718887 593870316 590954094 591954765 581935463 577202873 583662567
474.5 583662567 587274094 588160706 583864212 581044312 585252571 585916557 581022606 578244934 575308647
483.2 575308647 571994553 575456429 576857796 574960022 573471527 575938950 581632614 579398079
490.9 579398079 575719948 577419853 579879761 579427109 579903069 583096390 580105171 577572021 575676918
499.6 575676918 572714577 572760658 568475761 565777397 567130432 569078140 569060402 569521370 571326408
508.2 571326408 569956055 567022591 564312553 562772751 560822678 558168983 554790115 551772804
516 551772804 551114273 550502701 548685799 544056778 543398209 545624046 545588417 546256828 548062248 547027130
525.6 547027130 542726097 542376289 541599884 540227432 540733910 541112328 540378304 539532013 542488937
$$ packed form
465.8E95527267m47883N18303K121200l848571k916222J000671j0019302m732590O459694
474.5E83662567L611527Q86612m296494k819900M208259O63986m893951k777672k936287
483.2E75308647l314094L461876J401367j897774j488495K467423N693664k234535
490.9E79398079l678131J699905K459908m52652M75960L193321k991219k533150j895103
499.6E75676918k962341M6081m284897k698364J353035J947708j7738M60968J805038
508.2E71326408j370353k933464k710038j539802j950073k653695l378868l017311
516E51772804o58531o11572j816902m629021o58569K225837l5629O68411J805420j035118
525.6E47027130m301033l49808p76405j372452N06478L78418p34024q46291K956924
$$ plain form
534.3 542488937 545016441 546543083 547123337 549274940 553131027 553052750 554252396 555726852 555608902
543 555608902 555969734 557871590 560482674 560297737 560253334 559577446 559022903 558864937 557793121 557942047
552.6 557942047 558467064 557937202 556208954 555675316 554044495 551579361 549292641 547575684 548376389
561.3 548376389 547992134 547243385 543410263 540097275 539502640 536562233 534579506 531560059 530212097
570 530212097 528840256 526085510 525894547 526011810 525363808 523086357 523646240 525593414 527557297
578.6 527557297 529198532 529566307 531196594 533339920 535871506 538606415 543167877 547123642 549426308
587.3 549426308 550217667 551519356 554263039 554213104 554623756 555127640 555328217 556561852 556830940
596 556830940 556743584 555489578 555430946 556253281 556336708 556177444 556188889 556711845 557176781 558135262 557526093
$$ packed form
534.3E42488937K527504J526642N80254K151603L856087p8277J199646J474456j17950
543E55608902L60832J901856K611084j84937m4403o75888n54543j57966j071816J48926
552.6E57942047N25017n29862j728248n33638j630821k465134k286720j716957Q00705
561.3E48376389l84255p48749l833122l312988n94635k940407j982727l019447j347962
570E30212097j371841k754746j90963J17263o48002k277451N59883J947174J963883
578.6E27557297J641235L67775J630287K143326K531586K734909M561462L955765K302666
587.3E49426308P91359J301689K743683m9935M10652N03884K00577J233635K69088
596E56830940q7356j254006n8632Q22335Q3427j59264J1445N22956M64936R58481o09169
$$ plain form
606.6 557526093 557331085 557368698 556159210 555625954 555208817 556374321 557245369 557692757 558221588 558144608
616.3 558144608 559240608 560926590 563526192 565361748 565922089 567043839 568113022 568345718 568700447
624.9 568700447 570151711 572029762 573353806 574257431 576473961 579065323 580317955 580264587 581372032
633.6 581372032 583868752 584087791 583506355 583045044 582552643 582680893 583029366 584400368 584541550
642.3 584541550 583783417 583978043 585326385 588027725 590159073 590792732 591013718 591815910 593064194
651 593064194 594142570 593645554 592710266 593069229 592937012 592301292 592021065 591945763 593017387 594677505
660.6 594677505 595035591 596263237 598619194 598838997 599321899 600215340 598590088 591728897 593151474
669.3 593151474 595731735 597115288 597897530 598414421 598516273 600415764 604196854 606021690 605101051
$$ packed form
606.6E57526093j95008L7613j209488n33256m17137J165504Q71048M47388N28831p6980
616.3E58144608J096000J685982K599602J835556N60341J121750J069183K32696L54729
624.9E68700447J451264J878051J324044R03625K216530K591362J252632n3368J107445
633.6E81372032K496720K19039n81436m61311m92401J28250L48473J371002J41182
642.3E84541550p58133J94626J348342K701340K131348O33659K20986Q02192J248284
651E93064194J078376m97016r35288L58963j32217o35720k80227p5302J071624J660118
660.6E94677505L58086J227646K355957K19803M82902Q93441j625252o861191J422577
669.3E93151474K580261J383553P82242N16891J01852J899491L781090J824836r20639
$$ plain form
678 605101051 605891151 607968597 607207794 606787224 608540306 608526192 608222923 609168472 609216270 609003563
687.6 609003563 608569832 609136963 610417366 610195007 610402870 610597878 610396461 610712700 610031853 608682671
697.3 608682671 607234459 605871239 604644203 603016052 601156998 600219688 600599060 600714111 600654640
705.9 600654640 601026917 600896568 600372620 600077515 599896507 600211220 600701332 601329231 602598763 603644447
715.6 603644447 605337219 607810822 609439011 611100807 614066162 616573029 618382874 621525688
723.3 621525688 624165688 624808922 625932083 628059006 630163956 632053413 632931671 633789368 636511536
732 636511536 639350815 640918732 642535782 642734299 641975632 643339386 645287247 646898193 647727661
740.7 647727661 647636185 647082901 646017685 646446304 647098465 647044449 646295090 644716492 644329910 644467545
$$ packed form
678F05101051P90100K077446p60803m20570J753082j4114l03269R45549M7798k12707
687.6F09003563m33731N67131J280403k22359K07863J95008k01417L16239o80847j349182
697.3F08682671j448212j363220j227036j628151j859054r37310L79372J15051n9471
705.9F00654640L72277j30349n23948k95105j81008L14713M90112O27899J269532J045684
715.6F03644447J692772K473603J628189J661796K965355K506867J809845L142814
723.3F21525688K640000O43234J123161K126923K104950J889457Q78258Q57697K722168
732F36511536K839279J567917J617050J98517p58667J363754J947861J610946Q29468
740.7F47727661r1476n53284j065216M28619O52161n4016p49359j578598l86582J37635
$$ plain form
750.3 644467545 643383942 640744476 639534607 639635773 636729736 633594398 632948341 631474228 629102173
759 629102173 627401619 625947952 624627495 623322334 622735672 622878761 623532639 624587059 625128059
767.7 625128059 625162010 624857635 624907265 626386223 629514847 632653656 634820251 637124901 639316292
776.4 639316292 642879333 647825089 651382141 653903961 656011429 658710403 660951233 662911148
784.1 662911148 665257797 666674042 668645630 670444412 672520065 674500504 675500641 677561798
791.8 677561798 679636536 680745010 682110596 683530960 683768768 685169754 686859970 688288116 689956818
800.5 689956818 689612579 690377808 692463226 694892273 696474380 696876221 697853088 697881699 698069000
809.1 698069000 697882156 697577591 697218094 696634750 697203598 698022995 698730087 698382263 698284149 698268509
$$ packed form
750.3F44467545j083603k639466j209869J01166k906037l135338o46057j474113k372055
759F29102173j700554j453667j320457j305161n86662J43089O53878J054420N41000
767.7F25128059L3951l04375M9630J478958L128624L138809K166595K304650K191391
776.4F39316292L563041M945756L557052K521820K107468K698974K240830J959915
784.1F62911148K346649J416245J971588J798782K075653J980439J000137K061157
791.8F77561798K074738J108474J365586J420364K37808J400986J690216J428146J668702
800.5F89956818l44239P65229K085418K429047J582107M01841R76867K8611J87301
809.1F98069000j86844l04565l59497n83344N68848Q19397P07092l47824r8114j5640
$$ plain form
818.8 698268509 698355789 699009933 698989258 698995438 698892059 698439026 696329880 694753494 694973755 695142822
828.4 695142822 694340820 692778778 692518692 691227112 689037781 687542114 686399155 684960022 682489166
837.1 682489166 680957108 679412003 677368851 675777740 674232330 672146988 671089859 671204910 670541077
845.8 670541077 670282288 669218903 668257141 667672119 666058807 665013046 663317413 661532822 659841690
854.5 659841690 658305969 656716309 654040451 652096329 650577164 648956223 647875443 648269958 650394669
863.1 650394669 653809052 657507477 660238647 663847046 667610779 670339737 672991333 676670456
870.9 676670456 680690689 683498688 686910019 690067215 693024139 696572113 699229050 700540085
878.6 700540085 701021042 700798035 699877243 699069290 696977768 694333725 692014923 690402527 689464645
$$ packed form
818.8F98268509Q7280O54144k0675O180j03379m53033k109146j576386K20261J69067
828.4F95142822q02002j562042k60086j291580k189331j495667j142959j439133k470856
837.1F82489166j532058j545105k043152j591111j545410k085342j057129J15051o63833
845.8F70541077k58789j063385r61762n85022j613312j045761j695633j784591j691132
854.5F59841690j535721j589660k675858j944122j519165j620941j080780L94515K124711
863.1F50394669L414383L698425K731170L608399L763733K728958K651596L679123
870.9F76670456M020233K807999L411331L157196K956924L547974K656937J311035
878.6G00540085M80957k23007r20792q07953k091522k644043k318802j612396r37882
$$ plain form
887.3 689464645 687621994 685281372 682751312 680286255 677969360 676797180 675986786 674058990 671619644
895.9 671619644 668862991 666081085 663346481 661914673 661059265 659692764 658183365 656067200 653809891
904.6 653809891 652078629 650791931 648790054 646409073 643722382 640643692 636835403 632478790
912.3 632478790 629647980 626166496 621747742 617975922 614376831 611102638 608348694 606499367
920 606499367 603908005 600782051 599422379 599106140 598664818 598126564 597961159 597378311 596289291
928.7 596289291 596230507 596722221 597374535 598569565 600094872 601148491 602006187 603887138 605952950
937.4 605952950 607080460 607712555 609418373 611476479 612782364 614070511 615432434 616621056 616945648
946.1 616945648 616625748 615450096 612815475 609488335 605804939 601179848 596505814 592435150 587364426
$$ packed form
887.3F89464645j842651k340622k530060k465057k316895j172180q10394j927796k439346
895.9F71619644k756653k781906k734604j431808q55408j366501j509399k116165k257309
904.6F53809891j731262j286698k001877k380981k686691l078690l808289m356613
912.3F32478790k830810l481484m418754l771820l599091l274193k753944j849327
920F06499367k591362l125954j359672l16239m41322n38254j65405n82848j089020
928.7E96289291n8784M91714O52314J195030J525307J053619Q57696J880951K065812
937.4F05952950J127510O32095J705818K058106J305885J288147J361923J188622L24592
946.1F16945648l19900j175652k634621l327140l683396m625091m674034m070664n070724
$$ plain form
954.8 587364426 580970917 574644279 569203987 564273529 558288994 551785507 545176048 537725716
962.5 537725716 531070366 524496117 517658615 510872917 503876076 496154251 487333107 479773445
970.2 479773445 472248878 464586258 456504936 447867889 439539108 431563988 425099258 417436790
977.9 417436790 409620857 401769028 395058784 389487381 383621597 379640350 375218658 371896591
985.6 371896591 368390617 365940781 364289360 361745071 360701752 359078827 359164658 358472023 357817345
994.3 357817345 358035851 357692032 357987404 357520332 358380508 358259697 358585052 359456139 360029716 360587120
1004 360587120 360390625 361208115 360891342 361347694 360561104 359676094 359160538 357606430 357697601 356875648
1013.6 356875648 357288170 356950340 357053719 357858810 358162880 359710999 360156593 361766815 362105675
$$ packed form
954.8E87364426o393509o326638n440292m930458n984535o503487o609459p450332
962.5E37725716o655350o574249o837502o785698o996841p721825q821144p559662
970.2D79773445p524567p662620q081322q637047q328781p975120o464730p662468
977.9D17436790p815933p851829o710244n571403n865784l981247m421692l322067
985.6C71896591l505974k449836j651421k544289j043319j622925Q5831o92635o54678
994.3C57817345K18506l43819K95372m67072Q60176j20811L25355Q71087N73577N57404
1004C60587120j96495Q17490l16773M56352p86590q85010n15556j554108R1171q21953
1013.6C56875648M12522l37830J03379Q05091L04070J548119M45594J610222L38860
$$ plain form
1022.3 362105675 362818832 363854523 364729767 366330681 367040405 369092865 369897804 372093811 373838730
1031 373838730 375527725 377755432 378129501 379680519 379843369 380951538 381077652 380964890 381151123
1039.6 381151123 380664825 381973381 381476784 381716690 381373024 382094345 382850533 382443695 383749199
1048.3 383749199 383710022 384148598 384162903 386577644 389318008 391501083 394171562 395819435 399203491
1057 399203491 401323929 404811249 408236122 412453423 416861572 420121155 425753441 429293404 432787399
1065.7 432787399 435317192 437406769 438781128 437643547 435573235 431181755 426716042 420766907
1073.4 420766907 416437302 413446121 411080055 409461403 406699028 406975899 407030182 408306618 408810730
1082.1 408810730 408945885 410046692 411329651 414602776 415732994 418573227 420530014 422834740
$$ packed form
1022.3C62105675P13157J035691Q75244J600914P09724K052460Q04939K196007J744919
1031C73838730J688995K227707L74069J551018J62850J108169J26114j12762J86233
1039.6C81151123m86298J308556m96597K39906l43666P21321P56188m06838J305504
1048.3C83749199l9177M38576J4305K414741K740364K183075K670479J647873L384056
1057C99203491K120438L487320L424873M217301M408149L259583N632286L539963L493995
1065.7D32787399K529793K089577J374359j137581k070312m391480m465713n949135
1073.4D20766907m329605k991181k366066j618652k762375K76871N4283J276436N04112
1082.1D08810730J35155J100807J282959L273125J130218K840233J956787K304726
$$ plain form
1089.8 422834740 426664391 429564438 432969666 434661751 438107033 440293846 442493591 444205322
1097.5 444205322 444143562 445497704 445667152 446282387 446062279 446208611 445596733 445985451 447792664
1106.2 447792664 447474632 449249916 450796242 452875977 454833679 456807861 459141235 460460510
1113.9 460460510 462475700 463517914 465539131 466705208 468349380 470168648 471202545 473492050
1121.6 473492050 474661064 476024399 475606842 476392250 478726311 480100746 481857643 483133698 485082779
1130.3 485082779 486459808 489306946 491485825 492089920 493133202 493931847 495374222 494581757 493561478
1139 493561478 492340622 490047607 487205849 483741531 480992126 477217789 474929695 472732239 469895592
1147.6 469895592 466682739 463318214 461602592 459353752 457934723 456297340 455447731 455074959 454753914
$$ packed form
1089.8D22834740L829651K900047L405228J692085L445282K186813K199745J711731
1097.5D44205322o1760J354142J69448O15235k20108J46332o11878L88718J807213
1106.2D47792664l18032J775284J546326K079735J957702J974182K333374J319275
1113.9D60460510K015190J042214K021217J166077J644172J819268J033897K289505
1121.6D73492050J169014J363335m17557P85408K334061J374435J756897J276055J949081
1130.3D85082779J377029K847138K178879O04095J043282P98645J442375p92465j020279
1139D93561478j220856k293015k841758l464318k749405l774337k288094k197456k836647
1147.6D69895592l212853l364525j715622k248840j419029j637383q49609l72772l21045
$$ plain form
1156.3 454753914 454650993 454157486 455335312 455608826 456578522 457684937 459200668 461158638 463016624
1165 463016624 466830406 469914246 474414635 479754829 484924622 489720383 494805374 501295433 507299843
1173.7 507299843 513162422 518395348 524146309 529185143 534101639 539520760 544583778 550411949
1181.4 550411949 555541344 560531578 565186882 569882278 574252968 577636070 581586494 585380554
1189.1 585380554 588307381 590641403 592806702 594257202 595302925 596037712 596460457 597660980 598773422
1197.8 598773422 599393616 599983444 600698776 601193504 601701050 602782631 603672028 604017067 604379272
1206.5 604379272 605505409 606491318 607235909 608283195 609510155 611427193 613205757 614808311 616680145
1215.1 616680145 618453522 620295677 622314262 623857574 625125084 626118469 626395683 626023178 624976578
$$ packed form
1156.3D54753914j02921m93507J177826K73514R69696J106415J515731J957970J857986
1165D63016624L813782L083840M500389N340194N169793M795761N084991O490059O004410
1173.7E07299843N862579N232926N750961N038834M916496N419121N063018N828171
1181.4E50411949N129395M990234M655304M695396M370690L383102L950424L794060
1189.1E85380554K926827K334022K165299J450500J045723P34787M22745J200523J112442
1197.8E98773422O20194N89828P15332M94728N07546J081581Q89397L45039L62205
1206.5F04379272J126137R85909P44591J047286J226960J917038J778564J602554J871834
1215.1F16680145J773377J842155K018585J543312J267510R93385K77214l72505j046600
$$ plain form
1223.8 624976578 624682693 624503326 623477249 622852554 622553711 622210503 621511803 620645370 620167198
1232.5 620167198 620093002 619769478 619026413 618461342 617226677 616059608 615367317 614018135 613099785
1241.2 613099785 612584724 612246094 612648697 613359184 613846741 614255562 615032654 615807648 616813507
1249.9 616813507 618009109 618563461 618703651 618948822 618863487 618870659 619079742 619052238 619826279 620872154
1259.5 620872154 621233673 621578102 622438889 623434830 624107819 624833336 625550652 626267204 626883354 627483444
1269.2 627483444 628277397 628926239 629182472 629414215 630004768 630649185 631394920 632028809 632835083 633715630
1278.8 633715630 634070663 634018974 633509560 632993851 632508469 632096405 631484146 630685196 630326233 630456734
1288.4 630456734 630164528 629351044 629420471 629919777 630595093 630787773 629873543 629267616 628606033 627673340
$$ packed form
1223.8F24976578k93885j79367j026077o24695k98843l43208o98700q66433m78172
1232.5F20167198p4196l23524p43065n65071j234665j167069o92291j349182r18350
1241.2F13099785n15061l38630M02603P10487M87557M08821P77092P74994J005859
1249.9F16813507J195602N54352J40190K45171q5335P172K09083k7504P74041J045875
1259.5F20872154L61519L44429Q60787R95941O72989P25517P17316P16552O16150O00090
1269.2F27483444P93953O48842K56233K31743N90553O44417P45735O33889Q06274Q80547
1278.8F33715630L55033n1689n09414n15709m85382m12064o12259p98950l58963J30501
1288.4F30456734k92206q13484O9427M99306O75316J92680r14230o05927o61583r32693
$$ plain form
1298.1 627673340 626389923 624988441 623647919 621992722 620549278 619340439 618501549 617934570 617529449
1306.8 617529449 617272110 616655045 616065636 615734482 615337868 614648056 613586044 611983528 610625114
1315.4 610625114 609805984 608828964 608086205 607427292 607026596 606962280 606657829 606483727 605988426 605100021
1325.1 605100021 604012489 602503471 600770035 598696632 596163216 593408508 591397400 589677696
1332.8 589677696 587490120 585996475 584818764 583834572 583073196 583014565 583237267 583025208 583657036
1341.5 583657036 584126816 584389839 584264984 584081802 583687172 583162308 583252983 583232689 583156509 583234596
1351.1 583234596 583658829 583844147 584157944 584377708 584328003 584637146 584147720 583421249 582282944 580895805
1360.8 580895805 580114059 579432564 578567963 577997704 578239059 577878723 577904091 578182564 578157082 578894882
$$ packed form
1298.1F27673340j283417j401482j340522j655197j443444j208839q38890n66979m05121
1306.8F17529449k57339o17065n89409l31154l96614o89812j062012j602516j358414
1315.4F10625114q19130r77020p42759o58913m00696o4316l04451j74102m95301q88405
1325.1F05100021j087532j509018j733436k073403k533416k754708k011108j719704
1332.8E89677696k187576j493645j177711r84192p61376n8631K22702k12059O31828
1341.5E83657036M69780K63023j24855j83182l94630n24864R0675k0294p6180P8087
1351.1E83234596M24233J85318L13797K19764m9705L09143m89426p26471j138305j387139
1360.8E80895805p81746o81495q64601n70259K41355l60336K5368K78473k5482P37800
$$ plain form
1370.4 578894882 578981285 579387665 579696007 580029945 580224571 580217133 580527344 580329361 580987549 581356163
1380.1 581356163 581586876 581906242 582857552 584216919 585010338 587126312 589191551 590713501 592236061
1388.7 592236061 593960037 594743538 594578552 594987297 595569382 595879478 595120773 595461502 595668411
1397.4 595668411 595533676 594774170 594670715 595269089 594425583 594059944 593636360 592632942 591947594
1406.1 591947594 590974121 589899673 588320351 587300873 586337700 585833664 585431824 584751320 584301109
1414.8 584301109 583681335 583611946 582919617 582843933 579857292 579263268 580739822 580693588 580811157 579546928
1424.4 579546928 579874306 580109634 579835777 581064758 581114960 581200409 581711388 583166084 583708687 584192123
1434.1 584192123 586302261 587462044 585790558 585031700 587242584 588049469 588704033 589631119 590025597
$$ packed form
1370.4E78894882Q6403M06380L08342L33938J94626p438L10211j97983O58188L68614
1380.1E81356163K30713L19366R51310J359367P93419K115974K065239J521950J522560
1388.7E92236061J723976P83501j64986M08745N82085L10096p58705L40729K06909
1397.4E95668411j34735p59506j03455N98374q43506l65639m23584j003418o85348
1406.1E91947594r73473j074448j579322j019478r63173n04036m01840o80504m50211
1414.8E84301109o19774o9389o92329p5684k986641n94024J476554m6234J17569j264229
1424.4E79546928L27378K35328k73857J228981N0202Q5449N10979J454696N42603M83436
1434.1E84192123K110138J159783j671486p58858K210884Q06885O54564R27086L94478
$$ plain form
1442.7 590025597 591502533 591731453 592898331 593919563 594765015 594569435 594255295 595125313 594407959
1451.4 594407959 594252625 593494339 593780861 593875351 592767525 591947784 589056511 590966377 590764656
1460.1 590764656 593009567 593946609 594681129 596852112 596244583 598417091 600168228 602941055 604239464
1468.8 604239464 606508026 610032501 611499786 615196457 617591591 623486099 626616287 630355568
1476.5 630355568 634333305 637646637 641613007 643748932 646966248 649044800 652203217 654812698
1484.2 654812698 656857224 659853592 661129074 663869553 665104675 666399384 666939316 669984818
1491.9 669984818 673389511 675159988 677923965 678586655 678832779 681413269 682921219 682872543 684736633
1500.6 684736633 686813965 686883163 688859100 690432892 691486893 687402115 682398071 688428955 691630402
$$ packed form
1442.7E90025597J476936K28920J166878J021232Q45452j95580l14140Q70018p17354
1451.4E94407959j55334p58286K86522R4490j107826q19741k891273J909866k01721
1460.1E90764656K244911R37042P34520K170983o07529K172508J751137K772827J298409
1468.8F04239464K268562L524475J467285L696671K395134N894508L130188L739281
1476.5F30355568L977737L313332L966370K135925L217316K078552L158417K609481
1484.2F54812698K044526K996368J275482K740479J235122J294709N39932L045502
1491.9F69984818L404693J770477K763977O62690K46124K580490J507950m8676J864090
1500.6F84736633K077332O9198J975937J573792J054001m084778n004044O030884L201447
$$ plain form
1509.3 691630402 695889206 697821121 698587189 698358459 699821167 700557480 699776382 700379181 698963928
1518 698963928 702351990 704459915 703253021 700644379 701059875 705329895 706480789 706932907 708156052
1526.6 708156052 709377213 709196472 709508820 711027145 710744705 710566711 708298569 707520294 709833755
1535.3 709833755 710516891 711873169 712965088 708529205 703686523 709652176 710857544 711935883
1543 711935883 714927292 714517059 712123489 712456284 712843552 712746124 711132202 708707199 709628677
1551.7 709628677 711264954 712060776 710647583 711152802 714206696 716949615 714667282 708405380 704498062
1560.4 704498062 707350540 707793121 707176971 706155624 703507538 702778320 703117676 703916550 704362183
1569.1 704362183 700423355 700979004 701745911 701300964 701041565 701258926 700863495 693523636 692882538
$$ packed form
1509.3F91630402M258804J931915P66068k28730J462708P36313p81098O02799j415253
1518F98963928L388062K107925j206894k608642M15496M270020J150894M52118J223145
1526.6G08156052J221161j80741L12348J518325k82440j77994k268142p78275K313461
1535.3G09833755O83136J356278J091919m435883m842682N965653J205368J078339
1543G11935883K991409m10233k393570L32795L87268r7428j613922k425003R21478
1551.7G09628677J636277P95822j413193N05219L053894K742919k282333o261902l907318
1560.4G04498062K852478M42581o16150j021347k648086p29218L39356P98874M45633
1569.1G04362183l938828N55649P66907m44947k59399K17361l95431p339859o41098
$$ plain form
1577.7 692882538 692850418 691918793 691071625 689970932 689507370 689165115 689405289 689281006 688615570 687863159
1587.4 687863159 686934052 686253662 684965897 683685760 681763153 680289459 678713684 676938782 675900650
1596.1 675900650 674522095 674403381 673939819 673729401 673237076 671909637 671007156 669564743 668144073
1604.7 668144073 666036377 664247284 661854324 659917297 657498474 655123978 654812927 652862091
1612.5 652862091 651567764 650529633 650721817 649639435 642931595 644584274 644231873 643339691 641862946
1621.1 641862946 641539383 640279160 635261993 634999008 634890175 635128937 632401733 631452675 632016373
1629.8 632016373 631933556 632438927 632465439 633731689 634472618 629375534 627790642 629117432 628758049
1638.5 628758049 629052734 629503059 629046898 630493965 630995369 632391968 633439293 631271820 633247032
$$ packed form
1577.7F92882538l2120r31625q47168j100693m63562l42255K40174j24283o65436p52411
1587.4F87863159r29107o80390j287765j280137j922607j473694j575775j774902j038132
1596.1F75900650j378555j18714m63562k10418m92325j327439r02481j442413j420670
1604.7F68144073k107696j789093k392960j937027k418823k374496l11051j950836
1612.5F52862091j294327j038131J92184j082382o707840J652679l52401q92182j476745
1621.1F41862946l23563j260223n017167k62985j08833K38762k727204r49058N63698
1629.8F32016373q2817N05371K6512J266250P40929n097084j584892J326790l59383
1638.5F28758049K94685M50325m56161J447067N01404J396599J047325k167473J975212
$$ plain form
1647.2 633247032 634134102 636298485 638115311 640814362 644076843 644090729 639410934 640981216 643604126
1655.9 643604126 645268097 646935043 648618927 650545502 652350082 654664993 657033768 657269211
1663.6 657269211 659281921 661362839 663111496 665071869 667461777 667240372 667951965 670765610 672108917
1672.3 672108917 674830399 677845459 678626556 678999939 682287292 685056839 687338867 689308243 690261078
1680.9 690261078 693583145 697231903 697104340 692371063 696703339 700656128 702996292 704424057
1688.6 704424057 706370926 708286667 710600967 713161087 714982224 717860489 719799271 715589066
1696.4 715589066 718737030 722167587 727063065 727892609 720636597 724813156 727539444 729077530
1704.1 729077530 728873520 729726486 730134048 731689606 733742523 734340668 734685364 735640411 737098007
$$ packed form
1647.2F33247032Q87070K164383J816826K699051L262481J3886m679795J570282K622910
1655.9F43604126J663971J666946J683884J926575J804580K314911K368775K35443
1663.6F57269211K012710K080918J748657J960373K389908k21405P11593K813645J343307
1672.3F72108917K721482L015060P81097L73383L287353K769547K282028J969376R52835
1680.9F90261078L322067L648758j27563m733277M332276L952789K340164J427765
1688.6G04424057J946869J915741K314300K560120J821137K878265J938782m210205
1696.4G15589066L147964L430557M895478Q29544p256012M176559K726288J538086
1704.1G29077530k04010Q52966M07562J555558K052917N98145L44696R55047J457596
$$ plain form
1712.8 737098007 738192520 737280197 736231461 738316269 739622726 735770874 737065430 738480225
1720.5 738480225 739488220 739781570 739363327 739701157 740749969 741490250 741986008 742886963 743883972
1729.1 743883972 743216400 742161865 743721619 745096130 742763214 739550781 741741714 743929672
1736.9 743929672 744656830 746227646 746114731 744786224 747551041 749147720 748466415 748700333 750596161
1745.5 750596161 751821518 752175827 752140732 751700516 754037247 753874664 753236542 755628738 757177277
1754.2 757177277 759035339 760859528 760752869 761863251 763851242 765305557 767016068 765674744
1761.9 765674744 764915390 766685410 767312469 767822952 768696747 769296875 768585815 771002045 774215851
1770.6 774215851 774486465 773426285 772978439 775602493 776672287 775991592 776754456 776166992 776334915
$$ packed form
1712.8G37098007J094513r12323j048736K084808J306457l851852J294556J414795
1720.5G38480225J007995K93350m18243L37830J048812P40281M95758R00955R97009
1729.1G43883972o67572j054535J559754J374511k332916l212433K190933K187958
1736.9G43929672P27158J570816j12915j328507K764817J596679o81305K33918J895828
1745.5G50596161J225357L54309l5095m40216K336731j62583o38122K392196J548539
1754.2G57177277J858062J824189j06659J110382J987991J454315J710511j341324
1761.9G65674744p59354J770020O27059N10483Q73795O00128p11060K416230L213806
1770.6G74215851K70614j060180m47846K624054J069794o80695P62864n87464J67923
$$ plain form
1779.3 776334915 775842514 774857712 775766678 776673584 777350616 777446671 778483276 779753418 780513687
1788 780513687 781202011 782510834 782700729 782209396 780639648 779304199 780743027 780387192 779746704
1796.7 779746704 780919342 782241516 782476044 782085342 783689346 783773346 784512253 785933838 786055298
1805.3 786055298 786105499 785987930 785616074 785181961 785055847 783833542 784090424 784976578 785157776 786150665
1815 786150665 786867447 787830811 787906265 788372650 789089966 788704376 788882751 788243256 788484192 788418961
1824.6 788418961 785532532 785409546 786961441 788330688 788068466 786421967 787804642 790194016 791153107
1833.3 791153107 791406937 791235657 791087952 790886612 789586639 789426727 789262314 789428101 789183884
1842 789183884 789401093 789984970 787265244 789266586 791223373 791595764 791778793 792090378 792568665
$$ packed form
1779.3G76334915m92401r84802R08966R06906O77032R6055J036605J270142P60269
1788G80513687O88324J308823J89895m91333j569748j335449J438828l55835o40488
1796.7G79746704J172638J322174K34528l90702J604004Q4000P38907J421585J21460
1805.3G86055298N0201j17569l71856m34113j26114j222305K56882Q86154J81198R92889
1815G86150665P16782R63364P5454M66385P17316l85590J78375o39495K40936o5231
1824.6G88418961k886429j22986J551895J369247k62222j646499J382675K389374R59091
1833.3G91153107K53830j71280j47705k01340j299973j59912j64413J65787k44217
1842G89183884K17209N83877k719726K001342J956787L72391J83029L11585M78287
$$ plain form
1850.7 792568665 792116470 791681213 791051254 791188049 790916901 790132141 790332108 790537338 791041870 791363525
1860.3 791363525 792352066 792789078 792846222 792944031 792617111 793106995 792541275 792359772 791412354 789648819
1869.9 789648819 790114365 790575638 790931854 791061859 791750717 792504349 793112946 793469315 793699799 794104233
1879.6 794104233 793821640 793601303 793270493 793268204 792793961 792224960 792378387 792351227 793260803 793526001
1889.2 793526001 792790222 793434372 794464874 794921875 795133667 794771118 793860931 793944321 793859863 794000931
1898.9 794000931 793957443 793731232 793735962 793463287 793830872 793754807 794090271 794878845 795322952 795422592
1908.5 795422592 795103607 794885254 794633636 795143280 794710693 794290085 794493637 794589462 795226288 793721466
1918.2 793721466 793388901 794334717 794963379 795570602 794520111 794217377 794869843 795086670 794812698
$$ packed form
1850.7G92568665m52195m35257o29959J36795k71148p84760J99967K05230N04532L21655
1860.3G91363525R88541M37012N7144R7809l26920M89884n65720j81503r47418j763535
1869.9G89648819M65546M61273L56216J30005O88858P53632O08597L56369K30484M04434
1879.6G94104233k82593k20337l30810k289m74243n69001J53427k7160R09576K65198
1889.2G93526001p35779O44150J030502M57001K11792l62549r10187Q3390q4458J41068
1898.9G94000931m3488k26211M730k72675L67585p6065L35464P88574M44107R9640
1908.5G95422592l18985k18353k51618N09644m32587m20608K03552R5825O36826j504822
1918.2G93721466l32565R45816O28662O07223j050491l02734O52466K16827k73972
$$ plain form
1926.8 794812698 794666214 794657974 794682846 794817352 794601593 794289398 793885345 794331589 794673233 794832535
1936.5 794832535 795162048 794924927 795115356 795479584 796069489 795231857 793623123 794155579 794742508
1945.2 794742508 794916916 794855423 795362396 795416870 794943008 794955826 795179749 795233307 794920120 795260162
1954.8 795260162 795362320 795320206 795615997 795673523 795613861 795442810 795839462 795876465 795528412 795488129
1964.5 795488129 795591202 795561142 794906769 794663849 795044327 795480270 795682678 795884628 795930099 796001511
1974.1 796001511 796335983 796385269 796528473 796466522 795985489 795632858 795712280 795537949 795253601 795257263
1983.7 795257263 795088425 795511703 795854034 795843353 795724411 795625229 796228561 796586533 796024780 795459290
1993.4 795459290 795708923 795689011 795223618 794939804 794770355 794803391 794700546 795093002 795453186 795713882
$$ packed form
1926.8G94812698j46484q240K4872J34506k15759l12195m04053M46244L41644J59302
1936.5G94832535L29513k37121J90429L64228N89905q37632j608734N32456N86929
1945.2G94742508J74408o1493N06973N4474m73862J2818K23923N3558l13187L40042
1954.8G95260162J02158m2114K95791N7526n9662j71051L96652L7003l48053m0283
1964.5G95488129J03073l0060o54373k42920L80478M35943K02408K01950M5471P1412
1974.1G96001511L34472M9286J43204o1951m81033l52631P9422j74331k84348L662
1983.7G95257263j68838M23278L42331j0681j18942r9182O03332L57972n61753n65490
1993.4G95459290K49633j9912m65393k83814j69449L3036j02845L92456L60184K60696
$$ plain form
2003 795713882 795861435 795626144 795770569 795843430 795973740 795526733 794998703 794949265 794704971 794351807
2012.7 794351807 793841171 793890305 794239197 794349442 793870773 793933868 794367981 794188690 794237595 793795166
2022.3 793795166 793596878 793509216 793214264 793117294 792830963 792692032 792023087 791750793 791794128 792011414
2032 792011414 792225723 791742020 791879349 792269669 792567062 792284164 791715622 791408920 791220474 790911331
2041.6 790911331 790308075 790361252 790288925 790475693 790471268 790362854 790986404 790845490 790957870 791253281
2051.2 791253281 791246567 791011276 790766449 790783539 790492325 790447693 790053024 789682465 789586639 789769440
2060.9 789769440 790039749 789778824 789792252 789798889 790143738 790755157 791069260 790757065 790328674 790259781
2070.5 790259781 790192184 790349503 789754791 789303665 789191513 789477615 790364075 790418930 790534668 790493317
$$ packed form
2003G95713882J47553k35291J44425P2861J30310m47007n28030m9438k44294l53164
2012.7G94351807n10636M9134L48892J10245m78669O3095M34113j79291M8905m42429
2022.3G93795166j98288q7662k94952r6970k86331j38931o68945k72294M3335K17286
2032G92011414K14309m83703J37329L90320K97393k82898n68542l06702j88446l09143
2041.6G90911331o03256N3177p2327J86768m425j08414O23550j40914J12380K95411
2051.2G91253281o714k35291k44827J7090k91214m4632l94669l70559r5826J82801
2060.9G89769440K70309k60925J3428O637L44849O11419L14103l12195m28391o8893
2070.5G90259781o7597J57319n94712m51126j12152K86102Q86460N4855J15738m1351
$$ plain form
2080.2 790493317 790542450 790790176 790917816 790863724 790417633 790465927 789971542 789662933 789791946 789670563
2089.8 789670563 789657288 789714203 790064621 790001297 790246429 790594711 791071014 791565094 791236267 791053238
2099.5 791053238 790720444 790667725 790467911 790037537 790226059 790423203 790368729 790060272 790300674 790827179
2109.1 790827179 791096649 790951614 790954742 791472321 791752625 791739731 791067200 790607376 790628052 790743408
2118.7 790743408 790737457 790431290 790435944 790412445 790748672 791279602 791476440 791341171 791311646 791810989 791965332
2129.4 791965332 791696777 790977936 790521393 790633163 790594559 790197754 789782333 790071869 790543365 791024780
2139 791024780 791214600 791192322 791344299 791312790 791394577 791575241 791579437 791063156 790557556 790286407 790292282
2149.6 790292282 790602722 790646820 790617523 790475540 790746613 791155167 791467972 791612091 791226959 791353073
$$ packed form
2080.2G90493317M9133K47726J27640n4092m46091M8294m94385l08609J29013j21383
2089.8G89670563j3275N6915L50418o3324K45132L48282M76303M94080l28827j83029
2099.5G91053238l32794n2719j99814m30374J88522J97144n4474l08457K40402N26505
2109.1G90827179K69470j45035L128N17579K80304j2894o72531m59824K0676J15356
2118.7G90743408n951l06167M654k3499L36227N30930J96838j35269k9525M99343J54343
2129.4G91965332k68555p18841m56543J11770l8604l96805m15421K89536M71496M81415
2139G91024780J89820k2278J51977l1509Q1787J80664M196n16281n05600k71149N875
2149.6G90292282L10440M4098k9297j41983K71073M08554L12805J44119l85132J26114
$$ plain form
2159.3 791353073 791458206 791264343 791180725 791132965 790967560 790788498 791180115 791718826 792057037 792049637
2168.9 792049637 792134705 792410889 792886963 793237076 792979736 793050919 792987747 792891388 792858810 792584152
2178.5 792584152 792657700 792844315 793114090 793458328 793798447 793825912 794190903 794780350 794802399 794539719
2188.2 794539719 794123383 794465714 794693756 794466858 794686737 795007477 795266876 795207443 795004959 795014801
2197.8 795014801 795590439 795848160 795684586 795639114 795585937 795926208 795929031 796020355 796295319 796329727 796364517
2208.4 796364517 796536560 796799927 796336288 796267624 796597519 796864548 797489853 797771378 797703476 797486420
2218.1 797486420 797381287 797225113 797191772 797194748 797072830 797104568 797515564 798018188 797782288 797844772
2227.7 797844772 797795944 797767334 798390045 798440018 798530655 798510208 798161087 798029633 798155594 798156433 798056107
$$ packed form
2159.3G91353073J05133j93863q3618m7760j65405j79062L91617N38711L38211p400
2168.9G92049637Q5068K76184M76074L50113k57340P1183o3172r6359l2578k74658
2178.5G92584152P3548J86615K69775L44238L40119K7465L64991N89447K2049k62680
2188.2G94539719m16336L42331K28042k26898K19879L20740K59399n9433k02484R842
2197.8G95014801N75638K57721j63574m5472n3177L40271K823R1324K74964L4408L4790
2208.4G96364517J72043K63367m63639o8664L29895K67029O25305K81525o7902k17056
2218.1G97486420j05133j56174l3341K976j21918L1738M10996N02624k35900O2484
2227.7G97844772m8828k8610O22711M9973R0637k0447l49121j31454J25961Q39j00326
$$ plain form
2238.3 798056107 798114014 798371506 798965073 798907166 798962555 799257355 799440689 799607010 799179993 799058456
2248 799058456 798759232 798425369 798164978 798050003 798239136 798376465 799003677 799279251 799732056 799681091
2257.6 799681091 799038162 799124908 799410782 799894791 799696350 799338531 799132385 799088440 799121399 798961411
2267.3 798961411 799245911 799393082 799744949 799765625 799802094 799988632 799906769 800025101 799736862 799980545
2276.9 799980545 800273514 800378418 800113144 799525757 799345474 799312668 799973297 799900970 799964905 800283203
2286.5 800283203 800075836 800383301 800095596 800061493 800301743 800391312 800192032 799968872 800225067 799956512
2296.2 799956512 800156097 800375748 800293808 800314636 800605392 801177750 801240082 801163712 800811768 801112289
2305.8 801112289 801472778 800968933 800459290 800292282 800466690 800104828 800206223 800442352 800739288 800910187
$$ packed form
2238.3G98056107N7907K57492N93567n7907N5389K94800J83334J66321m27017j21537
2248G99058456k99224l33863k60391j14975J89133J37329O27212K75574M52805n0965
2257.6G99681091o42929Q6746K85874M84009j98441l57819k06146m3945L2959j59988
2267.3G98961411K84500J47171L51867K0676L6469J86538q1863J18332k88239K43683
2276.9G99980545K92969J04904k65274n87387j80283l2806O60629p2327O3935L18298
2286.5H00283203k07367L07465k87705l4103K40250Q9569j99280k23160K56195k68555
2296.2G99956512J99585K19651q1940K0828K90756N72358O2332p6370l51944L00521
2305.8H01112289L60489n03845n09643j67008J74408l61862J01395K36129K96936J70899
$$ plain form
2315.5 800910187 800385284 801045151 801887131 802493286 802759247 801791382 801172638 801440353 801255722 800765457
2325.1 800765457 800952988 801153259 801675644 801824493 801319122 800566559 800127640 800972748 801828156 802637634
2334.8 802637634 802847595 802026749 800713043 800360413 800488815 800224838 800985413 801132050 801460037
2343.4 801460037 801409454 800451355 800126495 799505081 799668121 800566177 801400909 801561127 801285400 801013870
2353.1 801013870 801338654 802113876 801646500 801083298 800058136 799750977 800469818 800771255 800490952
2361.8 800490952 800548935 801884842 801121140 799898911 800297546 800481491 799317780 798820343 798942566
2370.4 798942566 798164597 797962112 797422867 797345200 797318268 796785583 796818390 796926498 797218018 796727066
2380.1 796727066 796294098 796386719 796362991 796327133 796179733 796421280 796513138 796330872 795773392 795407028
$$ packed form
2315.5H00910187n24903O59867Q41980O06155K65961r67865o18744K67715j84631m90265
2325.1H00765457J87531K00271N22385J48849n05371p52563m38919Q45108Q55408Q09478
2334.8H02637634K09961q20846j313706l52630J28402k63977P60575J46637L27987
2343.4H01460037n0583r58099l24860o21414J63040Q98056Q34732J60218k75727k71530
2353.1H01013870L24784P75222m67376n63202j025162l07159P18841L01437k80303
2361.8H00490952N7983J335907p63702j222229L98635J83945j163711m97437J22223
2370.4G98942566p77969k02485n39245p7667k6932n32685L2807J08108K91520m90952
2380.1G96727066m32968R2621k3728l5858j47400K41547R1858j82266n57480l66364
$$ plain form
2389.7 795407028 795348434 794690628 794543610 794925156 795135040 794954453 794767532 794583130 794505997 794910049
2399.4 794910049 794940262 795009155 794828949 794308319 794023819 794088364 794281387 793840408 793581924 793572693
2409 793572693 793406067 793048706 793089066 793446808 793342590 793433685 793368225 793031616 792449722 792453842 792739410
2419.6 792739410 792103882 791783981 791480713 791167755 790835876 790619888 791055908 791225052 791007385 790510788
2429.3 790510788 790599136 790960236 790772858 790280685 789582520 789032516 788630981 788460159 788320999 788338394
2438.9 788338394 788457565 788516159 788354263 788134384 788215714 787890015 787843857 787958221 787611923 787041016
2448.6 787041016 786521454 786389694 786084747 785859756 785346909 784824219 784765320 784669342 784864883 785213699
2458.2 785213699 785478973 785344772 785471115 785483398 784870224 784350739 783667603 783188934 782787781 782488403
$$ packed form
2389.7G95407028n8594o57806j47018L81546K09884j80587j86921j84402p7133M04052
2399.4G94910049L0213O8893j80206n20630k84500O4545J93023m40979k58484r231
2409G93572693j66626l57361M0360L57742j04218R1095o5460l36609n81894M120K85568
2419.6G92739410o35528l19901l03268l12958l31879k15988M36020J69144k17667m96597
2429.3G90510788Q8348L61100j87378m92173o98165n50004m01535j70822j39160J7395
2438.9G88338394J19171N8594j61896k19879Q1330l25699m6158J14364l46298n70907
2448.6G87041016n19562j31760l04947k24991n12847n22690n8899r5978J95541L48816
2458.2G85213699K65274j34201J26343J2283o13174n19485o83136m78669m01153k99378
$$ plain form
2467.8 782488403 781946564 781375656 781999054 782729950 782635956 782300110 782566452 782820282 782446899 782046967
2477.5 782046967 782118378 782128067 781423187 780969772 780699463 780317688 780123901 779987793 779622040 779511948
2487.1 779511948 779876938 779703064 779882736 780215988 780213928 780218124 779855194 779567642 779006271 778491974
2496.8 778491974 777825928 777133102 777092209 777195816 777514648 777716675 778119125 778596878 778832016 778778152
2506.4 778778152 778299332 777807999 777374496 777294769 776959000 776373520 775933075 775685272 775682297 775862274
2516.1 775862274 776212463 776027374 776066818 776553421 776908798 776587372 776152420 776497574 776027069 775149841
2525.7 775149841 774634018 774276962 773760071 773216705 773272552 773184204 773207779 773132706 773367004 774026718
2535.4 774026718 774251022 774203491 774013519 773898392 773298569 773079453 772681885 771640778 771019974 770425568
$$ packed form
2467.8G82488403n41839n70908O23398P30896r3994l35846K66342K53830l73383l99932
2477.5G82046967P1411R689p04880m53415k70309l81775j93787j36108l65753j10092
2487.1G79511948L64990j73874J79672L33252k060M196l62930k87552n61371n14297
2496.8G78491974o66046o92826m0893J03607L18832K02027M02450M77753K35138n3864
2506.4G78778152m78820m91333m33503p9727l35769n85480m40445k47803k975J79977
2516.1G75862274L50189j85089L9444M86603L55377l21426m34952L45154m70505q77228
2525.7G75149841n15823l57056n16891n43366N5847q8348K3575p5073K34298O59714
2535.4G74026718K24304m7531j89972j15127n99823k19116l97568j041107o20804n94406
$$ plain form
2545 770425568 770446701 770339050 770426865 770885010 770801697 770867996 771005096 771253738 771064148 770521622 769929504
2555.6 769929504 769404297 768859177 768112946 767760696 767235489 767078476 767341003 767310638 767412491 768040466
2565.2 768040466 768435211 768102112 768006134 767608719 767351608 766828232 765592117 765169220 764899139 764469452
2574.9 764469452 764131165 764128036 764224625 764382706 764460220 764461365 764968033 764760056 764772644 764833450 764008713
2585.5 764008713 763301163 762580490 762137299 761511078 761100845 761207504 761365356 761588058 761637497 761957321
2595.1 761957321 762182007 762264252 762352066 762405014 762140732 761368103 760565567 759900131 759553223 759247055
2604.8 759247055 759129639 758927612 758958817 759441376 759629364 759746170 759569626 759435272 759204407 758985672
2614.4 758985672 758692169 758010864 757486572 756401520 755553513 755305099 755352783 755271835 754694901 754652634
$$ packed form
2545G70425568K1133j07651Q7815M58145q3313O6299J37100K48642j89590n42526n92118
2555.6G69929504n25207n45120p46231l52250n25207j57013K62527l0365J01853O27975
2565.2G68040466L94745l33099r5978l97415k57111n23376j236115m22897k70081m29687
2574.9G64469452l38287l129R6589J58081P7514J145N06668k07977J2588O0806q24737
2585.5G64008713p07550p20673m43191o26221m10233J06659J57852K22702M9439L19824
2595.1G61957321K24686Q2245Q7814N2948k64282p72629q02536o65436l46908l06168
2604.8G59247055j17416k02027L1205M82559J87988J16806j76544j34354k30865k18735
2614.4G58985672k93503o81305n24292j085052q48007k48414M7684q0948n76934m2267
$$ plain form
2624.1 754652634 754512024 754385910 754441833 754187241 753736191 753410492 753070679 752047577 751499405 751311646
2633.7 751311646 750860748 750344849 749679184 749229889 749109802 749446640 749774399 749818268 749181366 748562927
2643.4 748562927 748268433 747357483 746903458 746540070 745807877 745352402 744968491 744550858 743805923 743254547
2653 743254547 743434296 743475723 742780991 742642059 743150330 742959518 742181625 741493759 741230545 741064758
2662.6 741064758 740592804 739919434 739643250 739095993 738227921 738171692 738111649 737972794 737989502 738144913
2672.3 738144913 738080750 737381897 737051010 736739273 736173935 735721970 735466537 735073242 734286118 733813019
2681.9 733813019 733484268 733093338 732786560 732921829 733118744 732562790 731946259 731697006 731565018 731320267
2691.6 731320267 731043549 730810089 730486984 730126419 729770050 729224701 728527527 728160172 727914810 727755051
$$ packed form
2624.1G54652634j40610j26114N5923k54592m51050l25699l39813j023102n48172j87759
2633.7G51311646m50898n15899o65665m49295j20087L36838L27759M3869o36902o18439
2643.4G48562927k94494r10950m54025l63388p32193m55475l83911m17633p44935n51376
2653G43254547J79749M1427o94732j38932N08271j90812p77893o87866k63214j65787
2662.6G41064758m71954o73370k76184n47257q68072n6229o0043j38855J6708J55411
2672.3G38144913o4163o98853l30887l11737n65338m51965k55433l93295p87124m73099
2681.9G33813019l28751l90930l06778J35269J96915n55954o16531k49253j31988k44751
2691.6G31320267k76718k33460l23105l60565l56369n45349o97174l67355k45362j59759
$$ plain form
2701.2 727755051 727785339 727467880 726844788 726564789 726342239 726069412 726137466 725779800 725458755 725223923
2710.9 725223923 724569626 724012299 723372803 722948685 722418289 722025986 721786423 721293945 721296692 721484070
2720.5 721484070 721715012 721531372 721425018 721471710 721121292 721117935 720327759 718940964 717964172 717366409
2730.2 717366409 717169724 717179794 717230072 716802292 716673737 716896362 717164154 717416840 717181015 717116699
2739.8 717116699 716786575 716206207 715937347 715300903 714500732 714225388 714272919 714169083 713811111 713300095
2749.4 713300095 713181152 713504715 713727112 713800430 713622742 713050079 712427368 711953278 711772537 711626968
2759.1 711626968 710984421 710515747 710040131 709546280 709493179 709308548 709677429 710253983 710349197 710305710
2768.7 710305710 710082550 709992981 709834976 709305725 708567429 707934723 707166519 706483231 706048431 705548477
$$ packed form
2701.2G27755051L0288l17459o23092k79999k22550k72827O8054l57666l21045k34832
2710.9G25223923o54297n57327o39496m24118n30396l92303k39563m92478K747J87378
2720.5G21484070K30942j83640j06354M6692l50418l357p90176j386795r76792n97763
2730.2G17366409j96685J0070N0278m27780j28555K22625K67792K52686k35825o4316
2739.8G17116699l30124n80368k68860o36444q00171k75344M7531j03836l57972n11016
2749.4G13300095j18943L23563K22397P3318j77688n72663o22711m74090j80741j45569
2759.1G11626968o42547m68674m75616m93851n3101j84631L68881N76554R5214m3487
2768.7G10305710k23160q9569j58005n29251p38296o32706p68204o83288m34800m99954
$$ plain form
2778.4 705548477 705620193 705996628 706181870 705893631 705610962 705718613 705464249 704966049 704456711 704196625
2788 704196625 703547134 702598648 702005386 701260834 700442276 699769745 699826584 699965515 699908600 699978638
2797.7 699978638 699553070 698885880 697968750 697391891 696924057 695921478 694832916 693776016 692912674
2806.3 692912674 692132187 691881332 691696243 691137390 690490646 689741821 689706879 689542847 688576889 687818375
2816 687818375 687299652 686542282 685450821 684130478 682761154 681721344 681139755 680720596 679964142
2824.7 679964142 679019928 678515091 678404465 678136597 677571411 676903000 675958023 674818039 673465729
2833.3 673465729 672008209 670454865 668749008 667517853 666766586 666100006 665029984 664059296 663558350
2842 663558350 662663727 661422043 659994354 658546524 657136459 655697784 654226837 652409439 650407104
$$ packed form
2778.4G05548477P1716L76435J85242k88239k82669J07651k54364m98200n09338k60086
2788G04196625o49491r48486n93262p44552q18558o72531N6839J38931n6915P0038
2797.7F99978638m25568o67190r17130n76859m67834j002579j088562j056900q63342
2806.3F92912674p80487k50855j85089n58853o46744p48825l4942j64032r65958p58514
2816F87818375n18723p57370j091461j320343j369324j039810n81589m19159p56454
2824.7F79964142r44214n04837j10626k67868n65186o68411r44977j139984j352310
2833.3F73465729j457520j553344j705857j231155p51267o66580j070022r70688n00946
2842F63558350q94623j241684j427689j447830j410065j438675j470947j817398k002335
$$ plain form
2850.7 650407104 649024963 648114243 646453400 645299988 645009460 644270630 643710098 643296661 642983551
2859.4 642983551 642271271 640965195 639909592 638696823 637339668 636076088 634744453 633019104
2867.1 633019104 631194153 629737206 627975159 626182289 624774017 623312759 621870728 620165787
2874.8 620165787 618144264 616375999 614584503 612822151 611142502 609180527 607527428 606249390
2882.5 606249390 604914017 603658676 602855263 602277298 601505966 601169853 601271973 601125374 600705223
2891.2 600705223 600212059 599545746 598964348 598905792 598980446 598759193 598063469 597326851 596785851 596465912
2900.8 596465912 596495781 596421356 596337280 596003304 595329056 594717941 594210167 593695908 592928314 592095108
2910.5 592095108 591286926 590775757 589844666 588052559 586473999 585135345 583858604 582517891 581172180
$$ packed form
2850.7F50407104j382141r10720j660843j153412k90528p38830n60532m13437l13110
2859.4F42983551p12280j306076j055603j212769j357155j263580j331635j725349
2867.1F33019104j824951j456947j762047j792870j408272j461258j442031j704941
2874.8F20165787k021523j768265j791496j762352j679649j961975j653099j278038
2882.5F06249390j335373j255341q03413n77965p71332l36113J02120j46599m20151
2891.2F00705223m93164o66313n81398n8556P4654k21253o95724p36618n41000l19939
2900.8E96465912K9869p4425q4076l33976o74248o11115n07774n14259p67594q33206
2910.5E92095108q08182n11169r31091j792107j578560j338654j276741j340713j345711
$$ plain form
2919.2 581172180 579838066 578496094 577456322 576047935 574525223 573913345 573669395 572869148 571745491
2927.8 571745491 571118736 571327477 571345673 571032066 571401443 572040672 573096161 574488144 575786743
2936.5 575786743 577062149 578199959 579858932 581739693 583463936 585380402 587689247 589760208
2944.2 589760208 591519699 593551712 595249405 597382011 599849091 601893616 603689003 605414734
2952 605414734 607531929 609629745 611799545 613329430 614826813 617000504 618774414 620685425 622473564
2960.6 622473564 624220886 626548805 628551445 629248581 630125580 632227745 634356689 636005058 637042732
2969.3 637042732 638880692 640523758 641020355 642289963 643802795 644880981 645595322 646531601 647788010
2978 647788010 648981857 649934235 650990372 652454453 653164444 653930664 655145035 656317062 657032013
$$ packed form
2919.2E81172180j334114j341972j039772j408387j522712o11878k43950q00247j123657
2927.8E71745491o26755K08741J8196l13607L69377O39229J055489J391983J298599
2936.5E75786743J275406J137810J658973J880761J724243J916466K308845K070961
2944.2E89760208J759491K032013J697693K132606K467080K044525J795387J725731
2952F05414734K117195K097816K169800J529885J497383K173691J773910J911011J788139
2960.6F22473564J747322K327919K002640O97136Q76999K102165K128944J648369J037674
2969.3F37042732J837960J643066M96597J269608J512832J078186P14341R36279J256409
2978F47788010J193847R52378J056137J464081P09991P66220J214371J172027P14951
$$ plain form
2986.7 657032013 657496262 658580017 659204178 659635620 659692230 659598312 660034637 660412140 661129150 661724854
2996.3 661724854 662426834 663080902 663323975 663378906 662924500 662645416 662739334 662262573 661398468 661467209
3006 661467209 661510544 661094360 660765686 660311890 660274277 660296860 660200958 659924469 659862442 659624023 658706894
3016.6 658706894 657931290 656999969 656286926 655606613 654831009 654043198 653591309 653576584 652536697 651393127
3026.2 651393127 650717697 650432739 650331879 649757462 649047241 648198471 647541428 646334305 644966049
3034.9 644966049 643973007 642774734 641653137 640403061 639654236 639315300 638679276 637725830 636784668
3043.6 636784668 636015053 635010490 634258423 633701935 632731056 631286469 630014687 628895493 627561646
3052.2 627561646 626605186 626020317 625401001 624448051 623278847 622316818 621846657 621347961 620455437
$$ packed form
2986.7F57032013M64249J083755O24161M31442N6610r3918M36325L77503P17010N95704
2996.3F61724854P01980O54068K43073N4931m54406k79084R3918m76761q64105O8741
3006F61467209M3335m16184l28674m53796l7613K2583r5902k76489o2027k38419r17129
3016.6F58706894p75604r31321p13043o80313p75604p87811m51889j4725j039887j143570
3026.2F51393127o75430k84958j00860n74417p10221q48770o57043j207123j368256
3034.9F44966049r93042j198273j121597j250076p48825l38936o36024r53446r41162
3043.6F36784668p69615j004563p52067n56488r70879j444587j271782j119194j333847
3052.2F27561646r56460n84869o19316r52950j169204r62029m70161m98696q92524
$$ plain form
3060.9 620455437 619256783 617864037 616969452 615701370 614481850 613579292 611867599 610421028 609564285
3069.6 609564285 609226151 608689804 607740898 607072029 606187630 605286026 604442406 603461914 602170486
3078.3 602170486 600643616 599342957 598560143 597580872 595957451 594965477 594397926 593666191 592941017
3087 592941017 592296257 591541481 590366936 589104614 587883759 586608124 584969559 584088402 583822060
3095.6 583822060 582658577 581214485 579637184 578689461 578570023 577745895 576274567 575325127 574754028
3104.3 574754028 573944054 573287964 572390709 570888176 569485550 568859673 568140068 566867256 565499649
3113 565499649 564028587 563281708 562404747 561469536 561076241 560344810 559510231 558665924 557942467 556574402
3122.6 556574402 555153656 554050140 552868729 551983070 550647583 550072861 549420624 547900848 547056961
$$ packed form
3060.9F20455437j198654j392746q94585j268082j219520r02558j711693j446571q56743
3069.6F09564285l38134n36347r48906o68869q84399r01604q43620r80492j291428
3078.3F02170486j526870j300659p82814r79271j623421r91974n67551p31735p25174
3087E92941017o44760p54776j174545j262322j220855j275635j638565q81157k66342
3095.6E83822060j163483j444092j577301r47723j19438q24128j471328r49440n71099
3104.3E74754028q09974o56090q97255j502533j402626o25877p19605j272812j367607
3113E65499649j471062p46879q76961r35211l93295p31431q34579q44307p23457j368065
3122.6E56574402j420746j103516j181411q85659j335487n74722o52237j519776q43887
$$ plain form
3131.3 547056961 546571693 545742226 544325829 543415527 542496300 541648712 541246223 539913673 538498955
3140 538498955 537489281 536504173 535581665 534835625 533818779 532970390 532803230 531717186 529913559
3148.7 529913559 528713455 528144798 527604027 527243538 526717834 525723610 525010948 524089775 522992401
3157.4 522992401 521814804 520769577 519867172 518876495 518145752 517613907 517276802 515850105 513991547
3166 513991547 513174248 512743111 511964149 511020699 510549698 509780617 508883781 507781067 506763496 506342735
3175.7 506342735 505748672 505178490 504426498 504148598 503484535 502244301 501423454 500534210 500105095
3184.4 500105095 499089928 497874985 497126770 496429863 495976486 495093613 494271660 493586349 492813606
3193 492813606 491757240 491135216 490982590 490352211 489749260 488782349 487821617 487000351 486470833 486235161
$$ packed form
3131.3E47056961m85268q29467j416397r10302r19227q47588m02489j332550j414718
3140E38498955j009674r85108r22508p46040j016846q48389j67160j086044j803627
3148.7E29913559j200104n68657n40771l60489n25704r94224p12662r21173j097374
3157.4E22992401j177597j045227r02405r90677p30743n31845l37105j426697j858558
3166E13991547q17299m31137p78962r43450m71001p69081q96836j102714j017571m20761
3175.7E06342735n94063n70182p51992k77900o64063j240234q20847q89244m29115
3184.4E00105095j015167j214943p48215o96907m53377q82873q21953o85311p72743
3193D92813606j056366o22024j52626o30379o02951r66911r60732q21266n29518k35672
$$ plain form
3202.7 486235161 485463562 484667969 483957901 483254318 482308197 481514320 481003494 480435867 479657402 478864632
3212.3 478864632 478829422 478296890 477286530 476740074 476606979 476454163 475508385 474220352 473063622
3221 473063622 472745857 472549057 471765022 471117134 470778580 470391922 469649467 469203415 468654709 468145142
3230.7 468145142 467718430 467164574 466827812 466306419 466029129 465141602 463903809 463223953 462746582
3239.3 462746582 462495689 461792259 460921249 460601730 461119690 461094704 460079651 459252014 458375397 457777138
3249 457777138 457456703 457494926 457233505 456427994 455641518 454526787 454141350 454401398 454161797 453780479
3258.6 453780479 453925591 453546181 452304153 451928520 452212868 451509972 450184593 450056229 450263977
3267.3 450263977 449719582 448983040 448016129 447357025 447604027 448052406 447662163 447261162 446802063 445878983
$$ packed form
3202.7D86235161p71599p95593p10068p03583r46121p93877n10826n67627p78465p92770
3212.3D78864632l5210n32532j010360n46456j33095j52816r45778j288033j156730
3221D73063622l17765j96800p84035o47888l38554l86658p42455m46052n48706n09567
3230.7D68145142m26712n53856l36762n21393k77290q87527j237793o79856m77371
3239.3D62746582k50893p03430q71010l19519N17960k4986j015053q27637q76617n98259
3249D57777138l20435L8223k61421q05511p86476j114731l85437K60048k39601l81318
3258.6D53780479J45112l79410j242028l75633K84348p02896j325379j28364K07748
3267.3D50263977n44395p36542r66911o59104K47002M48379l90243m01001m59099r23080
$$ plain form
3276.9 445878983 445426750 445238533 445087662 444679031 444415016 443954620 443097305 442662697 442726250 442968330
3286.6 442968330 442210770 441441841 441343346 441702995 441877060 441064453 440756989 440343628 439668617 438923836
3296.2 438923836 438254318 437954941 437260323 437338219 437420807 437044296 436869774 436645317 436260338 435480614
3305.9 435480614 435393753 435319939 434265175 433504333 433673744 433500862 432909317 432786942 432143898 431327438
3315.5 431327438 431082153 431040649 430505028 430000496 430184860 429914703 429264717 428574715 428112106 427966347
3325.2 427966347 427791901 426980705 425879059 425493813 424941902 424927330 424957352 424144478 423827972 423617363
3334.8 423617363 423032837 422047386 421577377 421690712 421492996 420968857 420338898 420158997 419702263 418958931
3344.4 418958931 418322334 417740402 417418633 416890030 416467667 416339493 416146431 415821266 415188980 414390068
$$ packed form
3276.9D45878983m52233j88217j50871m08631k64015m60396q57315m34608O3553K42080
3286.6D42968330p57560p68929r8495L59649J74065q12607l07464m13361o75011p44781
3296.2D38923836o69518k99377o94618P7896Q2588l76511j74522k24457l84979p79724
3305.9D35480614q6861p3814j054764p60842J69411j72882n91545j22375o43044q16460
3315.5D31327438k45285m1504n35621n04532J84364k70157o49986o90002m62609j45759
3325.2D27966347j74446q11196j101646l85246n51911j4572L0022q12874l16506k10609
3334.8D23617363n84526r85451m70009J13335j97716n24139o29959j79901m56734p43332
3344.4D18958931o36597n81932l21769n28603m22363j28174j93062l25165o32286p98912
$$ plain form
3354.1 414390068 413977280 413620644 413081970 412863808 412548981 411784248 411095924 411062927 411011848 410717621
3363.7 410717621 410413933 409709473 409090500 408530083 408191109 407911873 407451248 407321968 406866074 406130333
3373.4 406130333 405803337 405790825 405693703 405340118 404801369 404375305 403867836 403140793 402796707 402487221
3383 402487221 402285118 402076035 401604118 401621704 401878357 401643372 401132736 400967255 400531960 400112305
3392.7 400112305 400087128 399920425 399799232 399724655 399961700 399731369 399290962 399199562 398906288 398553810
3402.3 398553810 398210945 398074455 397995148 398082657 397643356 397018127 397109146 397146378 397340012 397426529
3412 397426529 397348900 397187042 397394829 397684059 397393761 397187958 396700668 396639595 396158066 395459747
3421.6 395459747 395762863 395831032 396130714 396303940 396178474 396131363 396721230 397495461 397410393 397207565
$$ packed form
3354.1D14390068m12788l56636n38674k18162l14827p64733o88324l2997n1079k94227
3363.7D10717621l03688p04460o18973n60417l38974k79236m60625j29280m55894p35741
3373.4D06130333l26996j2512r7122l53585n38749m26064n07469p27043l44086l09486
3383D02487221k02103k09083m71917J7586K56653k34985n10636j65481m35295m19655
3392.7D00112305k5177j66703j21193p4577K37045k30331m40407r1400k93274l52478
3402.3C98553810l42865j36490p9307Q7509m39301o25229R1019L7232J93634Q6517
3412C97426529p7629j61858K07787K89230k90298k05803m87290o1073m81529o98319
3421.6C95459747L03116O8169K99682J73226j25466m7111N89867P74231q5068k02828
$$ plain form
3431.2 397207565 397125015 397365379 397239799 397357635 397472954 397148094 397821884 398559380 398863258 398992195
3440.9 398992195 399536018 399191246 398445129 399078255 399744148 400032845 398991966 399279518 400509148
3449.6 400509148 400890579 401942902 402381592 402364044 402514534 402967987 403224297 403181915 403604507 403528900
3459.2 403528900 403644295 404188271 405140266 405504913 405357933 405779800 406044388 406512489 406981621 407775841
3468.8 407775841 408511353 409146423 409625702 409839401 410828056 411112785 411244545 411912460 412294464 412632179
3478.5 412632179 413223190 413816681 414168854 414824295 415130959 416088905 416621246 416318512 416907654 417159805
3488.1 417159805 417448883 417869797 418762016 419451370 419739265 421052933 422215233 422951088 422800751
3496.8 422800751 422803116 423235397 423272934 423830299 424528885 425428276 426040878 426409492 427306633 428106613
$$ packed form
3431.2C97207565q2550K40364j25580J17836J15319l24860O73790P37496L03878J28937
3440.9C98992195N43823l44772p46117O33126O65893K88697j040879K87552J229630
3449.6D00509148L81431J052323M38690j7548J50490M53453K56310m2382M22592p5607
3459.2D03528900J15395N43976R51995L64647j46980M21867K64588M68101M69132P94220
3468.8D07775841P35512O35070M79279K13699R88655K84729J31760O67915L82004L37715
3478.5D12632179N91011N93491L52173O55441L06664R57946N32341l02734N89142K52151
3488.1D17159805K89078M20914Q92219O89354K87895J313668J162300P35855j50337
3496.8D22800751K365M32281L7537N57365O98586Q99391O12602L68614Q97141P99980
$$ plain form
3506.5 428106613 428810120 430193863 430588036 430113068 431591949 432344246 432902908 434056549 434141235
3515.1 434141235 434636841 435345573 435682755 436036797 437003670 438102036 439194565 439924393 439760017
3523.8 439760017 440265388 440645294 441708679 443037300 443302498 443704948 444363899 444929695 445730324
3532.5 445730324 447390480 448318748 449157372 449433365 449166908 450775414 451553535 451877861 452748299
3541.2 452748299 453828049 454742088 455223923 455960732 456819534 457980309 457871094 459240150 460857315
3549.9 460857315 461739616 462953568 462293739 463508911 464784698 465850334 467227859 467631073 469323730
3558.5 469323730 470354919 470711136 471570358 474394302 475810966 475591660 479366150 480820122 480827560
3567.2 480827560 480420380 479726639 482660789 483893051 485235023 487490730 489193916 489529800 490757256
$$ packed form
3506.5D28106613P03507J383743L94173m74968J478881P52297N58662J153641Q4686
3515.1D34141235M95606P08732L37182L54042R66873J098366J092529P29828j64376
3523.8D39760017N05371L79906J063385J328621K65198M02450O58951N65796Q00629
3532.5D45730324J660156R28268Q38624K75993k66457J608506P78121L24326Q70438
3541.2D52748299J079750R14039M81835P36809Q58802J160775j09215J369056J617165
3549.9D60857315Q82301J213952o59829J215172J275787J065636J377525M03214J692657
3558.5D69323730J031189L56217Q59222K823944J416664k19306L774490J453972P438
3567.2D80827560m07180o93741K934150J232262J341972K255707J703186L35884J227456
$$ plain form
3575.9 490757256 493248100 494006004 495970497 497517891 498109779 499052048 500589066 502562981 504130020
3584.6 504130020 508815231 511056709 509073334 509422569 508387756 511084518 514441948 518279419
3592.3 518279419 519849892 520288162 523451576 522105637 524357071 527854843 528277855 530564728 530718002
3601 530718002 531665955 534282875 535758476 537649460 541058998 543173256 542517471 546847649 546087990
3609.6 546087990 545712166 553215675 554282494 552243462 554719772 553324242 557860222 563104095
3617.4 563104095 563041878 563516159 561579018 562758865 567247963 570160446 571953125 574593163 577032623
3626 577032623 579415131 585578117 585347519 575511551 579035759 583695526 589199066 589987450 588480873
3634.7 588480873 591308403 594291039 596059532 595820770 597378960 599946404 602164268 603075218 603430328
$$ packed form
3575.9D90757256K490844P57904J964493J547394N91888R42269J537018J973915J567039
3584.6E04130020M685211K241478j983375L49235j034813K696762L357430L837471
3592.3E18279419J570473M38270L163414j345939K251434L497772M23012K286873J53274
3601E30718002R47953K616920J475601J890984L409538K114258o55785M330178p59659
3609.6E46087990l75824P503509J066819k039032K476310j395530M535980N243873
3617.4E63104095o2217M74281j937141J179847M489098K912483J792679K640038K439460
3626E77032623K382508O162986k30598r835968L524208M659767N503540P88384j506577
3634.7E88480873K827530K982636J768493k38762J558190K567444K217864R10950L55110
$$ plain form
3643.4 603430328 605701332 608895607 614421158 612819672 609381104 615054626 613210716 608877220
3651.1 608877220 609032593 615555153 620406036 624146843 627826729 620181465 622822151 627759590
3658.8 627759590 628726044 629781876 630368309 632176971 633105698 634577370 635861664 637317657 642066422
3667.5 642066422 644454956 644532852 643335495 636086617 639480286 648103790 656428604 653447495 636056747
3676.2 636056747 640559540 648619995 652578354 649827805 650223846 652944107 654885178 657054138
3683.9 657054138 657664871 658369904 663174362 668524399 658769989 657453537 665512238 659507217 659394913
3692.6 659394913 663742371 664540482 666885071 667095032 666926270 668697891 669498596 672270355 674911194
3701.3 674911194 669276428 667477722 672184143 673795776 674111252 674631195 677872543 681669693 673813171
$$ packed form
3643.4F03430328K271004L194275N525551j601486l438568N673522j843910m333496
3651.1F08877220J55373O522560M850883L740807L679886p645264K640686M937439
3658.8F27759590R66454J055832N86433J808662R28727J471672J284294J455993M748765
3667.5F42066422K388534P7896j197357p248878L393669Q623504Q324814k981109j7390748
3676.2F36056747M502793Q060455L958359k750549L96041K720261J941071K168960
3683.9F57054138O10733P05033M804458N350037r754410j316452Q058701o005021j12304
3692.6F59394913M347458P98111K344589K09961j68762J771621Q00705K771759K640839
3701.3F74911194n634766j798706M706421J611633L15476N19943L241348L797150p856522
$$ plain form
3709.9 673813171 677662201 681422958 669020462 673031464 677020493 678273468 679978790 682782364
3717.7 682782364 683260880 679379883 681371994 687873383 684620132 679578781 684854889 685634384 684461517
3726.3 684461517 682097931 682910385 687823868 689433441 694203491 690651627 684873123 693854904
3734 693854904 691764603 681557922 682802582 686045990 687196808 690037918 693008804 690022278
3741.8 690022278 694466171 705306473 693566971 679130630 688353348 694182968 700589676 696993484
3749.5 696993484 688105240 699114838 692186966 686577530 692616730 696931152 699945755 694764404
3757.2 694764404 697212753 701284485 693189392 693470154 697770386 699145813 700042496 703376999 700453720
3765.9 700453720 696088104 700276108 706254120 705719528 695658875 697611542 700769577 701407700
$$ packed form
3709.9F73813171L849030L760757j2402496M011002L989029J252975J705322K803574
3717.7F82782364M78516l880997J992111O501389l253251n041351N276108P79495j172867
3726.3F84461517k363586Q12454M913483J609573M770050l551864n778504Q981781
3734F93854904k090301j0206681J244660L243408J150818K841110K970886k986526
3741.8F90022278M443893J0840302j1739502j4436341R222718N829620O406708l596192
3749.5F96993484q888244J1009598o927872n609436O039200M314422L014603n181351
3757.2F94764404K448349M071732q095093K80762M300232J375427Q96683L334503k923279
3765.9G00453720m365616M188004N978012n34592j0060653J952667L158035O38123
$$ plain form
3773.6 701407700 702410965 702368317 703478699 703912277 706611404 705971909 698418427 701489487 704438324
3782.3 704438324 705570908 706868591 703718033 703159332 704725647 705217361 705886078 706596756 707235641
3790.9 707235641 707347641 707479019 707372742 709222183 712394791 708518524 704821625 707606964 712032318
3799.6 712032318 716579285 707652893 698376160 703999100 708254089 713230972 717567749 706925125
3807.3 706925125 703742065 708776321 710889282 711600266 712627487 713455963 714966507 719423981 714497604
3816 714497604 701809311 709392471 715446548 718657761 717186737 701228638 706503220 712571564
3823.7 712571564 714218216 715888443 715634079 712645721 713166122 714998016 718134842 718670654 710649796
3832.4 710649796 713870773 720450745 715415497 715288925 722435074 714670792 712198105 719439774
$$ packed form
3773.6G01407700J003265m2648J110382M33578K699127o39495p553482L071060K948837
3782.3G04438324J132584J297683l150558n58701J566315M91714O68717P10678O38885
3790.9G07235641J12000J31378j06277J849441L172608l876267l696899K785339M425354
3799.6G12032318M546967q926392r276733N622940M254989M976883M336777j0642624
3807.3G06925125l183060N034256K112961P10984J027221Q28476J510544M457474m926377
3816G14497604j2688293P583160O054077L211213j471024j5958099N274582O068344
3823.7G12571564J646652J670227k54364k988358N20401J831894L136826N35812q020858
3832.4G10649796L220977O579972n035248j26572P146149p764282k472687P241669
$$ plain form
3840.1 719439774 713515396 713926468 719825363 717029724 713822327 715797653 717029114 718088608
3847.8 718088608 720479813 719455185 721655426 726502609 718263245 719211807 707845230 710713196
3855.6 710713196 719742966 718363342 717581024 719692688 721527100 722701492 717005386 718695755
3863.3 718695755 725313644 717990875 713562698 718021317 722957306 727890625 719451981 714702530
3871 714702530 718500137 722881241 725129318 715866318 718141861 722045212 721959000 724279327 727435684
3879.7 727435684 721591492 716253357 722537003 723747711 725285187 728569412 715624924 718300781
3887.4 718300781 722760391 724287186 728614807 726475830 718705444 720858688 723549118 722361069
3895.1 722361069 723900070 724973679 727914429 730203781 720963364 725160294 726148224 721526489
$$ packed form
3840.1G19439774n924378M11072N898895k795639l207397J975326J231461J059494
3847.8G18088608K391205j024628K200241M847183q239364R48562j1366577K867966
3855.6G10713196R029770j379624p82318K111664J834412J174392n696106J690369
3863.3G18695755O617889p322769m428177M458619M935989M933319q438644m749451
3871G14702530L797607M381104K248077r263000K275543L903351q6212K320327L156357
3879.7G27435684n844192n338135O283646J210708J537476L284225j2944488K675857
3887.4G18300781M459610J526795M327621k138977p770386K153244K690430j188049
3895.1G22361069J539001J073609K940750K289352r240417M196930R87930m621735
$$ plain form
3902.8 721526489 725825272 722135086 721023407 722124939 723058243 724323654 723413620 723544922 723130264
3911.5 723130264 723541107 724660339 724557877 726214142 729150314 725543442 721946869 726769104 726729279
3920.2 726729279 722870255 725252304 726836243 727800369 725539169 722677917 724804993 726377640
3927.9 726377640 726632004 725131454 726040726 728539200 725392151 724126511 725279007 725685425 726854019
3936.6 726854019 726920853 726401825 726524429 726258850 727396240 728206940 724692535 724676208 726339569
3945.2 726339569 727349396 728827515 727328644 728113556 727701340 725277405 727532349 727471695 726075897
3953.9 726075897 726765594 727609863 727626953 726944962 727608185 727686615 727951660 728073425 727185898 727929764
3963.6 727929764 728507690 728147736 727477112 727409286 728263779 728320999 727979431 728072510 728069992 728240356
$$ packed form
3902.8G21526489M298783l690186j111679J101532R33304J265411r10034J31302m14658
3911.5G23130264M10843J119232j02462J656265K936172l606872l596573M822235l9825
3920.2G26729279l859024K382049J583939R64126k261200k861252K127076J572647
3927.9G26377640K54364j500550R09272K498474l147049j265640J152496M06418J168594
3936.6G26854019O6834n19028J22604k65579J137390Q10700l514405j6327J663361
3945.2G26339569J009827J478119j498871P84912m12216k423935K254944o0654j395798
3953.9G26075897O89697Q44269J7090o81991O63223P8430K65045J21765q87527P43866
3963.6G27929764N77926l59954o70624o7826Q54493N7220l41568R3079k518J70364
$$ plain form
3973.2 728240356 728678818 728979340 728769379 728319321 728489151 728407288 728491898 729097519 729076080 728894882
3982.8 728894882 728841476 729141922 728781052 728450928 729149704 728936844 728296051 728088531 728449478 729364777
3992.5 729364777 730323410 730599670 729916458 729423523 729579926 729755783 729432526 729762039
4000.2 729762039
$$ packed form
3973.2G28240356M38462L00522k09961m50058J69830q1863Q4610O05621k1439j81198
3982.8G28894882n3406L00446l60870l30124O98776k12860o40793k07520L60947R15299
3992.5G29364777R58633K76260o83212m92935J56403J75857l23257L29513
4000.2G29762039
##END=$$ End of the data block
