##TITLE=$$ Begin of the data block
##JCAMP-DX=5.00 $$ ACD/SpecManager v 10.08
##SPECTROMETER/DATA SYSTEM=Varian
##DATE=20 Nov 2012 15:14:04
##DATA TYPE=INFRARED SPECTRUM
##DATA CLASS=XYDATA
##ORIGIN=
##OWNER=
##NPOINTS=3735
##FIRSTX=399.26403809
##LASTX=4000.35498047
##MAXX=4000.35498047
##MINX=399.26403809
##MAXY=80.31224823
##MINY=35.67800903
##XFACTOR=1.0000000000
##YFACTOR=0.000000100000000
##FIRSTY=59.21583557
##DELTAX=0.96440572
##XUNITS=1/CM
##YUNITS=TRANSMITTANCE
##XYDATA=(X++(Y..Y))
399.3 592158356 581978683 600698280 613444824 612121849 609433289 608299980 604575272 601038857
407 601038857 598203392 601231270 607319221 604832535 602614098 601491127 592744102 590769501 596138039
415.7 596138039 595052948 592619514 588578568 584161568 594955254 600697479 606577148 610195274
423.4 610195274 609265594 605752335 604419937 608550682 599887962 589406929 588922501 588402710 589869804
432.1 589869804 590482407 590909653 592671738 592428360 589258995 589432106 594776878 596121025 592674141
440.7 592674141 590665245 594692688 597288017 595407829 596991768 602909279 603373451 600099220 604176292
449.4 604176292 607338409 606735916 607861557 605605583 602038460 604658356 607040215 595986671
457.1 595986671 592900963 603116608 604745178 604781342 596878510 595001907 604447212 610933533 606258507
465.8 606258507 595508766 594099083 597896500 596923599 591652679 584920883 583743744 587788925
473.5 587788925 590025749 588571358 588033371 588043785 587236748 588707657 589910316 589670448 586736526
482.2 586736526 585640717 589024086 588030510 580937004 576265831 576583328 578415260 581698761 580066681
490.9 580066681 578608246 581535950 581674080 582973862 586627159 586848335 584623871 583810501 582348862
499.6 582348862 580650482 576940613 569313927 566890717 568011780 570738258 570141602 568160439 569071159
508.2 569071159 569743347 569938164 566474266 562542648 562038269 561601906 557865410 553711052 552020988
516.9 552020988 553771133 555336571 550520401 547862206 549165955 549355965 548857193 547981033 547659798
525.6 547659798 545859871 543893013 541821709 541843872 542104225 539769440 540036888 542925568 545635376
534.3 545635376 545723228 545857391 547308464 550131187 553481789 556172180 558058281 556619759 555122910
543 555122910 553799438 555240517 559585648 560358810 560085716 561126366 562875862 561019249 560706787
551.6 560706787 563140068 561399879 559614754 558516006 557770042 556148720 553157463 551512413 551310692
560.3 551310692 550963898 547060928 544710197 544181862 543430138 542702103 539655952 536404991 533412056
569 533412056 531335106 528976402 528458252 528309135 526491966 525997696 525371170 525932465 526555061 528243141
578.6 528243141 530020752 531909103 533926086 535094147 538444290 540884781 543617783 546818657
586.4 546818657 549326630 550981445 552501907 554289436 554386902 555716934 555721512 555709763 557270279
595 557270279 557140312 556463661 556333122 558176460 558739929 557308121 556141891 556204109 558077240 558135033
604.7 558135033 556150398 555088882 556959839 558241806 557739716 556714706 555947914 557689705 558745766
613.4 558745766 559875183 561299210 561576958 561758003 561741905 563262291 565240288 566803513 568540421
622 568540421 569760666 569196129 568984528 571013145 573187943 574463043 575061111 577196655 579877472
630.7 579877472 581624031 582499504 582513657 582645531 582908173 583908730 584525414 584811897 584629707 584624748
640.4 584624748 585142899 584582520 585514297 586568871 587492523 589921417 591364021 591728821 593129272
649 593129272 594957008 594071388 593318329 593774338 593572350 594139938 594524231 594271698 593612480 593962517
658.7 593962517 595396843 596259155 596839256 598002853 599429016 598894272 598677406 599698944 598190079
667.4 598190079 592723389 597234612 599999886 600679817 601524963 601597672 601176834 602154808 603301506
676.1 603301506 604967003 607018967 608555565 608928719 608606529 608807068 609450188 609835854 609173050
684.7 609173050 609603653 610406265 609109650 608458138 609351311 610511284 611878166 612067795 611419220
693.4 611419220 611618195 611540451 610362473 608320198 606510735 606559563 606404343 604862518 603351097
702.1 603351097 602779655 603100967 602552605 601860695 602673759 602436180 600876961 600958519 601102791 600859222
711.7 600859222 602057571 602832909 603195267 604498138 606311073 608987274 611470261 612906494 615555267
720.4 615555267 618375092 620398636 622960205 624725151 626209793 627904282 629218941 631260948
728.1 631260948 633205872 633988113 634380760 635728836 639140739 642753220 645111160 645736694 644459457
736.8 644459457 645248032 647746506 648426590 648327103 648728561 648289948 646661987 646649628 647433929 647447739
746.5 647447739 647145004 645748520 644668732 644917068 645010147 643307419 641016159 639657021 637797012
755.1 637797012 635685310 634289169 632505417 630256424 628349915 626309929 624806747 624994698 624748306
763.8 624748306 623650627 623502541 623889809 624691162 625155563 626201973 628499298 630154381 632015266
772.5 632015266 633782158 635587769 638692970 641471558 644682770 648777084 652134399 654904556
780.2 654904556 657141876 659347916 661743927 664714127 666694794 667500534 669621811 671574783 673875732
788.9 673875732 676388016 678339691 679884949 679973526 680962219 683044662 684572678 685396652 686573792
797.6 686573792 687965240 689219742 689969482 689560623 690875778 693996429 697227783 698520203 697957001
806.2 697957001 697845917 698520050 699645081 699050827 699319458 700466309 699706421 698839264 698836517 699250107
815.9 699250107 698965454 699117889 699253235 699719849 700690002 699745865 698609467 698690796 698457108 696994095
825.5 696994095 696538239 696423874 695593262 695228729 694737320 693642883 691264267 689396515 688092575
834.2 688092575 687128677 685941315 683347702 681711731 680528946 678515854 675610428 673639984 672976532
842.9 672976532 672312927 671856995 670594101 669492722 669110107 669279861 668459396 666173553 665148773
851.6 665148773 664546432 663085480 660371780 658155670 656895218 654352798 652037659 650863647 649931488
860.3 649931488 649411850 650074387 652539597 655520554 657458191 659718018 664094772 668284760 671016464
868.9 671016464 673943939 677801132 681174622 683551178 687127838 691451187 694540863 696496353
876.7 696496353 698973389 700793839 701414108 701588745 700837708 699464874 697553406 696420898 694146729
885.3 694146729 691013641 688942795 687657928 686658401 683909378 681179962 679091034 677266388 675836411
894 675836411 673838806 671385422 668837509 666767273 664066772 661852875 660707855 659286423 658070297
902.7 658070297 657010651 655646667 653760147 651692734 649324493 647414627 645340576 641637726
910.4 641637726 637138519 632447510 628450699 625047798 621724205 617888641 613643341 610371666
918.1 610371666 608381500 606890297 605147209 603127365 601296654 599682426 598173790 597825661 598068810
926.8 598068810 597247620 597017288 597444496 597302628 598104324 599229507 600660248 602351990 603143196
935.5 603143196 604470482 605934105 607075500 607912064 609148941 611365128 612840996 614090424 615318947
944.2 615318947 616451759 617426643 616913757 615304184 612584190 609058037 605199547 600317650 595963440
952.8 595963440 592008133 586817245 580647964 574487152 568815079 563166046 557084236 551013565
960.6 551013565 545021210 538360176 531736069 524571609 517479057 510954742 503959465 496203575
968.3 496203575 487789001 480176849 472193832 464420319 456332474 448074112 440537376 432630005
976 432630005 425561142 417198296 409149818 402113533 396184654 390644684 384779129 380314102 374812469
984.7 374812469 371096191 367800980 365482330 363772964 361674118 361320534 359299126 358979874 358695984
993.3 358695984 358677292 359066238 358284645 358340950 357729492 358501129 358820305 359844818 360131950 359739304
1003 359739304 360837326 361286545 361822586 360227737 360140839 359832458 358799210 358435097 357197189
1011.7 357197189 357698822 357406044 357891960 357228813 356780090 357616158 358211517 360083847 360444450
1020.3 360444450 361193047 361362381 363148651 364592896 365004234 366851082 367209167 368990860 370653458
1029 370653458 372830086 373813896 375191193 377606735 377870979 379779701 380674057 381607056 381371193
1037.7 381371193 381195946 381766243 381354027 382256966 381407814 381610451 381646805 382619400 383816376 383257751
1047.4 383257751 383843842 384034996 385600662 386122856 387715607 389556618 390943031 393578682 396503754
1056 396503754 400720367 402081909 404935989 408381958 411759186 416505852 420403671 425063858 428485298
1064.7 428485298 432466202 435419388 437859344 439079704 438318024 436912384 432440262 427454262
1072.4 427454262 421036415 416533737 413020515 409761887 408729591 406963654 407594032 407055473 406810188
1081.1 406810188 407907944 409856644 411578979 412208672 414693718 416345062 419874611 422433586
1088.8 422433586 424676285 427177391 429048233 432891006 435426025 438869247 441004639 442393532
1096.5 442393532 443643112 444540977 445946045 446097641 446996231 445921936 445538864 445655136 446256180
1105.2 446256180 448060112 448715324 450355949 450893631 453070221 454924583 456323624 458415871 459551086
1113.9 459551086 462377014 463929520 465392342 467095757 468907013 469957047 470677376 472916222
1121.6 472916222 474125557 475731087 476922684 478552437 479565125 480576096 482799110 483835793
1129.3 483835793 485424881 486433678 488464890 490956306 493127251 494391174 494433441 495644684 494993095
1138 494993095 493713722 492303925 490532570 487908134 484154549 481381073 478092995 475359306 472147980
1146.7 472147980 469495049 466759224 463954010 462600288 460264473 459033470 457430649 456288490
1154.4 456288490 455537224 455251808 455220299 454439926 455383644 455143318 455774803 456980362 458718491
1163.1 458718491 461210937 463366585 466904449 470457687 475619965 480117989 484717026 489720955
1170.8 489720955 494589081 500440331 505772171 512250290 518255119 524303169 529943428 534790764
1178.5 534790764 540166550 545255852 550516853 555545349 560828323 565691223 570262604 574366760
1186.2 574366760 577896881 581717834 585268974 588436279 590836716 592771606 593790550 594744949
1193.9 594744949 595843239 596389999 597730370 598829193 599373055 600003548 600825768 601616135 601914558
1202.6 601914558 602590027 603619537 604466896 604837646 605588875 606720734 607518959 608625755 610181465
1211.3 610181465 611923103 613279305 614568787 616238785 618350754 620566635 622392693 623826180
1219 623826180 624908142 625800476 626181297 625986443 625572357 625113068 624438019 623678474 622975883 622045250
1228.6 622045250 621628342 621737823 621264076 620539551 619648857 618950768 618955574 618490829 617307014 616232872
1238.3 616232872 615409775 614394760 613322525 612929916 612953224 612786751 612964668 613666077 614373970
1247 614373970 615015488 615754547 616869736 618000374 618661003 618860779 618964005 619060974 619063683 619031906
1256.6 619031906 619310722 620102692 620777588 621082306 621569901 622581673 623372002 623778839 624477844
1265.3 624477844 625361404 626157913 626682854 627591400 628422585 628557816 628438683 628610458 629677162
1274 629677162 630634537 631220474 632006569 632997017 633816795 634314499 634586945 634232063 633860245 633179779
1283.6 633179779 632145424 631434174 630792427 630428276 630471687 630174637 629877357 630256805 630455246 630534821
1293.3 630534821 630460358 629954872 629617615 628868065 627630234 626183662 624811707 623419418 621805840
1301.9 621805840 620249710 618809395 618101768 618262749 618162613 617401237 616638374 616205101 615627670
1310.6 615627670 614773788 614061775 613178482 611893806 611019287 610176353 609081497 608480530 608053932
1319.3 608053932 607631989 607254677 606693382 606486702 606386070 605688286 604343185 602422180 600555458
1328 600555458 598738289 596426849 593843460 591482010 589727974 588296051 586771126 585128212 584384766
1336.7 584384766 583955765 583452911 583083801 582890549 583563614 583987312 584367867 584419136 584558449 584703941
1346.3 584703941 584245682 583862839 583466454 583307533 583278770 583916016 584586639 584663124 584565620 584327736
1355.9 584327736 584528770 584088326 583074913 582373619 581585617 580651627 579887505 578904839 578248711
1364.6 578248711 578223305 577860031 578082275 578308868 578592834 579553070 579539185 579998436 580470200 580744934
1374.3 580744934 580758553 580523567 580737228 580491295 581026993 581493225 581926537 582423439 583165703 584363289
1383.9 584363289 585335464 587281418 589173775 590920639 592589188 593981361 594623871 595150833 595903206
1392.6 595903206 596295319 596223259 595127983 595532532 595832825 595823479 594953690 594582863 595335541 595055389
1402.2 595055389 594953156 594189682 592662849 591822319 590798187 589597702 588348236 587968483 586778679
1410.9 586778679 585606499 585384903 584970551 584445457 583965149 584152222 583879051 584565964 581533699
1419.6 581533699 579771576 580946999 580935555 580990791 579658890 579810371 580027237 579842911 580978165
1428.3 580978165 580931664 581057968 582012901 583656425 584213943 584778214 586312675 586345940 584911194
1437 584911194 585561066 588049011 588758011 589227486 589903870 590039291 591557388 592057800 593416672
1445.6 593416672 594589195 594959373 594207802 594351654 595399246 594864769 594781990 593696022 593969765
1454.3 593969765 594026489 592673416 592105789 589600296 591526260 591223869 593421783 594139061 594696960
1463 594696960 597049713 596649933 598776741 600420303 603063545 604652557 607126045 610349541 612313766
1471.7 612313766 617043571 618066902 623983688 627596169 631044617 634790382 637929726 641581650
1479.4 641581650 643912430 647680740 649897690 652694397 654876480 656833572 659889221 661015091
1487.1 661015091 663535080 664559708 666085892 667331619 670290298 673685455 675648117 678845444
1494.8 678845444 680241318 680338898 682308197 683444290 683375168 685143967 686975555 687163086 688864059
1503.5 688864059 690031509 690861969 686369858 685442123 691416397 691940842 695017014 697593842 698873138
1512.2 698873138 698506012 699991608 701345978 701114807 700495071 698303909 702113647 704244690 702935562
1520.8 702935562 700742035 701643295 705972214 707465210 707666626 708443680 710172272 710093536 710240707
1529.5 710240707 711727142 711272278 710954056 708504105 707407379 709828720 710786743 712003174 713168488
1538.2 713168488 710562439 705065384 711417389 713148804 713485718 715698318 714910736 713016739 713116302
1546.9 713116302 712996445 712611389 711358337 709541016 710157852 711893616 713337708 712027512 711791763
1555.6 711791763 714673462 716810684 710777664 706351242 704444122 707443008 707999649 707441254 706674423
1564.2 706674423 704122620 703445358 703723145 704254303 704455490 700216904 700953445 701832047 701394272
1572.9 701394272 701537399 702237167 700759201 693182144 693970490 693897400 692586670 691252670 690112762
1581.6 690112762 689688110 688763351 688900146 689053650 688789902 688372192 687623520 687183380 685783157
1590.3 685783157 684055710 681650925 680281906 679097748 677455750 676477661 674817505 674513702 673955002
1599 673955002 673293076 672872620 672383652 671577606 669743042 668689194 666867828 664907990 662190247
1607.6 662190247 660265808 658410873 655778351 654796982 653014526 652166519 650813675 650501556 649735107
1616.3 649735107 643249435 644727707 644674988 643788452 641932297 641274567 639895515 635359154 635292778
1625 635292778 635064240 635126839 632511368 631762390 632474136 632645988 632855568 632323494 633571510 634753761
1634.6 634753761 630513916 628539085 630174141 629986534 629658623 629903755 629613724 630472145 630680504
1643.3 630680504 632601967 634412727 632959900 634105759 634617081 636868515 638938255 642117844
1651 642117844 645406799 639704285 635164795 640902863 644191742 645939789 647853012 649595566 651459656
1659.7 651459656 653077011 655028610 656772461 657482300 660277939 662509995 664211502 665985870
1667.4 665985870 668214874 668436203 669372940 671589432 672174911 675273437 679030457 680414886 680007095
1676.1 680007095 683207550 686313629 688523483 690064545 690717163 694127808 698100128 699623108
1683.8 699623108 694562073 697545166 701751709 704247665 705682526 707527771 709198074 711268234
1691.5 711268234 713571777 715550308 718672409 721014709 716755219 719409714 723187103 728204193
1699.3 728204193 727718887 720400620 725396347 728559875 730283051 730351257 731219254 731076508 732077637
1707.9 732077637 734019852 734889984 735202484 735967102 737282791 738656311 739006729 737898102 739351425
1716.6 739351425 739680862 733967743 736717606 738960342 739804230 740127563 740228271 740516891 741268234
1725.3 741268234 741989059 742407837 743245010 744407883 743872986 742783203 744722366 746952057 743987961
1734 743987961 739498138 742212601 744675827 745820160 747450867 746584702 744977646 747830353 749413223
1742.7 749413223 749006500 749223175 750779343 751970062 752558441 752568512 751899872 753806839 753261642
1751.3 753261642 753350677 756204147 757724380 759715118 761682587 761249924 762336731 764248734 765714111
1760 765714111 767830734 766459808 765531311 767372742 767885971 768361282 769177475 769972534 769252548
1768.7 769252548 771199036 774673615 775428543 773732071 772603760 775475235 777300491 776208420
1776.4 776208420 776579132 776712418 777136765 776451492 775320816 776011505 777312088 778578644 778342438
1785.1 778342438 778860779 780296783 781396027 782211685 783352203 783186874 782532120 781335983 780185623
1793.8 780185623 781603622 781034012 779883194 781125031 782857132 783264923 782574463 783829880 783878403
1802.4 783878403 784847565 786410599 786535110 786557693 786335754 785896301 785565872 785683975 784525986
1811.1 784525986 784388123 785277786 785697327 786656952 787331314 788416901 788583832 789016571 789938812
1819.8 789938812 789464264 789285583 788628693 788983536 789403763 786579895 785869446 787568970 789311905
1828.5 789311905 789056091 787173157 788381271 790490112 791390915 791941605 792034683 791799927 791214828
1837.2 791214828 790034866 790179214 789774246 789724884 789804153 790159302 790266724 787395020 789787140
1845.8 789787140 792166138 792804337 792794418 792912140 793162308 792334518 791761627 791165237 791342163 791280670
1855.5 791280670 790790863 790876617 790480957 791012802 791545563 792114182 792822418 793523712 794051056 794010544
1865.1 794010544 793904800 792860718 793074493 792184067 790067749 790320206 790845184 791471634 791771393
1873.8 791771393 792396393 792870636 793517151 794291687 794589157 794826126 794512482 794175415 793557587 793636780
1883.4 793636780 793716965 793286667 793148270 792794647 793637009 794227219 793525848 794201736 795355759 795716400
1893.1 795716400 796047058 795657806 794343491 794534149 794488831 794331131 794465866 794369659 794195480 793707962
1902.7 793707962 793955994 794281311 794961548 795624390 795730057 795867004 795843430 795426483 794826050 795082474
1912.4 795082474 794999771 795149078 795073013 794862137 795747604 794299316 793560791 794451752 795190964 796074829
1922 796074829 795632324 795059586 795113373 795422058 795638199 795773392 795634613 795257950 795188675 795128098
1931.7 795128098 794995041 794642029 794918365 795074997 795206985 795577316 795349731 795318756 795633698 796494064
1941.3 796494064 795852203 794431610 795130386 795649490 795603943 795293732 795516052 795662842 795570450 795618210
1951 795618210 795520859 795638351 795646820 795660019 795501404 795686188 796017075 796202011 796548157 796428452 796392975
1961.6 796392975 796347122 796218414 796296921 796376419 796134033 795504379 795292892 795783920 796285477 796153946
1971.2 796153946 796264343 796222153 796279373 796737213 796753387 796976624 796911850 796676636 796291199 796160889
1980.8 796160889 796389084 795993729 795907288 795957642 796209106 796661606 796717072 796337357 796120071 796779175
1990.5 796779175 796964722 796221085 796039886 796361771 796291885 796005554 795563736 795239563 795289230 795008240
2000.1 795008240 795430298 796032333 796244278 796411743 796270523 796416092 796483688 796417007 796003876 795670013
2009.8 795670013 795615692 795468063 795209427 794487915 794412842 794847107 794933395 794716721 794870682 795089722
2019.4 795089722 794935760 794795532 794352188 794446487 794269409 793747177 793561783 793144684 792939072 792779541
2029.1 792779541 792867813 792684097 792782135 792860565 792423096 792730484 792827072 792902374 792643280 792244492
2038.7 792244492 792278976 791947708 791447983 791195450 791421967 790991592 790790253 791146622 791280670 791446686
2048.4 791446686 791420135 791841278 791920319 791858978 791603699 791109009 791281815 791369858 791289444 790761337
2058 790761337 790365143 790143814 790167542 790390320 790322189 790796967 791019745 791066132 791227646 791455612
2067.6 791455612 791544189 791256561 791245041 790972290 790655365 790140381 789641190 789789429 790438461 791024628
2077.3 791024628 790902786 790990753 791269836 791444778 791577759 791847763 791776352 791380463 791292877 790676575
2086.9 790676575 790393677 790271988 789978409 790084991 790262833 790660095 790807495 791017380 791166763 791441345
2096.6 791441345 791949387 792019196 791761551 791324463 791423416 791376419 790862885 790520401 790560226 790862656
2106.2 790862656 791138458 791356964 791539917 792157974 792283478 792220688 792372742 792299347 792378922 792013855
2115.9 792013855 791819839 791532288 791144867 791092834 790991287 791056213 790884323 791200180 791874847 792184677
2125.5 792184677 792231827 792294922 792337494 792072754 792061768 791772995 791559525 791709747 791383362 790817337
2135.1 790817337 790632172 790876999 791303787 791862183 791923904 792124863 792319565 792004700 791904831 791914749
2144.8 791914749 792052307 791700516 791423721 791462784 791422729 791622849 791784973 791850281 791454391 791594543
2154.4 791594543 792093124 792309036 792788010 792972794 792806168 792398224 792237473 791981125 791595840 791632309
2164.1 791632309 791843872 792063522 792202377 792739029 793102570 793318481 793461380 793507004 793833160 793762512
2173.7 793762512 793701248 793623962 793455048 793328934 793497086 793894196 793924026 794093475 794304581 794673996
2183.4 794673996 795010376 795296097 795598373 795762100 795844650 795446320 795531769 795631180 795374680 795458908
2193 795458908 795700836 795904617 795829468 796002731 796149979 796169968 796152802 796305771 796643600 796738892 796893234
2203.6 796893234 796849289 797080688 797151947 797069397 797259979 797177658 797137299 797014999 797419434 797929916
2213.3 797929916 798165054 798283157 798193283 798480759 798401489 798004227 797702942 797685547 797740326 797968903
2222.9 797968903 798592987 798798981 798611755 798153152 798283463 798679123 798915787 799186859 798980789 798885651
2232.5 798885651 798774948 798746719 798766174 798854980 798877029 798493958 798470764 799026489 799913330 800118179
2242.2 800118179 800009689 800130539 800440598 800548325 799966125 799697800 799386215 799161987 799018784 799176559
2251.8 799176559 799479370 799357071 799693451 799556046 799704361 800167313 800067139 800147400 800335236 800448074
2261.5 800448074 800024414 799821777 799748459 799756546 799428177 799126587 799983292 800395813 800637970 800664062
2271.1 800664062 800668411 800870972 800737686 800774918 800564728 800495605 800365906 800604553 800655289 800508041
2280.8 800508041 800681992 800469284 800907593 800752869 800566330 800774078 800863419 801436844 801101074 800956802
2290.4 800956802 801150589 801221466 801036682 800807800 801031876 800801010 800996933 801268692 801406784 801345367
2300 801345367 801617813 802454758 802382812 802227936 802255478 802523499 801982727 801225052 801512375 801500778
2309.7 801500778 801530457 801210709 801192474 801383667 801718521 802594604 802962723 803122482 802452469 801982498
2319.3 801982498 802146149 802229919 802418823 802254410 801930695 801500931 802156448 803035049 803054199 802423172
2329 802423172 802186050 803103027 802856674 801808319 801680679 802426071 802798386 802667236 802687073 802545547
2338.6 802545547 801743546 800901031 801549225 801995087 801668396 801226349 800869141 801094971 800607529 800037308
2348.3 800037308 800690994 801925583 802398834 802376556 802653961 803068924 802108383 801015701 801728134
2356.9 801728134 801390381 801006775 801022873 801010971 800625381 800874481 802783051 802710266 801981430 801164856
2366.6 801164856 800842133 800888748 800681610 800531998 799347382 798921051 798955307 798670349 797831879 797486954
2376.2 797486954 798108673 798279495 798431244 797973099 797517090 797467957 797313614 797306061 797325592 797539291
2385.9 797539291 797259827 796749268 796466217 796313705 796155701 795682526 795505676 795814972 796121063 795942612
2395.5 795942612 795954895 795974808 795906067 796023407 795650024 795456772 795309372 795125961 794768982 794440308
2405.2 794440308 794581985 794541321 794598618 794458694 794361801 794168701 794120331 794470978 794430542 794509354 794286957
2415.8 794286957 794147491 793951263 793433914 793158493 792649231 792331314 792220764 792097702 791608734 791332855
2425.4 791332855 791566467 791728668 791843491 791605301 791647339 791711502 791562729 791057892 790123291 789656830
2435.1 789656830 789558640 789589233 789365158 789235458 789123611 788871384 788745270 788763580 788877258 788601837
2444.7 788601837 788678284 788891068 788893661 788422546 787729645 787297287 786556091 786487885 786336365 786116638
2454.3 786116638 786214294 785965118 785921707 785862732 786034546 785816345 785750122 785984116 785870743 785629272
2464 785629272 784704132 783994598 783210144 782958145 783072815 782565384 782939987 783448639 783376541 783296356
2473.6 783296356 783767319 783776245 783119049 783255463 783394165 782959824 782126846 781633224 781279297 780680847
2483.3 780680847 780591888 780671921 780513763 780484619 780744705 780554886 780527420 780871277 780955963 780970154 780850906
2493.9 780850906 780750351 780239410 779621811 778974533 778365631 778065109 777808533 777988129 778251114 778951721
2503.5 778951721 779742279 779833221 779361191 779013062 779175720 778646469 778263931 778322372 777850189 776951904
2513.2 776951904 776242447 776200638 776314545 776777191 777128296 777184601 777372360 777703247 777672806 777005539
2522.8 777005539 776797256 776544647 776063614 775544281 774864197 774383392 774142075 774139633 773910675 774074020
2532.5 774074020 774216232 774210358 774722824 774996796 775080948 774874115 774361877 773716431 773293228 772924118
2542.1 772924118 772306976 771904221 771718445 771593094 771195374 771453552 771796646 771544266 771781311 771966782
2551.7 771966782 772062988 771940155 771303253 770713882 770439453 769767456 768881378 768536453 768127594 768135757
2561.4 768135757 768192978 768172913 768688431 769248657 769428482 768938904 768675613 768536453 768281403 767679672
2571 767679672 766722565 766186905 765751724 765593796 765416412 765357361 765368500 765476379 765884094 765902481
2580.7 765902481 765978928 765863876 765956650 765611267 764687653 764527664 764021530 763392563 762713852 762073669
2590.3 762073669 761991272 761898499 762017822 762287445 762605591 762848282 763157883 763361130 763231506 762893143
2600 762893143 762375412 762060852 761580734 760779724 760328522 760468292 760136032 759808426 760391922 760691223
2609.6 760691223 760638657 760442505 760192261 759938431 759938660 760020599 759352570 758455887 757376099 756650620
2619.3 756650620 756285553 755803452 755674820 755661621 755862198 755969620 755988388 755861053 755450516 755323868
2628.9 755323868 754962311 754284286 753522720 752671890 752174377 752068024 751770020 751037674 750281982 750037918
2638.5 750037918 750351334 750508041 750092163 749360657 749249573 749370041 748793259 748349915 747937622 747335510
2648.2 747335510 746707230 745806808 745260620 744921417 744398651 744410324 744535599 744153976 744012222 743959503
2657.8 743959503 743571320 743249283 743039169 742537537 741961823 741421356 740612335 740265198 739907761 739227905
2667.5 739227905 738943100 738882751 738942947 738657990 738498154 738514023 738536072 738553772 737780685 737283630
2677.1 737283630 737268219 737183228 736608276 735498047 734921265 734560089 734451065 734544983 734520569 734484406
2686.8 734484406 734014969 733350220 733053818 733010406 732680817 732530670 732316055 731566849 731072464 730499268
2696.4 730499268 730046082 730004120 729682007 729421692 729265518 728985672 728597641 727938690 727677841 727667389
2706 727667389 727452774 727371445 727076187 726740265 726258163 725564575 725194702 725064240 724840622 723842926
2715.7 723842926 722892761 722800217 722995987 722898865 722482452 722256470 722057495 722443008 722857666 722411423
2725.3 722411423 721919556 721072845 719967422 719365997 719026031 718699951 718776474 718658981 718285980 718419876
2735 718419876 718423691 718398743 718323593 718363190 718435898 717914352 717416611 716989670 716635818 715837555 715248337
2745.6 715248337 715261612 714701767 714387054 714276199 714389648 714895782 714953079 714842682 714710236 714553680
2755.2 714553680 714250793 713802719 713337021 712761612 712009735 711432114 711413879 711185379 710720673 710630798
2764.9 710630798 710808487 711205521 711566010 711755219 711887283 711585999 711016541 710618362 710146942 709466324
2774.5 709466324 708573532 707936325 707427826 707026520 707174301 707243576 707268143 706979370 706646805 707001190
2784.2 707001190 706957779 706373062 705910034 705368347 704617844 703961411 703091354 702221298 701705780 701331329
2793.8 701331329 701297531 700883942 700473938 700694885 700861053 700377502 699385147 698878860 698283539 697334900
2803.4 697334900 696374741 695542450 694739990 693509598 692839203 692612076 692243347 691555710 691053009
2812.1 691053009 691143570 690754852 690451660 689975815 688700333 687503967 686567535 685495529 684072800
2820.8 684072800 683039169 682466507 681846695 681025848 680317612 679883652 679501572 679318237 678646088
2829.5 678646088 677830734 677234802 675881500 674341888 673177032 672019653 671165390 670328827 668817368
2838.2 668817368 667224579 665772476 664836044 664637299 663980103 663005524 661990814 660513535 658657303
2846.8 658657303 656707764 655175018 653876114 652058334 650177689 649004059 647629395 646405029
2854.6 646405029 645916824 645293503 644914246 644584198 644007339 643116379 641823959 640838089 639748230
2863.2 639748230 638450356 637218132 635602264 633628654 631858444 630407333 628588791 626907463
2870.9 626907463 626049461 624923706 623084030 620938072 618729477 617110329 615748596 613805809
2878.7 613805809 611732025 610098534 608622093 607029343 605713882 604694214 603901672 603634224 603326454
2887.3 603326454 602773628 602345352 601930313 601540680 601122818 600560493 600157928 600030632 599741364 599122925
2897 599122925 598462143 598091698 598056374 598124504 598076668 597833023 597435532 596801186 596151123 595855370
2906.6 595855370 595585899 594625854 593603363 593351021 592967415 592006264 590480537 588612709 587370186
2915.3 587370186 586492653 584892464 582959366 581704369 580694504 579690628 578764381 577353172 576086273
2924 576086273 575611534 574888573 573667679 572994347 572843437 572806053 572190704 571534424 572230606 573356476
2933.6 573356476 574406853 575313072 576406403 578101349 579382095 580711021 582625160 584612465
2941.3 584612465 586445847 588607864 590837212 592723351 594858475 596564560 598083344 600120926
2949.1 600120926 602684822 605281944 607066650 608602295 610236816 612245522 614582405 616847954
2956.8 616847954 618489304 619609528 621045227 622866249 625152931 627262039 629121094 630722427
2964.5 630722427 632264671 633889313 635345573 637239532 638792763 640220337 641457825 642251053
2972.2 642251053 643352127 644627075 645972595 646627731 647600937 649225311 650526199 651569595 652407150
2980.9 652407150 653284454 653975906 655121155 656394272 657556839 658526611 659008026 659882355 660358047
2989.6 660358047 660645294 660884781 661056442 661697922 662034149 662348557 663162537 664277420 664650497
2998.2 664650497 664470901 664425278 664267273 664372482 664211502 663306961 662971573 663497467 663043900 662348480
3007.9 662348480 662335205 662303925 662262268 661798096 661683578 661642380 661471176 661242371 660398483 659817963
3017.5 659817963 659145126 658641205 658035049 656657791 655401688 654591827 654040527 653426971 653224716
3026.2 653224716 652956314 652329102 651750565 650956345 650247650 649674377 648963547 647841034 646712875
3034.9 646712875 645643539 644358215 643106995 642283554 641914902 641111450 640236435 639538116 639030075
3043.6 639030075 638724709 637685204 636331329 635413361 634631958 633287125 631770592 630360718 629139519
3052.2 629139519 628612099 628055038 627129784 626063271 625066910 624241219 623647499 623127213 622190933
3060.9 622190933 621089973 620127220 618952179 617268066 616247406 615452156 613982048 612649384 611340866
3069.6 611340866 610629730 610365486 609757500 609025803 608209534 607014313 605625343 604828262 604071274
3078.3 604071274 603140297 602019310 600699806 599183350 597531586 596795654 596045761 595116653 594445877
3087 594445877 593594551 592875290 592255020 591376114 589663162 588081589 586976357 586189079 585897408
3095.6 585897408 584913368 583381157 581798706 580575752 579870911 579214897 578492355 577754860 576883011
3104.3 576883011 575654144 574862289 574186096 572928581 571620712 570651970 569551239 568056068 566906662
3113 566906662 565846519 564879456 563940659 563143616 562774467 561986923 561006584 560216026 559519424 558159370
3122.6 558159370 556562271 555898514 555477486 554413986 552549820 551092796 550137939 549221001 548488922
3131.3 548488922 547778931 546747208 545473595 545073433 544539375 543518486 542672081 541408920 540206184
3140 540206184 539398766 538452873 537064743 536236382 535443726 534387741 533871498 532928429 531839485
3148.7 531839485 530922279 530389633 529820366 528923836 528367653 527353592 526173172 525096817 524162941
3157.4 524162941 523047180 521865997 521583824 521098862 520305862 519338951 517888680 516763229 516100388
3166 516100388 515405083 514464951 513244705 512093887 511631203 511257744 510510025 509396820 508507233
3174.7 508507233 508356056 507931824 506850700 505548897 504818306 504127922 503213577 502905426 502548943
3183.4 502548943 501663742 500525589 499522858 498586807 497789078 496851578 495894279 495614471 495041962
3192.1 495041962 494155807 493206749 492232590 491875229 491757393 490768242 489509430 489361382 488835297
3200.8 488835297 487796097 487097855 486460800 485765266 484835472 484385567 483678284 482798424 482317429
3209.4 482317429 481700325 481180267 480538826 480165024 479688454 478742867 477920456 477297783 476769028 475986328
3219.1 475986328 475157471 474363747 473838615 473230896 472237396 471738205 471798248 471696472 470954552 470151253
3228.7 470151253 469613152 468998947 468558540 468229942 467519073 467009811 466345062 465016975 464444542
3237.4 464444542 464302902 464021378 463472977 462796135 462532730 462330627 462310715 461529236 460737991 460442619
3247 460442619 459615326 459079704 458684540 458229561 457495880 457033882 456746140 455658150 455146103 455406342
3256.7 455406342 455341949 454649162 454237785 453812180 453140907 453077812 453010368 452548409 451891212 451499825
3266.3 451499825 450785141 450210037 450119057 449481697 449051056 448844223 448845024 448666306 448296700 447688942
3276 447688942 446715851 446707153 446530495 446207237 445637245 444637642 444503441 444392433 444191971 443861923
3285.6 443861923 443246651 442614250 442576256 442745667 442273293 442439384 442375908 441611137 441010132 440437317
3295.3 440437317 440246735 439743385 438883553 438339462 438099174 438114586 437824745 436913910 436303215 436752281
3304.9 436752281 437172661 436550217 435841980 435711594 435409203 434886780 434395218 433752251 433077393 432752037
3314.6 432752037 432460747 431778831 431066933 430632362 430580597 430056190 429423866 429480133 429303970 428806686
3324.2 428806686 428083038 427510872 426881027 426556778 426753082 425966911 425269547 425213852 424953117 424409790
3333.8 424409790 424190712 424167595 423036003 422137032 422221756 422334061 421789017 420568390 419745255 419430351
3343.5 419430351 419210281 418913841 418603821 418123703 417568169 416962128 416885567 417284508 416656876 415723038
3353.1 415723038 415052528 414811172 414440536 413458595 412945900 412263756 411752663 411533432 411484375 411627274
3362.8 411627274 411013908 410469093 410001068 409463272 409101143 408529968 408295250 408353806 407582512 406401787
3372.4 406401787 405631752 405011559 405300369 405660591 405302620 405009613 404622459 404394302 403943024 403610573
3382.1 403610573 403903313 403649864 402827759 402537231 402395363 401756973 401336861 401024857 400830536 400795059
3391.7 400795059 400336952 400107269 400491066 400685463 400479507 400219536 399599457 399190483 399071045 399003334
3401.3 399003334 399018097 398576736 398291626 398138885 397913628 397513046 397176666 397305069 397537308 397753143
3411 397753143 397297592 397187920 397504730 397527466 397568970 397365074 397604561 397592659 397138748 396590500
3420.6 396590500 396199303 396497383 396609001 396884003 397382431 397563896 397110710 396628304 396983871 397211838
3430.3 397211838 396856041 396648102 396903610 397271500 397825317 398075066 397852821 397615776 397828331 398330154
3439.9 398330154 398677177 399415092 398977051 398459358 399046211 399796143 400700951 399875984 399747391 400376205
3449.6 400376205 400730400 401871300 402154922 401834297 401761017 402596664 403313332 403498421 403797569 403782730
3459.2 403782730 404218674 404405746 404987106 405609894 405935020 406458855 406214447 406475220 407330704 408346481
3468.8 408346481 408987885 409164848 409262238 409435120 410238724 410813141 411542130 411804428 411776772 412451477
3478.5 412451477 413304176 414224586 414592018 414557953 414555321 415874634 417059250 416987953 417635269 417708054
3488.1 417708054 417514915 418218155 418986130 419517288 420210381 421489830 422823906 423688889 423240929
3496.8 423240929 422973289 423963089 424549446 424706192 425105400 425183258 425758018 427326546 428435097
3505.5 428435097 428771362 428855782 430097389 430811577 430347061 431446533 432438965 432979622 433555565
3514.2 433555565 434704590 435837746 436086655 436710091 436991005 437346153 438275337 439688721 440370865
3522.9 440370865 439798355 440307083 441400414 443173599 444235229 444127808 444310150 445015221 445176086
3531.5 445176086 445411491 447036896 448009186 449596558 450057106 449403801 451225700 452176208 452618027
3540.2 452618027 453223000 454235039 455341187 456305389 457536430 458140411 459036942 458357315 459408379
3548.9 459408379 460962868 462198448 463845177 463031693 464536324 465628090 466595421 468153191 468180428
3557.6 468180428 470193939 471774902 472248192 473051758 475165253 476095161 476613998 480386734 480095825
3566.2 480095825 479638100 479830627 479781151 483283119 484936104 486163979 487610474 489297104 490677452
3574.9 490677452 492393608 494585838 494891090 496962357 498452072 498576012 500059166 502163086 503837166
3583.6 503837166 505051804 509240608 510702248 508548241 510127831 510146294 512175293 514604721 518405609
3592.3 518405609 521096611 521940231 524649963 523746300 526095772 529075241 529738388 532774429 533021469
3601 533021469 533537979 535315819 536606331 539064751 542492218 544992104 543895035 546644440 545702286
3609.6 545702286 546325035 555231285 556787186 552792358 555524635 555701141 560425301 565367928 564881783
3618.3 564881783 565210266 563942299 565663681 569644852 571842461 574078217 577100639 579066086
3626 579066086 580993500 585995674 583434525 575410080 580757561 585768433 591323013 591918449 589505234
3634.7 589505234 592008858 594874916 597247734 597821579 599088364 601511841 603602180 604652023
3642.4 604652023 605220146 607782173 611301765 616218567 615184021 612634888 617236748 614003220
3650.1 614003220 609673805 611357231 618087006 622350311 625776634 630317802 622842407 624375534
3657.9 624375534 629225883 630450020 631674995 632406845 634483376 635228310 636153069 637633781 639084511
3666.5 639084511 643043900 644814529 645465240 644373550 636874962 640992203 649772339 658019333
3674.3 658019333 654734039 635919266 641582565 650700073 654903183 651989670 652205200 655419693
3682 655419693 657588501 658510666 658842239 660160980 664497375 669393082 659717636 658762817 667450180
3690.6 667450180 661914062 661184006 665202332 665882797 667674942 667899094 668179932 670306473 671303635
3699.3 671303635 673812637 676668930 671573181 669996109 674416122 674987717 675302429 676497803 679313889
3708 679313889 682062073 673776245 678175125 681984329 669366684 674121475 678624573 680270844
3715.7 680270844 682017670 684152756 684696579 681457291 683456650 689665909 685996246 681078949
3723.4 681078949 686099854 687472839 687638474 685232849 685022507 688907242 690671082 695656662 691086349
3732.1 691086349 685499344 694622803 692095032 680799713 682248001 686377029 687871933 691178513
3739.8 691178513 694105682 690489807 694906693 705770264 693520966 679680710 689719772 696434708
3747.5 696434708 703212051 699333267 689593048 699984207 693853226 688429108 694362411 698520050
3755.3 698520050 700976181 695990753 698003616 701684647 694257660 694389420 699007645 700562363
3763 700562363 701597595 705058899 701685944 697506638 701627045 707532196 707349091 697580566 699528503
3771.7 699528503 702851105 703494186 703758698 703533020 704942627 705635910 708451767 707544632 700645447
3780.3 700645447 704001923 706842194 707876434 708994980 705866470 705393448 706856079 707220306 707763443
3789 707763443 707563400 707603149 708019180 708588028 709279633 711578293 714840698 710497742 706416702
3797.7 706416702 709698257 714605179 719776001 710491562 700327072 705352097 709369583 715141830
3805.4 715141830 719646912 707998657 705308609 710944138 712971268 713204269 713627472 713720856 715269547
3814.1 715269547 720948410 719198303 706365738 711704407 716835098 720436630 720159454 703414688
3821.8 703414688 708805161 715146255 716699600 718573761 717784653 713972855 714272308 716078033 719600830
3830.5 719600830 720796356 713467484 716480637 722147980 716391907 716924973 724420853 715213623
3838.2 715213623 712072220 719780960 714424820 715609207 722042313 718819656 715531082 717952347
3845.9 717952347 718996201 719426575 721510468 720641403 722917786 728094025 721652451 721584549 705330048
3854.6 705330048 710615768 721444855 719477158 718356934 720968246 723230743 725271912 719416504
3862.3 719416504 719977722 726705856 720820160 716394196 720396576 725356445 730415573 721256332
3870 721256332 715545197 719979858 725327988 727958832 718600693 720282898 723484879 723335114 725592346
3878.7 725592346 728251724 722833557 718421097 724162140 724316864 725626907 729249496 717635269
3886.4 717635269 720324402 723923416 725579987 730573044 728111649 719749374 722481003 725554428
3894.1 725554428 724345474 726396332 727619858 729649658 730188675 720248413 725559540 727717514
3901.8 727717514 724555283 729198532 724306641 722811508 724155884 724938889 726258392 725618134 725784531
3910.5 725784531 725813370 726328659 726949463 727267456 728938065 730141907 725223465 723041000 728581467
3919.2 728581467 727914124 724326019 726932755 728602066 729731445 726958923 723891983 725838547
3926.9 725838547 727886963 729015121 727640228 728357010 730377655 727532425 726800079 728132401 728624039
3935.6 728624039 728973694 728512497 727857056 727810974 728127899 730006256 730984573 726929321 726730652
3944.3 726730652 728329163 729248886 730459976 728521576 729608383 729182053 727310562 729870834 729001999
3953 729001999 728024445 728928146 729437485 729623566 728295593 728382874 728762589 729801102 730043106 728158188
3962.6 728158188 728903961 730554352 731064682 730779266 730043869 730086746 730342941 730091095 730548325 730877762
3972.2 730877762 730305023 730145950 730171051 729826508 728978500 729111176 730166168 730626602 730634384 730653152
3981.9 730653152 730976639 731266556 731516953 730932693 730604706 731211319 731449203 731452942 730355988 730011368
3991.5 730011368 731055832 731737366 731805496 731264648 731127548 731224747 731829987 732362747 731920929
4000.2 731920929
##END=$$ End of the data block
