##TITLE=$$ Begin of the data block
##JCAMP-DX=5.00 $$ ACD/SpecManager v 10.08
##SPECTROMETER/DATA SYSTEM=Varian
##DATE=20 Nov 2012 15:14:00
##DATA TYPE=INFRARED SPECTRUM
##DATA CLASS=XYDATA
##ORIGIN=
##OWNER=
##NPOINTS=3735
##FIRSTX=399.26403809
##LASTX=4000.35498047
##MAXX=4000.35498047
##MINX=399.26403809
##MAXY=80.40455627
##MINY=35.65877914
##XFACTOR=1.0000000000
##YFACTOR=0.000000100000000
##FIRSTY=58.85752487
##DELTAX=0.96440572
##XUNITS=1/CM
##YUNITS=TRANSMITTANCE
##XYDATA=(X++(Y..Y))
399.3E88575249K489586J4259452N87235o616364L020287J0278587p784271j6965713
407E87844048O879386J1892052j949730k134247j718902p826004n775681K403374O317520
415.7E95931816O049194o37397k4872551k3481865K5652504J2719536q23861L871270
423.4E94408646L175926q90846j745568j683426j370086j524659j119041m796371J04675
432.1E84559250O074791J14517l977776j525077R09767L092575J173668j128655k63290
440.7E89029770k923164M759483P405434p6905J111450l811225m560051K737503N916748
449.4E99589043L772926K09579L194390j261940j528435L558502l258514j7593651
457.1E86681900j0244865J7652893O076927R78737M86984l036804j818390o28281J662369
$$ y = [588575249, 591064835, 605324287, 605911522, 599295158, 602315445, 612594032, 604809761, 587844048, 594723434, 606615486, 604665756, 602531509, 600812607, 592986603, 587210922, 589614296, 595931816, 601981010, 601343613, 576471062, 552989197, 578641701, 591361237, 590537376, 594408646, 597584572, 596693726, 594948158, 593264732, 591894646, 590369987, 589250946, 584454575, 584559250, 590634041, 590748558, 586770782, 585245705, 586155472, 589248047, 590421715, 589293060, 589029770, 586106606, 590866089, 598271523, 598194618, 599306068, 595494843, 590934792, 593672295, 599589043, 603361969, 603571548, 606765938, 605503998, 603975563, 607534065, 604275551, 586681900, 576437035, 594089928, 600166855, 601145592, 601632576, 598595772, 596777382, 596149101, 597811470]
465.8E97811470M7874P7324k845993m196090J614608l241653q754463l87039L802909
474.5E83928947K70920j304168K437706N79299k15950J30387j376991r43108K62260
483.2E83769302L02773j917458k736358k304268k106133j5678L896065J573181j142616
491.8E79318810N33103J647835K522316K197609k321052m459572R93728p42988m405098
500.5E75284691r84268m521370l809357J098251K055321O40373k477150j222419Q54492
509.2E66918564j110153l673554l590698j284561J31302j115837o16875l688927l976974
517.9E47992287Q29467l100700m62952J630326p67250l55988j181946n16624j349335
526.6E42717285r93271q05931K13280n24674l055229P93457K216111J947555J651611
$$ y = [597811470, 597859344, 597936668, 595090675, 590894585, 592509193, 589267540, 580513077, 580126038, 583928947, 584199867, 582895699, 585333405, 585912704, 585696754, 585827141, 584450150, 583507042, 583769302, 584072075, 582154617, 579418259, 577113991, 575007858, 574992180, 578888245, 580461426, 579318810, 579851913, 581499748, 584022064, 586219673, 583898621, 579439049, 580432777, 579689789, 575284691, 574300423, 569779053, 565969696, 567067947, 569123268, 569763641, 567286491, 566064072, 566918564, 565808411, 562134857, 558544159, 557259598, 557390900, 556275063, 555658188, 551969261, 547992287, 548821754, 545721054, 545258102, 546888428, 546121178, 545765190, 544583244, 544066620, 542717285, 541724014, 540918083, 541131363, 540606689, 537551460, 538344917, 540561028, 542508583, 544160194]
535.2E44160194J977082K077331K49863J468849K994843K925605K064934J078911q56552
543.9E58141060q19016J237374J025238J64299l7041P74956p14379r63058O93398l88527
553.6E59114304n78041l25661p81899j758423k198410k140197j479416j375962k945671
562.3E45530624j509704j109772j611175k499581k027969q37250k673531j191825k126694
570.9E29943123k056008j423339j464806L24440k651863j117134K963867L303757O97403
579.6E28519440J204872L493423J617546K944909K737998J699410L317108L674393
587.3E49209099J547737J310501R37195o6414J834145P21969P74040K15226p17545
596E55765953O09512O9580L48130o25992j97601L72200j1101R27391L48663N6992r03702
$$ y = [544160194, 546137276, 548214607, 548464470, 549933319, 552928162, 555853767, 557918701, 558997612, 558141060, 557322044, 558559418, 559584656, 559748955, 559711914, 560486870, 559772491, 558809433, 559502831, 559114304, 558536263, 558210602, 557428703, 555670280, 553471870, 551331673, 549852257, 548476295, 545530624, 544020920, 542911148, 541299973, 538800392, 536772423, 535935173, 533261642, 532069817, 529943123, 527887115, 526463776, 524998970, 525323410, 522671547, 521554413, 524518280, 527822037, 528519440, 529724312, 533217735, 534835281, 537780190, 540518188, 542217598, 545534706, 549209099, 550756836, 552067337, 553004532, 552938118, 554772263, 555494232, 556268272, 556483498, 555765953, 556375465, 556445045, 556793175, 556167183, 555969582, 556341782, 556330681, 557258072, 557606735, 557663727, 556760025]
606.6E56760025m27132j27906q65975o0387M62075R48677P29751J059494J228180J230545
616.3E60937347J163788J442833P38640k01607J237183J655655K401886R98344j300888
624.9E69073181N65415L305130K784996p5379O16684J964684K257232R85070J24511
633.6E81601524J820107M91104P7705J182785P16134p76673n32112R31778k52151k08054
643.3E85052147O11458J079101J149903J489830J208496M77180J752777J15624k64664
651.9E92671852R55696M13552L25470P52525P14226j852074m70009K259674Q85887
660.6E96656799J15547J26305P29523P54890J371193J573029q65517o847191K697411
669.3E96311989K143669j57089J433983J588935P1450P76710J217652K082099J432114
$$ y = [556760025, 556332893, 556204987, 555339012, 555278625, 555740700, 556689377, 557419128, 558478622, 559706802, 560937347, 562101135, 563543968, 564282608, 564081001, 565318184, 566973839, 569375725, 570374069, 569073181, 569638596, 572943726, 575728722, 575653343, 576270027, 578234711, 580491943, 581477013, 581601524, 583421631, 583912735, 583990440, 585173225, 585889359, 585112686, 584580574, 585512352, 585260201, 585052147, 585663605, 586742706, 587892609, 589382439, 590590935, 591068115, 592820892, 592936516, 592671852, 593627548, 594041100, 594366570, 595119095, 595833321, 593981247, 593511238, 595770912, 596656799, 596772346, 596898651, 597628174, 598383064, 599754257, 601327286, 600461769, 593614578, 596311989, 598455658, 598298569, 599732552, 601321487, 601392937, 602169647, 603387299, 605469398, 606901512]
678F06901512R45358J876030L54424o42967K86140k93999j079330k65198L12119M41398
687.6F08835487O93589J491050J039696J99356N05333m53262m29802K78931r23691
696.3F11236687j674614j806526j984749j306191o60438j287232j117286l20054l02925
705F00776672J14403J078415J091690j59531o20346o36787L48244J115989J61629k59704
714.6F03010674M89997K264939K848053K510528K152252K690430K619362J069298K818527
723.3F22474060L628807J625328J360970J539955J260109J395035J794700J067009
731F36145973O89850K221451L105049K340622N35355j16196J533966K260895J190796
739.7F49907761J62658k33078j058654j801072o68869Q69065J539077Q15430j016388
$$ y = [606901512, 607846870, 609722900, 610077324, 609434357, 609720497, 609426498, 608347168, 608081970, 608394089, 608835487, 609529076, 611020126, 612059822, 612259178, 612764511, 612311249, 611881447, 612160378, 611236687, 609562073, 607755547, 605770798, 604464607, 603804169, 602516937, 601399651, 601079597, 600776672, 600891075, 601969490, 603061180, 602901649, 602281303, 601644516, 601992760, 603108749, 603270378, 603010674, 603500671, 605765610, 608613663, 611124191, 613276443, 615966873, 618586235, 619655533, 622474060, 626102867, 627728195, 629089165, 630629120, 631889229, 633284264, 635078964, 636145973, 636835823, 639057274, 642162323, 644502945, 645038300, 644922104, 646456070, 648716965, 649907761, 650070419, 649837341, 648778687, 646977615, 646308746, 647177811, 648716888, 649532318, 648515930]
748.4F48515930j654205j399079j498107j184693j034241j688003k577858k269554
756.1F35210190p50733k409401l621597r47571j00708j241951j462249r69963n09224
764.8F23196793K09503M78325Q84170Q08068N86929K263565J872787R01795J991768
773.5F33193703K603836K635727K547722L956222L575287K024307L340759L493653
781.2F57371216L250198K095261Q67996J986084K526703K519302J531143J413651K157364
789.9F75718918K579269J395417l6698J507416K233276K214203J340027L62091N98068
798.5F87911987J438980J799622J38397L96958J559295K330780J948319O31027K62604
807.2F98417969k3346M95605J67847P30820L71704j222458n41153l1128L12042M25949
$$ y = [648515930, 646861725, 645462646, 643964539, 642779846, 641745605, 640057602, 637479744, 635210190, 634459457, 632050056, 628428459, 627480888, 627380180, 626138229, 624675980, 623706017, 623196793, 623406296, 623884621, 624768791, 625576859, 626163788, 628427353, 630300140, 631201935, 633193703, 635797539, 638433266, 640980988, 644937210, 648512497, 650536804, 653877563, 657371216, 660621414, 662716675, 663584671, 665570755, 668097458, 670616760, 672147903, 673561554, 675718918, 678298187, 679693604, 679656906, 681164322, 683397598, 685611801, 686951828, 687313919, 687911987, 689350967, 691150589, 691288986, 691685944, 693245239, 695576019, 697524338, 698155365, 698417969, 698394623, 698890228, 699058075, 699788895, 700160599, 698938141, 698396988, 698365860, 698677902, 699103851]
816.9F99103851N4016J78376J172409R04922o08902j140976o68182o80313j312027
825.5F97003174o19736o27975P1869q35114j737213j16196j681061j288833o62461
834.2F89506454j853179j492539j420822j935730k310181j845703k500915j792603
841.9F74354782j335678q54187m6539j319580l03040q17413j369248p65533j673050
850.6F65870514j689606j431885j045227k083129j454697j051331k366867k422867
858.3F52324905k621688n65415J353378J079865M56467K146225M325180K817459L069687
867F64386063L558502K344284K534866M115525M275360K692184L519821L640061L113556
875.7F94180222K618255J901093J553268R00498N22766j029740k054977j586685j030274
$$ y = [699103851, 699157867, 699336243, 700508652, 701413574, 700804672, 699663696, 698995514, 698315201, 697003174, 696383438, 695755463, 695827332, 694992218, 693255005, 693138809, 691457748, 690168915, 689506454, 687653275, 686160736, 684739914, 682804184, 680494003, 678648300, 676147385, 674354782, 673019104, 672164917, 672118378, 670798798, 670495758, 669678345, 668309097, 667543564, 665870514, 664180908, 662749023, 661703796, 659620667, 658165970, 657114639, 654747772, 652324905, 649703217, 649137802, 650491180, 651571045, 652027512, 654173737, 658498917, 661316376, 664386063, 667944565, 670288849, 672823715, 676939240, 681214600, 683906784, 687426605, 691066666, 694180222, 696798477, 698699570, 700252838, 701153336, 701676102, 700646362, 698591385, 697004700, 695974426]
884.4F95974426k303238k191391j627426k325897j999054k820053k014237j214447
892.1F79478683j651535j939697k565536k098542k346878k333603k606048k106552
899.8F61830292r43070j876220j881791j344451j492844j920548k403869k365875j771012
908.5F45830612j782837l243942m213371m427681l958550l366432l607025l767014
916.2F17463760l944015l735275k018242r12667j840171k786141k244453j318360m68483
924.9E98195953k89116n82199k83966m53300k43073N56488J294213R43718K91748P38373
934.5F00168839J025123J652145J525689J263809J533432J570244J891823J646080
942.2F12277184J549987J667862J054039K89269k57721j902046k872506k782325m237404
$$ y = [695974426, 693671188, 691479797, 689852371, 687526474, 685527420, 682707367, 680693130, 679478683, 677827148, 675887451, 673321915, 671223373, 668876495, 666542892, 663936844, 661830292, 660887222, 659011002, 657129211, 655784760, 654291916, 652371368, 649967499, 647601624, 645830612, 644047775, 640803833, 636590462, 632162781, 628204231, 624837799, 621230774, 617463760, 613519745, 609784470, 607766228, 606853561, 605013390, 602227249, 599982796, 598664436, 598195953, 597906837, 597324638, 597040672, 596587372, 596344299, 596900787, 598195000, 599138718, 599430466, 600168839, 601193962, 602846107, 604371796, 605635605, 607169037, 608739281, 610631104, 612277184, 613827171, 615495033, 616549072, 616838341, 616580620, 614678574, 611806068, 609023743, 604786339]
950.9F04786339m683914m130478m531174n162392o150665n742111n375977n438728
958.6E63570900n982628p177887o610489o365013o649589p343140o931267o565704
966.3E09945183p171555p458534p885704p203255q394546q293381q209305q320045
974.1D47008858p378311q031578p181359q329544p706566o502228n991134n874253
981.8C90013885o319923m465141m910927l342476l477516k595673j050110j667594
989.5C62184525p17812k059860r71298j153412K44293J189155j26648O7177l91273
998.2C58264847J508407J8502N6076J53084J14288R24072K22702J220284j338158m69818
1007.8C60674286o69136j023293j63574j789741k15264k25487J022301k98576l20130
$$ y = [604786339, 600102425, 595971947, 591440773, 586278381, 580127716, 574385605, 569009628, 563570900, 557588272, 550410385, 543799896, 537434883, 530785294, 523442154, 516510887, 509945183, 502773628, 495315094, 487429390, 480226135, 471831589, 463538208, 455328903, 447008858, 439630547, 431598969, 424417610, 416088066, 408381500, 401879272, 395888138, 390013885, 383693962, 379228821, 374317894, 370975418, 367497902, 364902229, 363852119, 362184525, 361466713, 359406853, 358435555, 357282143, 357526436, 358715591, 358588943, 358656120, 358264847, 359773254, 359791756, 359847832, 360000916, 360115204, 361039276, 361261978, 362482262, 361144104, 360674286, 360005150, 358981857, 358818283, 357028542, 356813278, 356587791, 357610092, 357311516, 356991386]
1016.5C56991386N88150R4452J529465J77307J672669Q95576N59349R00536J306724
1025.2C64715614K039070K61918K292976J591873J546135Q70552J018181K555313J557808
1033.8C78449440J999321l93562N33676Q28934J72500k63023l53699J220551j053544
1042.5C81140594R1897j94931K75650Q45565M27056J573448K49672Q93020j7318J535644
1052.2C86820297J673393K327538L038483J515274L510856J903305L662034L478088
1059.9D07929268L456116N360984M118271M313431K889404M147759K844810J936989
1067.6D36997032J463013o75583k205620n034942m284516n821304m348526k681313
1075.3D13408241k194023q31718k587662n63965j003303M69131J175499J348801J920356
$$ y = [356991386, 357579536, 357673988, 359203453, 359380760, 361053429, 361949005, 362508354, 363408890, 364715614, 366754684, 367016602, 369309578, 370901451, 372447586, 373318138, 374336319, 376891632, 378449440, 380448761, 380055199, 380588875, 381417809, 381590309, 381327286, 380973587, 382194138, 381140594, 381232491, 381037560, 381313210, 382158775, 382585831, 384159279, 384408951, 385301971, 385284653, 386820297, 388493690, 390821228, 393859711, 395374985, 398885841, 400789146, 404451180, 407929268, 411385384, 416746368, 420864639, 425178070, 428067474, 432215233, 435060043, 436997032, 438460045, 437784462, 435578842, 430543900, 426259384, 420438080, 416089554, 413408241, 411214218, 410382500, 407794838, 407230873, 406227570, 406696701, 407872200, 409221001, 411141357]
1084D11141357R48525K745323J921005L276940J795730K126046L196792J840820L323479
1092.7D32316017K001991K870026K873344L082810J462593L7422Q73947l39851J131897
1101.4D46310196l62740n16853j97906P28721J588707J57318K050095J364517K101364
1110D53223419J560555J200027J957131J508827K388992J402779K411728J398124J438523
1118.7D68490105J622390J076470J537475K77825K080612J184616J476059J921501
1126.4D79667053J123772J593590O35070J823388J263542K146835K618485J775817
1134.1D92647552J051674o4582R92546m55323j049804j637879j954879k270775l545075
1142.8D83713455k889824l375816k780685l060151k287597k541962l325195k090645
$$ y = [411141357, 412089882, 414835205, 416756210, 420033150, 421828880, 423954926, 427151718, 428992538, 432316017, 434318008, 437188034, 440061378, 443144188, 444606781, 444644203, 445518150, 445178299, 446310196, 445947456, 445430603, 445232697, 445961418, 447550125, 447707443, 449757538, 451122055, 453223419, 454783974, 455984001, 457941132, 459449959, 461838951, 463241730, 465653458, 467051582, 468490105, 470112495, 471188965, 472726440, 473004265, 475084877, 476269493, 477745552, 479667053, 480790825, 482384415, 483019485, 484842873, 486106415, 488253250, 490871735, 492647552, 493699226, 493634644, 494627190, 494171867, 493122063, 491484184, 489529305, 487258530, 483713455, 480823631, 477447815, 474667130, 471606979, 469319382, 466777420, 463452225, 461361580]
1150.5D61361580k021256n91354j971970j131820q5106m34151j67808o60019Q34427
1159.2D55132523L08036J104470Q32367J473426K487450K378044L810730L327713M992676
1167.9D75847435M554672M395638N020675N360871O170616N226631N898552N110703
1175.6E17585793N654563N767556M931717N614853N441932N120049M762001N441742
1183.3E60320206M910888M517632M146728L645592M003639L551789L239631K279854
1191E90615959J776352J398926J227302J008110K58523R85946P21245L14369R91059
1199.7E99297791J051673P72019O50673O53572M34074O49529J090507J304055N33676
1208.4F06437569M01916J327019J680488J838303J417809J523857J554870J835556
$$ y = [461361580, 459340324, 458748970, 456777000, 455645180, 455560074, 455125923, 454958115, 454298096, 455132523, 455440559, 456545029, 457377396, 458850822, 461338272, 463716316, 467527046, 470854759, 475847435, 480402107, 484797745, 489818420, 495179291, 501349907, 506576538, 512475090, 517585793, 523240356, 529007912, 533939629, 539554482, 544996414, 550116463, 554878464, 560320206, 565231094, 569748726, 573895454, 577541046, 581544685, 585096474, 588336105, 590615959, 592392311, 593791237, 595018539, 596026649, 596285172, 597271118, 597992363, 598306732, 599297791, 600349464, 601121483, 601772156, 602425728, 602859802, 603509331, 604599838, 605903893, 606437569, 606839485, 608166504, 609846992, 611685295, 613103104, 614626961, 616181831, 618017387]
1216.1F18017387K394410J845092J472473R85566N78422M00086k14081m43230l35083
1224.8F24701042o22253o82411m85421o57196n07278m08821n43061k85873m47884m84352
1234.4F19576492l50380o83326j108971j184959q80547q07228r27086j364860r25942
1243.1F11343193L33214R02481J199989J198273P11708M65927R33304O99387L68347
1251.8F18155823M85954j08376O5270P97729M18816l5973L54195O78444M07829L35350
1261.4F21555061R63822J281128O99997N88455P43561M83398O49948O39572N28908
1270.1F28133850P66525K12746L32718N55763K90413P68471O29463P50427O88439M46968
1279.8F33575783M09164k31666k50588n92537n73959n51567q28972n43480l89099l16582
$$ y = [618017387, 620411797, 622256889, 623729362, 624714928, 625293350, 625693436, 625479355, 625036125, 624701042, 624078789, 623396378, 622910957, 622253761, 621746483, 621337662, 620794601, 620508728, 620060844, 619576492, 619226112, 618542786, 617433815, 616248856, 615368309, 614561081, 613633995, 612269135, 611343193, 611676407, 612578888, 613778877, 614977150, 615688858, 616154785, 617088089, 617787476, 618155823, 618641777, 618533401, 618598671, 619396400, 619815216, 619779243, 620133438, 620811882, 621219711, 621555061, 622518883, 623800011, 624500008, 625088463, 625832024, 626315422, 626965370, 627604942, 628133850, 628900375, 629113121, 629445839, 630001602, 630292015, 631060486, 631689949, 632440376, 633128815, 633575783, 633984947, 633753281, 633502693, 632910156, 632336197, 631784630, 630955658, 630412178, 630023079, 629706497]
1289.4F29706497j46522M18052K81067K56500l8681n93071p1868r03397j355591j153068
1299F26399918j500550j413307j339874j386719j482658p36313l13950q61091o88553
1307.7F16676903l84255r7198k59590p51572q43887j044388j122170j226616j264038
1316.4F09683189q64563n35583o26068n39055k44713l43857j75628l11699p80144j107559
1326F04154320j495667j685524k217750k345314k586479k699013j630783j393433j589012
1334.7E86511345j693077p10640k94724o56814J36070N93224N24597L5629J85432P4349
1344.4E84705391N9586j17150p29256k44636Q6136j6556l55148N417N10406N95856
1354E84500046J53007q2626K54936o36139p96623p67860j097680o86416o79016j302452
$$ y = [629706497, 629559975, 629978027, 630259094, 630515594, 630476913, 629883842, 629811974, 628908577, 627552986, 626399918, 624899368, 623486061, 622146187, 620759468, 619276810, 618540497, 618226547, 617365456, 616676903, 616292648, 616195450, 615935860, 615184288, 614340401, 613296013, 612173843, 610947227, 609683189, 608818626, 608283043, 607656975, 607117920, 606873207, 606529350, 606353722, 606042023, 605261879, 604154320, 602658653, 600973129, 598755379, 596410065, 593823586, 591124573, 589493790, 588100357, 586511345, 584818268, 584107628, 583812904, 583156090, 583292160, 583885384, 584409981, 584445610, 584631042, 584705391, 584764977, 584647827, 583918571, 583673935, 583760071, 583743515, 583388367, 583393784, 583904190, 584500046, 584653053, 584570427, 584825363, 584189224, 583392601, 582624741, 581527061, 580840645, 580161629, 578859177]
1363.7E78859177o29425L85322k11754K3728Q4038m6464R27277K22626L54271K80342
1373.3E80249138M31404k785j18522N03692l76816N28870O88515L96156L83606P39594
1382.9E83422852J420402J418228K093125R47227P85599J860390J589965J179657N63012
1391.6E95280457L55300K51961l09868r24568Q54683N94635k7847j013451l25203O66619
1401.3E95402718o54526j65138k07520j888618j495171n72510p20138j244240o89011
1409.9E87765846j161232r64317m59518l34702j21918n14412j99165o91261L5476k972335
1419.6E80382462n80063J286506j95541K92740j406708o943N38750K7466J132698L5858
1429.2E81507225n5428M26713J532096Q13408O82869J638375O29997r89838o43806
$$ y = [578859177, 578229752, 578615074, 578403320, 578427048, 578511086, 578464622, 579391899, 579614525, 579968796, 580249138, 580680542, 580677757, 580559235, 581062927, 580686111, 581214981, 581903496, 582299652, 582683258, 583422852, 584843254, 586261482, 588354607, 589301834, 590087433, 591947823, 593537788, 594717445, 595280457, 595635757, 595887718, 595577850, 594653282, 595507965, 596102600, 596074753, 595061302, 594736099, 595402718, 594748192, 594583054, 594375534, 592486916, 590991745, 590419235, 589699097, 588454857, 587765846, 586604614, 585640297, 585180779, 584846077, 584724159, 584209747, 584010582, 583319321, 583354797, 580382462, 579802399, 581088905, 580893364, 581186104, 579779396, 579772453, 580311203, 580338669, 581471367, 581507225, 581451797, 581878510, 583410606, 584224014, 584906883, 586545258, 587175255, 586185417, 585541611]
1437.9E85541611J978683Q52966R22661J017037K8648J413765L08113Q99391R90143
1446.6E93953018Q98819Q8196j02539P21817p23267k63290r74960J73416j58844o74324
1456.2E92938042J01890l694343K185783M8180J975479O99081Q02307K374306m48341
1464.9E96982384K148132J284943K538528J672516K461166L558083J567917M405174
1472.6F16618843K345467N317192L055496L047523L948441L586006L779030K223892
1480.3F43921890L573609K001190K976913K658615K029801K776413Q74023K923966
1488.1F63736420J314697O51932J689377L601379L104553J362610K807236J353149
1495.8F79621353R8038K129745J249695J3657J723404J834335M84695J821824J170196
$$ y = [585541611, 587520294, 588373260, 589295921, 590312958, 590341606, 591755371, 592063484, 592962875, 593953018, 594851837, 594940033, 594837494, 595559311, 594836044, 594572754, 593597794, 593771210, 593612366, 592938042, 593039932, 589345589, 591531372, 591579552, 593555031, 594254112, 595056419, 597430725, 596982384, 599130516, 600415459, 602953987, 604626503, 607087669, 610645752, 612213669, 616618843, 618964310, 624281502, 627336998, 630384521, 634332962, 637918968, 641697998, 643921890, 647495499, 649496689, 652473602, 655132217, 657162018, 659938431, 660812454, 663736420, 665051117, 665703049, 667392426, 670993805, 674098358, 675460968, 678268204, 679621353, 679719391, 681849136, 683098831, 683112488, 684835892, 686670227, 687154922, 688976746, 690146942]
1504.5F90146942J195679j656113k686539M196854J118546K616806K455291J696244
1512.2F99083710j88141J572189P99866l30353P50198k708358L187027J531372k894287
1520.8G00803223k462845K455368M912567J599655K94571M66003J572648k67487J30997
1529.5G09504700K022628J60904L80784j766434k782898J883392J458283J599731J255112
1538.2G13716202k958069p256699O452942J651459K20718K817078l88031j710205M86221
1546.9G13031616N13916K56806j395264k343445J128082J831055N34515k133483K51388
1555.6G11675186L035584J768112q501511n809707J885376M154968N66940r97314q17261
1564.2G06960373k412644p89108K70920M00162j96915m760055J217956J555405j43280
$$ y = [690146942, 691342621, 689686508, 686999969, 691196823, 692315369, 694932175, 697387466, 699083710, 698895569, 700467758, 701267624, 700937271, 701687469, 698979111, 702166138, 703697510, 700803223, 698340378, 700795746, 705708313, 707307968, 707602539, 708068542, 709641190, 709373703, 709504700, 711527328, 711688232, 712069016, 710302582, 707519684, 709403076, 710861359, 712461090, 713716202, 710758133, 703501434, 709954376, 711605835, 711826553, 714643631, 714255600, 712545395, 713031616, 713545532, 713802338, 712407074, 710063629, 711191711, 713022766, 713557281, 711423798, 711675186, 714710770, 716478882, 707977371, 702167664, 704053040, 708208008, 708774948, 707777634, 706960373, 704547729, 703758621, 704029541, 704429703, 704232788, 699472733, 700690689, 702246094, 702102814]
1572.9G02102814m23813K99988k84195p904663j85929L43857j136322j298752r40094
1581.6F90572891j16653n65338j81198k17438k34833n23529j071472q21533j264725
1590.3F85576172j166306k186737j493301j384888j965179r02558j232223m29459n38559
1599F74276962m16488q75779q69140m53034j233673j147384k174530j863861k547150
1607.6F62695923k088547k412872k530365n45197j932296j163254j081620M57306j112518
1616.3F50286560p404022K069855k16675j063156j651001j56708j405106m949417J77155
1625F35687485m43001k95525k725486l15438J079026K78778J47056n09681J219291
1633.7F34122505J049767l397026k419930K96097m41971O12869O54602o30111J087570
$$ y = [702102814, 701679001, 701978989, 701694794, 693790131, 693604202, 693948059, 692811737, 691512985, 690572891, 690456238, 689890900, 689709702, 689492264, 689257431, 688733902, 687662430, 686840897, 685576172, 684409866, 682223129, 680729828, 679344940, 677379761, 676477203, 675244980, 674815521, 674276962, 673860474, 672984695, 672115555, 671662521, 670428848, 669281464, 667106934, 665243073, 662695923, 660607376, 658194504, 655664139, 655118942, 653186646, 652023392, 650941772, 651399078, 650286560, 642882538, 644952393, 644735718, 643672562, 642021561, 641864853, 640459747, 635510330, 635687485, 635244484, 634948959, 632223473, 631908035, 632987061, 633265839, 633412895, 632903214, 634122505, 635172272, 631775246, 629355316, 629651413, 629209442, 629822311, 630476913, 629846802, 630934372]
1642.4F30934372M12064J912765J623917q43201K171478j078262K135620K121010K922172
1651F42311935L275986o535110m745331N943146M052429K101288J856308J671753K017135
1659.7F51949539J986847J782456J737670Q40912K587204K357788J786881J924667
1667.4F66953964K654495l77655O6910L065872J138306K357254L264389J445160M6768
1676.1F80615463L161850L189011K331543J669769Q32596L281021L557282p55692n379791
1684.8F92503052M841079M872971K908859J381684J605529J029587K119599K837448
1692.5G14099808K219619L092576J930084m037400K671357L457031M438934q49457
1700.2G27022552n592041M633561L038330J456680r3994J066818Q5678J170807J767349
$$ y = [630934372, 631346436, 633259201, 634883118, 634039917, 636211395, 635133133, 637268753, 639389763, 642311935, 645587921, 639052811, 634307480, 640250626, 644303055, 646404343, 648260651, 649932404, 651949539, 653936386, 655718842, 657456512, 658297424, 660884628, 663242416, 665029297, 666953964, 669608459, 669230804, 669297714, 672363586, 673501892, 675859146, 679123535, 680568695, 680615463, 683777313, 686966324, 689297867, 690967636, 691800232, 695081253, 698638535, 697882843, 692503052, 697344131, 702217102, 705125961, 706507645, 708113174, 709142761, 711262360, 714099808, 716319427, 719412003, 721342087, 717304687, 719976044, 723433075, 727872009, 727022552, 721430511, 726064072, 729102402, 730559082, 730465088, 731531906, 731617584, 732788391, 734555740]
1708.9G34555740Q80356N82428P56302J182251R15833q39920j259995K267685J656265
1717.6G40696945m888916J417084J867447J218643O43997k0065o4163Q28781Q96911
1726.3G42596664M46015J017074J231842j055450j355667K041397J876755k952805
1734G43845825m157791K350235K456894J077499J257401q28476o57272K920303J397400
1742.7G49662018l85056O42319K013474J055908N8517k69089l47290K233658r25598
1751.3G53738861l37372K977753J862488K178268J757584r81293J122437K292327J324387
1760G65935440J704331j272736o56204J998214P02515M37851P81326N22538q43735
1768.7G69309540K421875L341903M88968j407547q13140K889328J244354p79877P60574
$$ y = [734555740, 735436096, 736018524, 736774826, 737957077, 738872910, 738032990, 736772995, 739040680, 740696945, 735808029, 737225113, 739092560, 740311203, 740955200, 740935135, 740870972, 741699753, 742596664, 743042679, 744059753, 745291595, 744236145, 742880478, 744921875, 746798630, 743845825, 739688034, 742038269, 744495163, 745572662, 746830063, 746001587, 745344315, 748264618, 749662018, 749276962, 749919281, 751932755, 752988663, 753047180, 752778091, 752430801, 754664459, 753738861, 753401489, 756379242, 758241730, 760419998, 762177582, 761196289, 762318726, 764611053, 765935440, 767639771, 766367035, 765710831, 767709045, 768411560, 768849411, 769630737, 770153275, 769309540, 771731415, 775073318, 775562286, 774154739, 773341599, 776230927, 777475281, 776695404, 777455978]
1777.4G77455978l11126J15432r11178p36160J028900J049881J029052k04086Q95538
1786G79412231J601868J020050L83682P23420K13165j42746j430664j534271J351776
1794.7G81598511j32523q06045P45239J227951M12598k3652K175751K73514L20969
1803.4G85792313J137771j61209k38571m49295k53906R7351K72751j203614k04315
1812.1G84789276R73129M17252Q84857Q31757J055145k34528J67695J028137j90964
1820.8G89721756o3858p41959J38779Q9264k619171j97830J583099J586456j99585
1829.4G89296951j913910J483155K236252P81555M98428L88794r6588q95081j292953
1838.1G90486603N9967k64206m0283m29230K05307L68042k283554K409210K218323
$$ y = [777455978, 777144852, 777260284, 776349106, 775612946, 776641846, 777691727, 778720779, 778516693, 779412231, 781014099, 782034149, 782417831, 783141251, 783354416, 783211670, 781781006, 780246735, 781598511, 781465988, 780659943, 781405182, 782633133, 783045731, 783022079, 785197830, 785471344, 785792313, 786930084, 786768875, 786530304, 786081009, 785827103, 785924454, 786197205, 784993591, 784789276, 785762405, 786179657, 787064514, 787896271, 788951416, 788716888, 788884583, 789912720, 789721756, 789657898, 788915939, 789054718, 789143982, 786524811, 786326981, 787910080, 789496536, 789296951, 787383041, 788866196, 791102448, 791884003, 792382431, 792771225, 792674637, 791779556, 790486603, 790546570, 790282364, 790242081, 789812851, 790018158, 790386200, 788102646, 790511856, 792730179]
1846.8G92730179J90430k85187M88510K57034n84335j0300n36957q1100n02625p36923
1856.4G90928726K63214k6626M36859O42166J078415L57742J05362K82135L5477K68783
1866.1G94372253q63189j90430j389618j741257O29197O75125M86679J98211R20487
1874.8G93097458O49643N39322N31845L19366L09983o04401m63486k88925K66419j19706
1884.4G94237518p05032l40881K899R86099o638p56454R59625J304932K03476K89154
1894.1G96174698M7912j360549j58234r3002R8419K31781j19095p9575k85568N80216
1903.7G95037003J62811J88904O20117L29971L9215k31933l42560m04205L71170l68271
1913.3G95402222j11161n7830j87226Q86612j322098m20608Q91037Q07114P92617r82818
$$ y = [792730179, 792920609, 792635422, 793123932, 793380966, 792796631, 792786331, 792249374, 792168274, 791665649, 790928726, 791191940, 791165314, 791602173, 792244339, 793322754, 793680496, 793785858, 794067993, 794103470, 794372253, 793509064, 793318634, 791929016, 790187759, 790816956, 791492081, 791978760, 792176971, 793097458, 793747101, 794286423, 794818268, 795137634, 795447617, 794843216, 794379730, 794090805, 794357224, 794237518, 793532486, 793191605, 793194504, 794180603, 794173965, 793417511, 794377136, 795682068, 795885544, 796174698, 796222610, 794862061, 794703827, 794610825, 794709244, 794941025, 794821930, 794742355, 794456787, 795037003, 795199814, 795388718, 796008835, 796338806, 796378021, 796146088, 795803528, 795399323, 795770493, 795402222, 795291061, 795233231, 795046005, 795932617, 794610519, 794189911, 795080948, 795888062, 796680679, 795697861]
1923G95697861l31879L80020K12403k9679j01547j06964j32218o5307l84064M1351
1932.6G95179977p4844K68173M32053M4556O8664k2354J81656J5869N23300l84674
1942.3G96232376j173324N83877L98407q1711j10321L24478R5215l13034J4725J94855
1951.9G96165543j44959l63617K68021k4948n9586M84467L52478q1635p0572L93601
1961.6G96918793N5923q4152j94092q2016k49786p99332N570O16836N70831O409P7896
1972.2G96842880J40457K17057L77655k50626J8082K3651k68707l35007k52915K1668
1981.8G96534195j11466j37557j90278J86768N42297L67890l25852k38723N46646K93655
1991.5G97467575m30527m27093K72446r8191m05350k15072k79694L6469o5003K46888
$$ y = [795697861, 795365982, 795746002, 795958405, 795928726, 795827179, 795720215, 795587997, 795522690, 795138626, 795179977, 795105133, 795373306, 795805359, 795849915, 795918579, 795896225, 796077881, 796093750, 796617050, 796232376, 795059052, 795642929, 796041336, 795959625, 795849304, 796173782, 796268997, 795955963, 795970688, 796165543, 796020584, 795656967, 795924988, 795900040, 795840454, 796324921, 796677399, 796595764, 796525192, 796918793, 796974716, 796890564, 796696472, 796614456, 796364670, 795565338, 795570908, 796187744, 796758575, 796764984, 796842880, 796983337, 797200394, 797578049, 797327423, 797345505, 797369156, 797100449, 796765442, 796512527, 796534195, 796422729, 796285172, 796094894, 796281662, 796823959, 797191849, 796865997, 796627274, 797173920, 797467575, 797037048, 796609955, 796882401, 796784210, 796378860, 796163788, 795884094, 795920563, 795855560, 796102448]
2001.1G96102448M72030M44946p5912l52783J72653Q5983J88980m18243l91464l2883
2010.7G96195755k10037l11127q46252j56174K39487l2502q0871M47311M09775l62701
2020.4G95292664j39771l03268J5564j47934l52250j54113o24848k50320j07498M3182
2030G93271408j11999J29242K39486k36740K21787J66244L2196l88641k03705p4081
2039.7G93045197m42734m64020o96487M4784J17493p7439l07006o7444M78515L2883
2049.3G91663742L59116K38495K32849j93863n40467k9220l22724p3242k60238m69666
2059G90604782j01547N29175K51388m59900J18790K71606M74167L22876K20032L7766
2068.6G92269135k09351J0986m86831m06571n91354l53089K32773K93350L95890M2724
$$ y = [796102448, 796574478, 797019424, 796943512, 796590729, 796763382, 796849365, 797038345, 796620102, 796228638, 796195755, 795985718, 795674591, 794828339, 794672165, 794911652, 794879150, 794798279, 795245590, 795655365, 795292664, 795152893, 794849625, 794865189, 794717255, 794365005, 794210892, 793586044, 793335724, 793228226, 793271408, 793159409, 793288651, 793528137, 793291397, 793513184, 793679428, 793711624, 793322983, 793119278, 793045197, 792602463, 792138443, 791441956, 791486740, 791604233, 791526794, 791219788, 791152344, 791630859, 791663742, 792022858, 792261353, 792494202, 792300339, 791759872, 791730652, 791407928, 791334686, 791074448, 790604782, 790503235, 791032410, 791283798, 790823898, 790942688, 791214294, 791688461, 792011337, 792231369, 792269135, 792059784, 792070770, 791583939, 791177368, 790586014, 790232925, 790465698, 790759048, 791154938, 791197662]
2078.2G91197662K74582L13568L12043P8964q7738p858k17743j679k94952j63269j85929
2088.9G91217651m55093j80359K97623N56946L1585J59378L03955N38025M28925k53830
2098.5G92644806m99878m58603J08948j44272j34811O1416p3013k2736l00674N6228
2108.1G91237411O05546O05926J5945O1036J66473K40402K40326p77664n44739r9640
2117.8G91751022p6294j75628l5782K81982j8539K91977L72772M52576K16064J09558
2127.4G93169708K87094j06659k49328q01087n48019j37939k0218j50299j27259N50614
2137.1G91866608P1411K23465N57785L55301Q468k75421l6697j52283Q5449j30844
2146.7G92573242m03747l97034j26190M6005N8594M13513k3041L38745L33329J90048
$$ y = [791197662, 791472244, 791785812, 792097855, 792176819, 792089081, 792081223, 791863480, 791861801, 791566849, 791403580, 791217651, 790762558, 790582199, 790879822, 791436768, 791468353, 791627731, 791931686, 792469711, 792898636, 792644806, 792144928, 791686325, 791795273, 791651001, 791516190, 791577606, 791504593, 791481857, 791181183, 791237411, 791842957, 792448883, 792464828, 792525864, 792692337, 792932739, 793173065, 792395401, 791850662, 791751022, 791674728, 791499100, 791463318, 791745300, 791726761, 792018738, 792391510, 792844086, 793060150, 793169708, 793456802, 793350143, 793100815, 792299728, 791751709, 791613770, 791593552, 791443253, 791315994, 791866608, 791938019, 792161484, 792719269, 793074570, 793083038, 792807617, 792770920, 792618637, 792704086, 792573242, 792169495, 791772461, 791646271, 791692276, 791750870, 792164383, 792141342, 792480087, 792813416, 793003464]
2156.4G93003464K84576j53656Q7814l41262m120m273m41894n5084J52664M27322R5902
2167G93051453J88751K212L91083P89337R8954K7160l16849n3787M5319j63040l63770
2177.6G93696823j52359P74613K51007j36795K10800K41928L8986M88739O68411J65787
2187.2G96247940Q7586l32108n7602N6534J21460K21481j64566J28937R4757J27945
2196.9G96532364K07443M38080K34528o9657J23749o6452K21481l4332j41678J679
2206.5G97447205O3781L79944L65143J09863m86297N5542K20184J92871N60837J81122
2216.1G99090195N6915m7455J16196n17655o39572J85166N10482M82483n3100L0899
2225.8G99214554j88675J90887M29230p6904K01340j91422j22070R2544j09100m7913
$$ y = [793003464, 793288040, 793134384, 793222198, 792880936, 792876816, 792872543, 792430649, 792375565, 792528229, 792955551, 793051453, 793240204, 793242416, 793633499, 794422836, 794521790, 794548950, 794232101, 794178314, 794223633, 794060593, 793696823, 793544464, 794319077, 794570084, 794433289, 794644089, 794886017, 794925003, 795413742, 796082153, 796247940, 796335526, 796003418, 795945816, 796002350, 796123810, 796345291, 796180725, 796309662, 796404419, 796532364, 796739807, 797177887, 797412415, 797342758, 797466507, 797400055, 797621536, 797587204, 797445526, 797447205, 797510986, 797890930, 798256073, 798365936, 797879639, 797935181, 798155365, 798348236, 798909073, 799090195, 799147110, 799099655, 799215851, 798698196, 798058624, 798243790, 798754272, 799236755, 799183655, 799214554, 799025879, 799216766, 799645996, 799569092, 799770432, 799579010, 799456940, 799549484, 799440384, 799392471]
2235.4G99392471L510o333k8610O5460L35923P88345J20468j44119J17645O1112j1826
2246H00694046m86832j06659J30005O1951l35083l24249l9139p6523P30438M25263
2255.7H00673218J85394J13754K6474L28675m1428j05896m68140j36642k7542n9815
2265.3H00488052J41144j19400L19977Q9416J5946O7520R2697J35727J01318L55149
2275H01687546p3395k44293k14997J83259k53373k61459J77994k65198M19922R3918
2284.6H01249924N6152J65482l3646L62244J220L36609j00250l052J04523l45383q0490
2295.2H01713333m59289K12326K46429Q7128L29513K21863p629l41568M84924M44870
2304.9H02931900K66647k22931n99136o6528k45133J59455J9912j07498n12161n25360
$$ y = [799392471, 799395981, 799389648, 799361038, 799426498, 799762421, 800550766, 800671234, 800527115, 800644760, 800705872, 800694046, 800207214, 800100555, 800230560, 800292511, 799957428, 799633179, 799594040, 799517517, 800247955, 800673218, 800858612, 800972366, 800998840, 801327515, 801286087, 801180191, 800712051, 800575409, 800547867, 800488052, 800629196, 800509796, 800829773, 800919189, 800935135, 801002655, 801095352, 801231079, 801332397, 801687546, 801614151, 801369858, 801154861, 801338120, 801084747, 800823288, 801001282, 800736084, 801156006, 801249924, 801306076, 801471558, 801437912, 801800156, 801801376, 802137985, 802037735, 802034683, 802139206, 801793823, 801713333, 801254044, 801466370, 801712799, 801799927, 802129440, 802351303, 802343674, 802002106, 802487030, 802931900, 803198547, 802975616, 802376480, 802309952, 802064819, 802224274, 802244186, 802136688, 801624527, 801099167]
2314.5H01099167L91388N08041P03659J17798j18179j85013K58789P84454n82962p48214
2324.2H02228928k83432J35116P73468P71103M20380k86026q63724o35147k13623K94189
2333.8H02341232M76685j24207J43891j62354n59845m43115m5242P93991K86484K01568
2343.4H02909088k61383o51550l56446m08248P0495P37457N08500m78287L17993O7444
2353.1H02455063j85623L44543p58285L7613j41831o65283j110687R02328J175995
2361.8H02053833m33960J056900p21970q78295q60367k68631J219330L40728p65457
2370.4H00742111j257171L73764j60981n84716k75040n10101o8055l16543K74582R4909
2380.1G98312759k32315O8589M2648m1809j70365R2774k77863k73971j88904l26996
$$ y = [801099167, 801490555, 801998596, 802702255, 802820053, 802701874, 802516861, 802775650, 803560104, 802977142, 802228928, 801945496, 802080612, 802854080, 803625183, 804045563, 803759537, 802895813, 802260666, 802047043, 802341232, 802817917, 802693710, 802837601, 802675247, 802115402, 801672287, 801627045, 802421036, 802707520, 802909088, 802647705, 801996155, 801639709, 801231461, 801301956, 802039413, 802547913, 802069626, 802387619, 802455063, 802269440, 802613983, 801855698, 801893311, 801751480, 801086197, 799975510, 800877838, 802053833, 801619873, 802676773, 801954803, 801076508, 800216141, 799947510, 801166840, 801507568, 800742111, 799484940, 799858704, 799697723, 799113007, 798837967, 798327866, 798259811, 797943268, 798217850, 798312759, 798080444, 798149033, 798191681, 798149872, 797979507, 798072281, 797794418, 797520447, 797331543, 797004547]
2389.7G97004547l11355l94898J48926K38495K02484k18430k19116J31836j27182J03531
2399.4G96558838o4240j37481k69165k84806j49231r4757k2735m31061J602k24838
2409G94882126o29044K3423M69207L79715k2430r1477m21905k84577N4932o6376o59408
2419.6G93634186p47376K50473K22245r7046m20761l95432K8381J54877m7378n60303
2429.3G92021866K58026M15192k97089n04532p81326o00662l5935J89438l04413j43204
2438.9G90217361j95159l05558J8158K6627K45132j93329j53656n8059m79660p80182
2448.6G88341675n00031q392m68063j70823k13241k85034Q1482o409Q1329L968L51791
2459.2G87208252j58157k21482Q0490n17349o80160p81937l31192l08304m2190l5859
$$ y = [797004547, 796693192, 796298294, 796447220, 796685715, 796888199, 796669769, 796450653, 796582489, 796455307, 796558838, 796494598, 796357117, 796087952, 795803146, 795653915, 795559158, 795536423, 795105362, 795106964, 794882126, 794253082, 794276505, 794745712, 795125427, 795102997, 795011520, 794589615, 794305038, 794359970, 794293594, 793634186, 792886810, 793137283, 793359528, 793262482, 792841721, 792446289, 792474670, 792629547, 792582169, 792021866, 792279892, 792695084, 792397995, 791893463, 791112137, 790511475, 790475540, 790664978, 790360565, 790217361, 790022202, 789716644, 789734802, 789761429, 790006561, 789813232, 789659576, 789601517, 789121857, 788341675, 787841644, 787833252, 787365189, 787194366, 786981125, 786696091, 786777573, 786771164, 786852493, 786856461, 787208252, 787050095, 786828613, 786909103, 786391754, 785711594, 784929657, 784598465, 784290161, 784247971, 784212112]
2468.8G84212112n44128L9673J46103J10931J14975L67050K62680k21634l51333m94538
2478.5G83641891k86560o87637l01208J67236m54331l83300k16904j88065M5701J34735
2488.1G81471558q2016J56402K77024R0866L4561j85547m06799q94776p45621n22537
2497.7G79193115k52533J5106j84631Q7967K64206O06232M23431n9128k76108o6757
2507.4G79750900K20185n20249k69241j50452n88608o07376o71692L8224L61709J60065
2517G77723465J87759L13111K38800M5166l26920k15301j8235p43255n38483l05328
2526.7G76360779m00391n34973m22745J31607k16446J11542K48566K14310L48358J05743
2536.3G75946350R5368j92185j71738r73434p19452o9275r07745p36237k55356K32239
$$ y = [784212112, 783667984, 783707657, 783853760, 783964691, 784079666, 784446716, 784709396, 784487762, 784136429, 783641891, 783355331, 782667694, 782366486, 782533722, 782079391, 781696091, 781479187, 781291122, 781336823, 781471558, 781389542, 781545944, 781822968, 781913834, 781948395, 781762848, 781356049, 780461273, 779715652, 779193115, 778940582, 778955688, 778771057, 778859024, 779123230, 779729462, 780152893, 780093765, 779817657, 779750900, 779971085, 779450836, 779181595, 779031143, 778442535, 777835159, 777163467, 777201691, 777563400, 777723465, 777911224, 778224335, 778463135, 778508301, 778181381, 777966080, 777947845, 777204590, 776666107, 776360779, 775960388, 775425415, 775002670, 775134277, 774917831, 775029373, 775277939, 775492249, 775840607, 775946350, 776041718, 775849533, 775677795, 774704361, 773984909, 773915634, 773007889, 772271652, 772016296, 772248535]
2546G72248535m3182n3330M13666Q8883J61361K46582M57306k06146p11517m43879
2555.6G72158279p27386m87900k80762o11190p78199j75552L16315J11313l6240K71149
2565.2G69759827M38461K5558j72348m41970l94516p19834j118088n93109k53448P2021
2574.9G66602554q6288l05023l82691L0594N13306K24304L42865j01776j05744o0348
2584.5G66671753q54187o36139m09698p46766p43866j35650N8746J47019K76870R6131
2594.2G63724213J72348J16424K85797k3346m51049m13437n11551l89710l53088m13284
2603.8G61743317l01972j34506m95682k00805L20968O6452K78092J30615R5901M2878
2613.5G61545258m14124n93643p73850q06808r05304o58188m82101j71814N0735k27508
$$ y = [772248535, 772205353, 772152023, 772565689, 772654572, 772815933, 773062515, 773519821, 773313675, 772602158, 772158279, 771430893, 770942993, 770662231, 770051041, 769272842, 769097290, 769413605, 769524918, 769488678, 769759827, 770198288, 770223846, 770051498, 769609528, 769215012, 768495178, 767377090, 766783981, 766530533, 766602554, 766516266, 766211243, 765828552, 765859146, 766372452, 766596756, 766939621, 766837845, 766732101, 766671753, 765817566, 765181427, 764771729, 764024963, 763281097, 763145447, 763204193, 763351212, 763628082, 763724213, 763896561, 764012985, 764298782, 764275436, 763824387, 763410950, 762899399, 762509689, 762156601, 761743317, 761441345, 761306839, 760811157, 760610352, 760931320, 760997772, 761275864, 761406479, 761502380, 761545258, 761131134, 760537491, 759763641, 758956833, 758051529, 757393341, 756911240, 756739426, 756790161, 756562653]
2623.1G56562653J373L25241N13382q6365q04443p65839l09372k63672q70742o65436
2632.8G53636780n37720m79431l14255m75159l43704l99170j01776L42713K61612j74714
2642.4G51415176l61938m71039r01260p45163n47486o22940o57577n38559k73743l89786
2652G45905685m47998k3346j3961m68445j99280k4414l73840l52097p6141l35160q02612
2662.6G42788391m98276m23660n40314n66864m62951j45798j26495M8980k42538k24075
2672.3G39606400K8915k66495l78418n68237k23847j52206k38419l66058j253357q41217
2681.9G35347061O8054q9187k97547r0408j25961n49698l91007l3111j06583j86615
2691.6G33544998m46548m41971M1199k16294p10907o52923k91291k64663m77066O4850
$$ y = [756562653, 756564026, 756889267, 757402649, 757316284, 756511841, 755746002, 755436630, 755172958, 754302216, 753636780, 753099060, 752619629, 752305374, 751830215, 751486511, 751087341, 750985565, 751328278, 751589890, 751415176, 751053238, 750582199, 749680939, 748935776, 748388290, 747765350, 747107773, 746569214, 746295471, 745905685, 745457687, 745434341, 745420380, 744951935, 744752655, 744728241, 744354401, 744002304, 743926163, 743591003, 742788391, 742290115, 741866455, 741326141, 740759277, 740296326, 740150528, 740024033, 740073013, 739830475, 739606400, 739635315, 739368820, 738990402, 738422165, 738198318, 738046112, 737807693, 737441635, 736188278, 735347061, 735415115, 735325928, 735028381, 734937973, 734812012, 734262314, 733871307, 733838196, 733731613, 733544998, 733098450, 732656479, 732697678, 732481384, 731770477, 731117554, 730826263, 730561600, 730084534, 730149384]
2701.2G30149384P858o74362n38788j43204j36185J6022J86310l37982m31061n11856
2710.9G27586136o77872o32095p55005l61252m88510n64423k92282k289J93558j75781
2720.5G23830185k04849n46112k47956K27585j60293k81601o73371o96945m58527l62091
2730.2G20426025l67889l73688j89514k74582l6697L08304K15301j29852l4332k38572
2739.8G19304504n95398k46582m42123o63300p68814m40292p0648j75019J37101l98407
2749.4G15641022n50843J42060K68326L19824N4779l73535m63944l22876l94668m80118
2759.1G13840027m19006m68979n94635m48380R8724l1127k44446M13742O16455K21252
2768.7G12983627j24817p33566n38330K8000m16107o82526r26971q87528l55224r7275
$$ y = [730149384, 730157242, 729482880, 728944092, 728800888, 728664703, 728680725, 728867035, 728529053, 728097992, 727586136, 726908264, 726276169, 725521164, 725159912, 724671402, 724106979, 723814697, 723812408, 724005966, 723830185, 723625336, 723079224, 722831268, 723058853, 722898560, 722616959, 721943588, 721246643, 720788116, 720426025, 720058136, 719684448, 719494934, 719220352, 719183655, 719491959, 719707260, 719577408, 719543076, 719304504, 718709106, 718462524, 718020401, 717357101, 716588287, 716147995, 716077347, 715902328, 716039429, 715641022, 715090179, 715232239, 715500565, 715820389, 715875168, 715501633, 715037689, 714714813, 714320145, 713840027, 713421021, 712952042, 712357407, 711909027, 712007751, 711976624, 711732178, 712145920, 712762375, 712983627, 712858810, 712125244, 711586914, 711614914, 711198807, 710516281, 709589310, 708701782, 708346558, 708249283]
2778.4G08249283J01776P5989K10266n9967l10898L3417j32370p26395q68912m63791
2788G06108398n08346o82602r79004p10983j17417m32129l36074l65372q7433M24423
2797.7G02313461j61361r87626j082153n30701q31985q75092o71768p74688o76194
2806.3F95721893j001510n81284k72751m02374l16467l37754n46417q69522k48947
2815F91144867k44446r46350r55734j027832j244049j369171j145096o74286o11267
2823.7F82926636r81369n87235r0561l13949m13361o88019p01446p41883j288146j456223
2833.3F75664444j282501j167679r82514q95156j240082j332703j099014p41043o73447
2842F66250305j080170j256103j155548j121521j802521j806488j262436j827240k149658
$$ y = [708249283, 708351059, 708427048, 708637314, 708577347, 708266449, 708299866, 708167496, 707441101, 706572189, 706108398, 705600052, 704917450, 703938446, 703227463, 703110046, 702677917, 702341843, 701976471, 701889038, 702313461, 702152100, 701164474, 700082321, 699551620, 698719635, 697844543, 697172775, 696398087, 695721893, 694720383, 694139099, 693866348, 693463974, 693147507, 692809753, 692263336, 691393814, 691144867, 690900421, 689954071, 688998337, 687970505, 686726456, 685357285, 684212189, 683537903, 682926636, 681945267, 681358032, 681267471, 680953522, 680540161, 679852142, 679150696, 678408813, 677120667, 675664444, 674381943, 673214264, 672231750, 671336594, 670096512, 668763809, 667664795, 666923752, 666250305, 665170135, 663914032, 662758484, 661636963, 659834442, 658027954, 656765518, 654938278, 652788620]
2850.7F52788620j883316j165009p91702j101227p58133n63583n49545k31705m26025
2859.4F45318375q81043j034241r75036j177979j520767j357803j595993k059365j731948
2868.1F32984200j683579j939850j681061r44633q74214j629181j963616k048950j830520
2876.7F18388596j626358j780549j810646j728134j765861j635781j117973j114006
2884.4F05809288j080551p81937n06706j45416m73290n67970l26386m09393n81398
2893.1F00936241k79693K45361k60964p05146m46549k94075n84450j63421O25839j1940
2902.8E99061203n10597m27971l85513n70069q41102q23822q82988o73447o33774p39288
2912.4E92572632j380348j778298j268921j143989j042519j258774j390915j741829
$$ y = [652788620, 650905304, 649740295, 648948593, 647847366, 647089233, 646525650, 645976105, 645744400, 645318375, 644437332, 643403091, 642428055, 641250076, 639729309, 638371506, 636775513, 634716148, 632984200, 631300621, 629360771, 627679710, 626735077, 625860863, 624231682, 622268066, 620219116, 618388596, 616762238, 614981689, 613171043, 611442909, 609677048, 608041267, 606923294, 605809288, 604728737, 603946800, 603440094, 603294678, 602821388, 602253418, 601927032, 601517639, 600936241, 600656548, 600901909, 600640945, 599935799, 599489250, 599195175, 598610725, 598447304, 599073143, 599061203, 598550606, 598122635, 597737122, 597167053, 596325951, 595502129, 594619141, 593945694, 593311920, 592572632, 591192284, 589413986, 588145065, 587001076, 585958557, 584699783, 583308868, 581567039]
2920.1E81567039j702880o82297r02443j079865q64028r51119j017761q84056k40097
2928.8E73242493k1973l9940j4267L18909P81441J152725J161995R11216J456070J513405
2938.5E80462074J338654J811523K046662J981125J822204J780815J886864J884842
2946.2E95014763J900406K149963J942635K070427K525520K198181J715927J699257
2953.9F11217079K108689J939773J919479J769104J483269J782150J650315J946182
2961.6F25816040K186470K150574J712341J185455J499787J737709J608085J244240
2969.3F39140701J778717J708298J114578J212082J003342R97238P59659J052933J350174
2978F50117722J307601J234742J043396J122284N58471J095734J484985R30863O88629
$$ y = [581567039, 579864159, 579181862, 578279419, 577199554, 576335526, 575384407, 574366646, 573482590, 573242493, 573220520, 573180580, 573166313, 573485222, 574266663, 575419388, 576581383, 577492599, 578948669, 580462074, 581800728, 583612251, 585658913, 587640038, 589462242, 591243057, 593129921, 595014763, 596915169, 599065132, 601007767, 603078194, 605603714, 607801895, 609517822, 611217079, 613325768, 615265541, 617185020, 618954124, 620437393, 622219543, 623869858, 625816040, 628002510, 630153084, 631865425, 633050880, 634550667, 636288376, 637896461, 639140701, 640919418, 642627716, 643742294, 644954376, 645957718, 646954956, 647714615, 648767548, 650117722, 651425323, 652660065, 653703461, 654825745, 655384216, 656479950, 657964935, 658895798, 659584427]
2986.7F59584427N38483R37042M82864L62702L92761r7428K64283Q40759J080704P19299
2996.3F65105896M69666R0713q697K09732J12075K14920k57492q10547m37088l7384
3006F64651794l35388l23410m09164j22147M97894j80053j93405o6986j27488k91290
3015.6F63100357j117172r46961m86221l66821q87985j061249p53479n43366l43017
3024.3F56594086q80432p75300o98471q06579l77350l42789n17120o74057q15506j351929
3033.9F49354553j237564p38144j071090j314164p68127m16412q74177r42688r10263
3042.6F41081924n08117m63867j278382j121025o24809o36597j132889j380348j408806
3051.3F32527084j051902p97348j056290o25916q56781j009445p25860p87087q34579
$$ y = [659584427, 660122910, 661059952, 661542816, 661905518, 662298279, 662200851, 662465134, 663305893, 664386597, 665105896, 665575562, 665666275, 665657578, 665867310, 665979385, 666194305, 665936813, 665126266, 664689178, 664651794, 664316406, 663992996, 663583832, 663461685, 663959579, 663779526, 663586121, 663519135, 663391647, 663100357, 661983185, 661036224, 660550003, 660183182, 659295197, 658233948, 657480469, 656937103, 656594086, 655713654, 654938354, 654239883, 653433304, 653055954, 652713165, 652196045, 651521988, 650706482, 649354553, 648116989, 647378845, 646307755, 644993591, 644225464, 643809052, 642934875, 641992187, 641081924, 640573807, 640109940, 638831558, 637710533, 637085724, 636449127, 635316238, 633935890, 632527084, 631475182, 630677834, 629621544, 628995628, 628138847, 627129402, 626403542, 625616455, 624781876]
3060F24781876j156655q25462p25136j122398j577683j360855r90257j496086j263123
3068.6F14264221r32655o31333o91947j108475p62367o97709p17048o18019p70531
3077.3F07334137j082001j200561j385460j628266j530571j126709n19599n84374q25615
3086E97450981j251182j119461m30184q38051j198654j281052j155662j176643j230622
3094.7E87769470r46426r73435j145172j491852q70437m34990q18558q77189j128464
3103.4E79082947j004143q18634p53784j019249j499443j349907p38335o68106j280174
3112E69951172j094628p68051q87947j464271j311951k24380l60833q14209q16726
3120.7E62208176q55179j638146j639251p37076j160584j251831j101150j293564j353645
$$ y = [624781876, 623625221, 622799759, 622074623, 620952225, 619374542, 618013687, 617023430, 615527344, 614264221, 613331566, 612700233, 612008286, 610899811, 610137444, 609439735, 608722687, 608104668, 607334137, 606252136, 605051575, 603666115, 602037849, 600507278, 599380569, 598860970, 598276596, 597450981, 596199799, 595080338, 594650154, 593812103, 592613449, 591332397, 590176735, 589000092, 587769470, 586823044, 585849609, 584704437, 583212585, 582342148, 581907158, 581088600, 580211411, 579082947, 578078804, 577260170, 576506386, 575487137, 573987694, 572637787, 571899452, 571231346, 569951172, 568856544, 568088493, 567200546, 565736275, 564424324, 564199944, 563839111, 563024902, 562208176, 561352997, 559714851, 558075600, 557338524, 556177940, 554926109, 553824959, 552531395, 551177750]
3129.4E51177750q76885k24266n11513p52792r98802p15218p76253j217994p50122
3138.1E44353905q66585r83238j395760j756897p50427l28178r79424j399040j143608
3146.8E34750748o02303p39174j165008o34804n02930p59086q29621j054840n13191
3155.4E27949791p86133j485062j448669j246605o43997n61256o01502o67381r72710
3164.1E19536476q73947j043930j169205o61926o33087r07097n86548l82347q79326
3172.8E12399063j595917j035614n48439n27305q4076j035233j170196q93364j115532
3181.5E04393387m46549p30896q28285p76176p45850m46319q33436r73243j140900
3190.1D97471733o25725m07448j262779j220207o76384m17328l67431l75252q73642
$$ y = [551177750, 550300865, 550076599, 549565086, 548812294, 547813492, 547098274, 546322021, 545104027, 544353905, 543487320, 542504082, 541108322, 539351425, 538600998, 538272820, 537293396, 535894356, 534750748, 534148445, 533409271, 532244263, 531609459, 531106529, 530347443, 529517822, 528462982, 527949791, 527163658, 525678596, 524229927, 522983322, 522339325, 521778069, 521176567, 520509186, 519536476, 518662529, 517618599, 516449394, 515787468, 515154381, 514247284, 513660736, 513278389, 512399063, 510803146, 509767532, 509219093, 508691788, 508607712, 507572479, 506402283, 505508919, 504393387, 503946838, 503215942, 502387657, 501611481, 500865631, 500419312, 499585876, 498612633, 497471733, 496846008, 496438560, 495175781, 493955574, 493279190, 492861862, 492494431, 492119179, 491245537]
3198.8D91245537j164665q48198o10276k88238p58400j296082o44569l71399o91528
3207.5D84572182o51131p05910n59807k20985n11246p42263o74859o41822m21906m87251
3217.2D78955002r10301j134453q68569k51731n64881r58481n20477p10526n09185
3225.8D72526398l2959m07868r52873j108208l97644j3084r8267m92859r60121r57603
3235.5D67104912r83963o14395k76261k40440p04117n41954j15814p21398l17344k44103
3245.1D62345123p07740o36826r83048o87637j23367l95127r24453n01519k95219m65202
3254.8D56624985P3890j2168o67649n36499P8011l85819r15680n71861p9842m95796
3264.4D53111572j159324m49181l95164k14043j94397q65097m56314l83911k1744r6131
$$ y = [491245537, 490080872, 489232674, 488622398, 488334160, 487575760, 486279678, 485635109, 485263710, 484572182, 483921051, 483215141, 482655334, 482434349, 481923103, 481180840, 480505981, 479864159, 479442253, 478955002, 478044701, 476910248, 476041679, 475789948, 475225067, 474266586, 473746109, 473035583, 472526398, 472493439, 472085571, 471132698, 470024490, 469626846, 469613762, 469515495, 469022636, 468062515, 467104912, 466120949, 465506554, 465230293, 464989853, 464285736, 463743782, 463627968, 462906570, 462589226, 462345123, 461637383, 461000557, 460017509, 459329872, 459206505, 458811378, 457886925, 457385406, 457090187, 456624985, 456698875, 456686707, 456019058, 455482559, 455560570, 455174751, 454259071, 453687210, 453607368, 453111572, 451952248, 451503067, 451107903, 450893860, 450699463, 449834366, 449378052, 448994141, 448972397, 448876266]
3274D48876266j69219j45379j154747m85725J74561j60256l80897m48571l95393r51195
3283.7D44759445j148567k30141M85649j0871m12903k95105N1040j16386n21088n12619
3293.3D42048454r54475l49465j5220m51279l09944l94592k71683m95834n16358o25648
3303D37663956o32935J06812J1100J62850P6103r64813r79500m10805n62591p13387
3312.6D33756790o80008m49028j20926l72314l21808l0670j40610p24068m97131J41411
3322.3D30561638m61540o37513p43370n46341j84021k75650k94075j040916m55284
3330.9D25922928p7057q96149m85267L1395l22075r50203m83437J45188m1810m79660
3340.6D22363853p68775q26760p70302p23266p55005L80440M27436q49533r78775o05240
$$ y = [448876266, 448707047, 448561668, 447406921, 446921196, 447095757, 446935501, 446554604, 446106033, 445710640, 444759445, 443610878, 443380737, 443866386, 443855515, 443442612, 443147507, 443198547, 443082161, 442561073, 442048454, 441093979, 440744514, 440729294, 440278015, 439968071, 439573479, 439301796, 438805962, 438289604, 437663956, 437031021, 437137833, 437148933, 437311783, 437387886, 436423073, 435443573, 435032768, 434470177, 433756790, 433076782, 432627754, 432506828, 432134514, 431812706, 431782036, 431641426, 430917358, 430420227, 430561638, 430100098, 429462585, 428719215, 428172874, 427988853, 427713203, 427419128, 426378212, 425922928, 425845871, 424949722, 424464455, 424495850, 424173775, 423223572, 422740135, 422885323, 422843513, 422363853, 421595078, 420768318, 419998016, 419274750, 418519745, 418900185, 419327621, 418478088, 417499313, 416894073]
3350.2D16894073m0283m84047r48982o88629k99187R7962k56234l68652n59769p82547
3359.9D12563705n80864j14288j09558o91376l97377k27241l17955m29077p17736l82003
3369.5D08596230l52211r19495p59316j97792j14936O7024l14217p90787n06286j36605
3379.2D04571609K1210l57513m79126k46010q9111n77965o92406P4654m6425j34163
3388.8D02044754l27721m63752k06414m73861l45879j77612n1766J04294l75481m92477
3398.4C99234085J4305k43797n61333m46663k92473L08800K74430M9629m16107o70205
3408.1C97250671L8491k5406m1695K25678M6081k13089j36909j29166k15950j22299
3417.7C96676407p9041M21601N3367n8403O9237l72124m1923k23313J69793J49231
$$ y = [416894073, 416853790, 416369743, 415420761, 414732132, 414432945, 414530907, 414274673, 413906021, 413346252, 412563705, 411982841, 411868553, 411758995, 411067619, 410670242, 410443001, 410125046, 409695969, 408978233, 408596230, 408244019, 407324524, 406565208, 406367416, 406252480, 406319504, 406005287, 405214500, 404708214, 404571609, 404592819, 404235306, 403756180, 403510170, 403421059, 402843094, 402150688, 402225342, 402178917, 402044754, 401717033, 401253281, 401046867, 400573006, 400227127, 400049515, 399997749, 400102043, 399726562, 399234085, 399248390, 399004593, 398443260, 397996597, 397704124, 398012924, 398287354, 398336983, 397920876, 397250671, 397289162, 397263756, 397222061, 397447739, 397493820, 397280731, 397143822, 397014656, 396798706, 396676407, 396597366, 397018967, 397072334, 397013931, 397083168, 396711044, 396669121, 396445808, 396615601, 396764832]
3427.4C96764832l94021J18142J15699j60255J50871R50356M89464j73531r1553M8523
3437C97818527M09317L91312K32735N2414L49998k57111k69699N03311M73328N37186
3446.7D00241318m88091M47998P59812j0948N07698J42250K16255L04832Q56552P04689
3456.3D03682365j144L05862M1848L0784L1090R65309L99704J75667J403885n379q8196
3466.9D06941795P44324O71158L38554M21143J054115M32587L51562L77159K56424
3475.6D11588821L82157L45611J40419K36130P10869N67398Q25996N69764O52656N78690
3485.2D16598511K57721J011696L59993q8120L55454M84848P98721J115036P56569
3493.9D21650429L83644M94270j5831O99234R72786K53601L99781P80677R91021N79414
$$ y = [396764832, 396370811, 396488953, 396604652, 396444397, 396595268, 397545624, 398035088, 397861557, 397770004, 397818527, 398227844, 398619156, 398851891, 398904305, 399254303, 398997192, 398727493, 399230804, 399704132, 400241318, 399753227, 400201225, 400961037, 400950089, 401457787, 401600037, 401816292, 402121124, 402977676, 403682365, 403681221, 403987083, 404028931, 404059715, 404090805, 405056114, 405455818, 405631485, 407035370, 407029991, 406941795, 407686119, 408357277, 408695831, 409116974, 410171089, 410603676, 410955238, 411332397, 411588821, 411970978, 412316589, 412457008, 412693138, 413404007, 413971405, 414797401, 415367165, 416019821, 416598511, 416856232, 417867928, 418227921, 418139801, 418495255, 418980103, 419778824, 420893860, 421650429, 422034073, 422528343, 422512512, 423211746, 424184532, 424438133, 424837914, 425618591, 426609612, 427189026]
3503.6D27189026M29191N80140R73663P43828J127281P05299j011810O50978J068115
3512.2D32455711Q41408O58302J58768P90138O13022R15222N52140N42259J156578
3520.9D38683548J066895M56733o45675P60994J464042J302643J015625N37071L26691
3529.6D44968567L44238Q57086Q24089J391869J087646Q61207J22833M0016J833458
3538.3D52331009P38182L44429P83768R70573R83429R27811L90243l62777J471862
3547D58578529M29268J612549J819305O13442J416550p34978Q85239J404342J818466
3555.6D67842712K125435R0370J525345R05915K81715R25636J993408Q06084K09961
3564.3D76706581L751335l02238l54614P31773p0496L795586K055359J381569J480903
$$ y = [427189026, 427618217, 428198357, 429172020, 429915848, 431043129, 431748428, 430736618, 431387596, 432455711, 433297119, 433955421, 434114189, 434904327, 435517349, 436432571, 436984711, 437526970, 438683548, 439750443, 440207176, 439561501, 440322495, 441786537, 443089180, 444104805, 444641876, 444968567, 445312805, 446169891, 446993980, 448385849, 449473495, 450334702, 450457535, 450497551, 452331009, 453069191, 453413620, 454197388, 455167961, 456151390, 457079201, 457469444, 457106667, 458578529, 459007797, 460620346, 462439651, 463053093, 464469643, 463734665, 464619904, 466024246, 467842712, 469968147, 470058517, 471583862, 472489777, 472771492, 473697128, 475690536, 476496620, 476706581, 480457916, 480155678, 479801064, 480532837, 480462341, 484257927, 486313286, 487694855, 489175758]
3573D89175758J263085P82509J251831K147445J195870K550087J389503O46477J308479
3581.7E01711044J306954J548271J595535L961258P35970p10984J850853o87027K618142
3590.4E13930016K758064L461075J634750Q81805L020249j427918K429619L100510
3598.1E29788170P35893L103752N16815M63181K302856J916237K043534L478279K592697
3606.8E46941414p55234L381119j457520k36702P200509M1885j532021M295807q01
3615.4E57878456M420281M058647j177635J663284j85013P23114L686028K974510J839409
3624.1E75881081K368316K256432K105484N840683j570397j1304817N264626O131859
3631.8E86973267N520324O95916j656876K895813L466034J746063l05633J396026K296524
$$ y = [489175758, 490438843, 491221352, 492473183, 494620628, 495816498, 498366585, 499756088, 500402565, 501711044, 503017998, 504566269, 506161804, 510123062, 510859032, 510148048, 511998901, 511311874, 513930016, 516688080, 520149155, 521783905, 522665710, 525685959, 524258041, 526687660, 529788170, 530524063, 533627815, 534144630, 534607811, 536910667, 538826904, 540870438, 544348717, 546941414, 546186180, 549567299, 548109779, 547873077, 555073586, 555115471, 553583450, 557879257, 557878456, 562298737, 566357384, 565179749, 566843033, 566658020, 567381134, 571067162, 574041672, 575881081, 578249397, 580505829, 582611313, 588451996, 586881599, 575576782, 580841408, 586973267, 592493591, 593189507, 591532631, 594428444, 597894478, 599640541, 599334908, 600730934, 603027458]
3640.5F03027458J793671J337204J052627J608887L287354N788231j529007k221604
3648.2F14144821M962464l022347m089050J003761O142464M213524M173050M773750
3655.9F32302437p642212J732674M396820N49545J353798J074905K301750P95479L92647
3664.6F37257843J520729J907082M544601J992493j019440m45709n563202L755722
3672.3F43950119Q500900P757111m579697j8765793N721436Q812942M263001k408142
3680F53251877R08584L047486J929703J401748L70178J408616M215698M247589j0172806
3688.7F60608673p16324Q395996o869430O76422N408173O05621J555939K48642J55258
3697.4F70068970J587829R28955L174286L021698o273727k091522N168914J536789
$$ y = [603027458, 604821129, 606158333, 607210960, 608819847, 612107201, 617895432, 616366425, 614144821, 619107285, 616084938, 611995888, 612999649, 619142113, 623355637, 627528687, 632302437, 624660225, 626392899, 630789719, 631339264, 632693062, 633767967, 636069717, 636865196, 637257843, 638778572, 640685654, 645230255, 647222748, 646203308, 645757599, 640194397, 643950119, 652451019, 660208130, 655628433, 636862640, 642584076, 651397018, 655660019, 653251877, 654160461, 657207947, 659137650, 660539398, 660909576, 662318192, 666533890, 670781479, 660608673, 659892349, 668288345, 661418915, 662095337, 667503510, 668109131, 669665070, 669913712, 670068970, 671656799, 672585754, 675760040, 678781738, 672508011, 670416489, 675585403, 677122192]
3705.1F77122192N72129P51800K839813L902131p642060L884278L611602j3281173
3712.8F71760712M691467M568787J133956R74579J969452J208191k943115J452942
3720.5F84816971N829315l394928m304962N200500J005021j218491l328476Q48389
3728.3F85453339M914856J393508M876862k129440o098633Q004761q58078j0609055
3736F84948120J027603L098450N13763L135376K922974l435211M771576J1995926j2122345
3744.7F96856232j5982361J0515747O926804O728057l855743r700851R915924p111893
3752.4F94291916m748154O637421M441910K186126n367889K643585M279404p537689
3760.1F96826630K53296M003448O09818R46731M190827k194367m633102L184280N519714
$$ y = [677122192, 677694321, 678446121, 681285934, 685188065, 677546005, 681430283, 685041885, 671760712, 676452179, 681020966, 682154922, 683129501, 685098953, 686307144, 683364029, 684816971, 690646286, 687251358, 682946396, 688146896, 689151917, 687933426, 684604950, 685453339, 690368195, 691761703, 696638565, 694509125, 688410492, 696415253, 695557175, 684948120, 685975723, 689074173, 689587936, 692723312, 695646286, 692211075, 696982651, 708978577, 696856232, 680873871, 691389618, 698316422, 705044479, 701188736, 691487885, 701403809, 694291916, 689543762, 696181183, 700623093, 702809219, 697441330, 700084915, 704364319, 696826630, 697079926, 701083374, 701693192, 702639923, 706830750, 704636383, 700003281, 703187561, 708707275]
3768.8G08707275k87628r750213J929550K937011Q57239J469651j40534R87244Q86459
3777.4G07596054K661667j242981p277756K990113K423477J055221J541138k513275
3785.2G07233658k24228J328735L45764M32740L11432L37829L26004P03507l0747K078018
3794.8G12842712L254624m655228l149032L360443M282150M228744r535598q215866
3802.5G02412949N897522L308487M506988M596405j0862350l063202N131912J764908
3810.2G13693619L89633L02429P11365K214279N055924l166581j3255844O426316O228790
3818.9G18599930M050216J72730j6855774L978729N452347J830063K541885n67855
3826.6G19202271l806763M04281J932984L499069J599960p484665K374115O104203
$$ y = [708707275, 708419647, 698669434, 700598984, 703535995, 704393234, 705862885, 705722351, 706709595, 707596054, 710257721, 709014740, 701736984, 704727097, 707150574, 708205795, 709746933, 707233658, 707009430, 708338165, 708683929, 709116669, 709428101, 709765930, 710091934, 710795441, 710764694, 712842712, 716097336, 711442108, 708293076, 711653519, 715935669, 720164413, 710628815, 702412949, 708310471, 711618958, 716125946, 720722351, 709860001, 706796799, 711928711, 713693619, 714083252, 714385681, 715097046, 717311325, 722367249, 719200668, 705944824, 712371140, 718599930, 722650146, 722822876, 705967102, 709945831, 715398178, 717228241, 719770126, 719202271, 715395508, 715799789, 717732773, 721231842, 722831802, 715347137, 717721252, 723825455]
3834.3G23825455n355606k99378O674652q944168k030182P961808o275788J70593O964417
3843G22691803k797928l919601K906418J455993O30188K771835q72192J195068M443055
3851.7G28504639p266846q22830j2828369M546127R758530r05075j056443J745911
3859.4G21675644K710190K425461n981980Q69141N822296o913681l651657M332352
3867.1G21287766N234909N275650r838334n567398N999985N478439J399155r699173
3874.8G19570999K073136M055328j88141J987839L565216o308212n751343O272735
3882.6G25277557J147080J800232L257599j2544632K619705L967819K020798N727234
3890.3G33273392k408066r891510K639313L612976j168671J475296J281738K790299
$$ y = [723825455, 718469849, 718170471, 724845123, 715900955, 713870773, 721832581, 715556793, 715727386, 722691803, 719893875, 715974274, 718880692, 720336685, 720966873, 723738708, 722866516, 724061584, 728504639, 721237793, 720414963, 707586594, 712132721, 721891251, 720986176, 719929733, 721675644, 724385834, 726811295, 720829315, 721698456, 727520752, 720607071, 716955414, 721287766, 726522675, 731798325, 721959991, 716392593, 722392578, 727871017, 729270172, 719570999, 721644135, 725699463, 725511322, 727499161, 731064377, 724756165, 719004822, 725277557, 726424637, 728224869, 731482468, 718937836, 721557541, 725525360, 727546158, 733273392, 730865326, 720973816, 723613129, 727226105, 726057434, 727532730, 728814468, 731604767]
3898G31604767J057815r298477N961457J479797m817352M241256n879898j785736K054749
3906.7G24618378J751098J527863j152344M09165K80761N94864Q15964O7673J229400
3915.3G30142822J402207l620224k575379M408875j052323l206939L219604K012482
3923.1G30731125J380997k719346k907028J676483Q38471P47909j289520J94702K221527
3931.7G30875320k568740j001435J542282N56946L77808L23105m6463n14069l17688
3940.4G29227066J806793R32389m353257k92129J979523J300201J300507j735459R07974
3949.1G31073608m03366k061386K145233k22091q96302L75519N56641P56302l80860
3957.8G30943298p8888J00174J213837j64871j594467R88235P80258j21765k17590
$$ y = [731604767, 732662582, 723364105, 729325562, 730805359, 725988007, 730229263, 724349365, 722563629, 724618378, 726369476, 727897339, 726744995, 727154160, 727434921, 728029785, 728845749, 728913422, 730142822, 731545029, 727924805, 725349426, 729758301, 728705978, 725499039, 728718643, 730731125, 732112122, 729392776, 726485748, 728162231, 729000702, 729748611, 728459091, 728653793, 730875320, 728306580, 727305145, 728847427, 729404373, 729782181, 730105286, 730058823, 729544754, 729227066, 731033859, 731966248, 727612991, 727320862, 729300385, 730600586, 731901093, 730165634, 731073608, 730670242, 728608856, 730754089, 730531998, 729635696, 730011215, 730567856, 731324158, 730943298, 730864410, 730964584, 732178421, 732013550, 730419083, 731407318, 732187576, 732065811, 731848221]
3966.5G31848221k95410J30310l45383k64893N99061l58582l42331Q76160K53067r1477
3976.1G32008743l72696P0267R3002l63464M62494J00937k57111O9962K60772k54058
3985.7G31818848J46789N94940o08596m3564L59421n1346r8725P21665P68738j047821
3995.4G32560349k01493N84488M69513M14734j08719
4000.2G33718872
$$ y = [731848221, 731552811, 731683121, 731337738, 731072845, 731671906, 731313324, 730970993, 731847153, 732100220, 732008743, 731636047, 731706314, 731799316, 731435852, 731898346, 731999283, 731742172, 731812134, 732072906, 731818848, 731965637, 732560577, 731951981, 731908417, 732267838, 732216492, 732117767, 732839432, 733608170, 732560349, 732358856, 732943344, 733412857, 733827591, 733718872]
##END=$$ End of the data block
