##TITLE=$$ Begin of the data block
##JCAMP-DX=5.00 $$ ACD/SpecManager v 10.08
##SPECTROMETER/DATA SYSTEM=Varian
##DATE=20 Nov 2012 15:13:56
##DATA TYPE=INFRARED SPECTRUM
##DATA CLASS=XYDATA
##ORIGIN=
##OWNER=
##NPOINTS=3735
##FIRSTX=399.26403809
##LASTX=4000.35498047
##MAXX=4000.35498047
##MINX=399.26403809
##MAXY=80.46073151
##MINY=35.73321915
##XFACTOR=1.0000000000
##YFACTOR=0.000000100000000
##FIRSTY=60.68937683
##DELTAX=0.96440572
##XUNITS=1/CM
##YUNITS=TRANSMITTANCE
##XYDATA=(X++(Y..Y))
399.3 606893768 608064842 605775681 601651001 595800056 595232391 593837929 586062469 587829514 594209137
407.9 594209137 598654099 597510529 598323059 605078468 600457382 594527321 595331192 596637154 598787346
416.6 598787346 595441093 577901001 569229355 584704971 592461357 592969513 598349342 602006264
424.3 602006264 600308189 596046028 589583817 587750854 589886818 593135910 593491096 589103394 588445854
433 588445854 587346039 589659500 593857689 585641251 579619560 580337410 585874367 592636604 591259613
441.7 591259613 590793457 594308739 599098625 604058914 601315231 594627457 594477119 597502670 600781288
450.4 600781288 603299751 600199509 594054337 595802040 603110657 607917099 604282837 597979965
458.1 597979965 599086761 601000633 601030197 599514198 601590347 603932991 603654327 600095215 595021744
466.8 595021744 593189812 591574059 588227959 588036575 587691040 580125847 580510178 587831764 589221077
475.5 589221077 587359924 587557297 587011871 585859108 586675415 584286461 582063713 582785645 577633781
484.1 577633781 575940628 577715645 576862144 576046638 576268768 578174820 577663498 580003052 583526115
492.8 583526115 582355499 580309639 581918106 585289116 582078667 578049126 576474571 578374023
500.5 578374023 580821381 571673050 566354599 568290787 567939606 564489555 563747292 566493721 567648849
509.2 567648849 566666679 562957077 563745232 564088173 558913116 555381165 553089790 552200317 552885056
517.9 552885056 552856102 550140343 547499237 547605667 547216682 546145973 546321335 545662041 543279457
526.6 543279457 544036484 544369659 543343964 540785484 537297058 537877274 539801102 541431541 543406639
535.2 543406639 545813255 546826248 549498024 553747635 554858780 556314354 557890205 557674141 557910843
543.9 557910843 561304321 563486824 561285362 560241661 560793533 562868195 563083763 561158104 560935249
552.6 560935249 561787529 562137184 560382080 559084549 556119957 552905235 553086128 552963676 551310349
561.3 551310349 547537308 544901772 543106194 542312508 542331810 539969902 537388229 533972664 531296654
570 531296654 529484100 528809204 527562790 525192490 524805183 524453278 525296402 525462151 527080231
578.6 527080231 530000191 532632675 534722252 535544624 538462753 541114349 544604034 547198944 548310699
587.3 548310699 550103569 551811562 554986382 555991173 555971031 556640282 556652412 557246704 557539673
596 557539673 557839394 557471199 557254791 557035561 556805611 556799164 556764374 558238640 558156319 556812325
605.6 556812325 557218132 558317642 557888031 556476936 556669731 557373085 557469330 557915001 558940353
614.3 558940353 559977798 561887779 563623123 564212456 565015907 566213913 567933083 569106712 570383797
623 570383797 571963310 572381134 572405205 573501549 575199280 576026611 576633987 578189430 581090736
631.7 581090736 583390160 584153404 585259018 585880737 585657768 586068268 586407204 585239105 584702606
640.4 584702606 585441132 585556068 586280708 587460709 588836632 590546036 591819611 592608643 593317986
649 593317986 594361839 595030174 595023232 594728470 595340767 595602341 594405861 594471130 595373421 595872765
658.7 595872765 596944542 598052635 598796768 599632683 599726944 599742012 600674515 601541939 601560669 596011925
668.3 596011925 597166061 599493752 600387459 601704178 602113533 601948204 603210411 605005913 606990356
677 606990356 608896599 610520554 610955086 610075150 609781914 609298706 608716736 610052834 611134224
685.7 611134224 610966797 611241035 611179085 611573143 613318939 613854828 613102875 613400650 613537140 612786179
695.3 612786179 612211151 610827637 608897362 607652931 606851730 605647469 604775047 604982300 604556046
704 604556046 603532562 602868614 603051338 603499527 602998924 602692261 602882881 603871346 604811020 604589195
713.7 604589195 604594421 605819359 608659554 611222458 612337418 613246651 615901299 619796295 622351913
722.3 622351913 624184837 626031685 628258858 630291519 631525040 633318825 635557213 637145576
730.1 637145576 637797012 639084702 641414948 642878876 644265137 645436783 646547318 648183060 648842621
738.7 648842621 649944611 650226593 649853973 649871902 648839188 648972778 649430771 650211563 649987640 647776337
748.4 647776337 646493912 645281982 644908295 644028778 642033081 639757690 636798553 635812416 634654694
757.1 634654694 631096649 628421478 628405418 628231087 627316818 627830849 627738609 626443672 625024109
765.7 625024109 624819756 626127586 626960793 628093872 629327126 630585899 632779694 635128975 637158585
774.4 637158585 639692917 643157425 646618576 650083694 653000793 656128464 659120636 661156921
782.1 661156921 663258896 665547867 668307037 670106049 671277008 673386536 676011124 677613373
789.9 677613373 678857880 681302872 682551956 682261353 683070297 685535660 687008591 687758789 689141617
798.5 689141617 690376205 692113876 693232193 694073563 695907898 697871857 698719406 698716049 698758545
807.2 698758545 699592209 701312485 701015549 699836960 699515915 699731903 700410843 700412140 699898911 699156494
816.9 699156494 699430923 700532074 701575699 701888733 701548615 701374588 700792007 699608841 697123566
825.5 697123566 695924988 696373520 695924377 695133133 694836731 694281006 692499619 691063080 689384460
834.2 689384460 688026123 686825790 684402695 682555084 680635147 678612595 676310806 674065399
841.9 674065399 672742920 672266541 672099991 671569748 671278076 670178528 669502182 668684845 667002869
850.6 667002869 665800629 663742905 661626892 659514771 658165894 656512985 653738480 652164688
858.3 652164688 650845184 650007019 649965515 650854645 652559586 655124512 658531113 660976562 664705887
867 664705887 668953323 671996918 674903946 678024216 681528473 684451523 688094254 691628418 694151611
875.7 694151611 696658783 698992233 700001907 700071182 700909882 701252975 700034180 697641525 695720062
884.4 695720062 693332443 690567474 688748016 686966476 685294495 682880707 680751495 679393387
892.1 679393387 677895126 676052856 673353500 670597687 668530350 667176819 665045242 662331390
899.8 662331390 659994736 657849121 656694412 655545883 653645706 652153473 650547791 648227463
907.5 648227463 646181030 643951645 640442657 635704498 631185341 628052063 625565529 622407761
915.2 622407761 617576904 613099022 610135384 607893562 606259155 604033432 601379204 599810448
922.9 599810448 598752518 597693558 597512054 597343483 596463585 596057091 596112099 596547585 598125000
931.6 598125000 599511871 600627136 602143898 602942734 603743553 605163269 606403618 606886330 607784958
940.3 607784958 609721718 611592674 613563766 615266457 615919685 615892792 615598755 614228058 611815262
949 611815262 608754349 604621086 600448914 596391563 591788864 586412849 579802933 573982124 568782883
957.7 568782883 562872124 556699142 550244331 544169579 537637978 530636559 523646927 517082863
965.4 517082863 510022774 502333908 494956856 487009697 479513283 471368752 463519440 455626030
973.1 455626030 446987953 439142570 431307068 424247398 416308670 408868294 402050743 395717125
980.8 395717125 389718475 383939590 379867783 374843712 371594238 368617706 365932045 363771782
988.5 363771782 361448250 360882301 359646454 359578438 358516960 358268509 358537865 358184280 358856697
997.2 358856697 358328667 359081688 358822937 359469872 359842834 359436874 360725784 361278000 362389183
1005.9 362389183 361439133 360673866 359757957 359123268 359263306 358109055 358466072 357946129 357867622 357332191
1015.5 357332191 357419090 358024178 358095093 359170609 359325180 361148758 361980476 363072243 364319916
1024.2 364319916 365197067 366548843 366952400 368931808 369560814 371547165 373429756 374760323 376677094
1032.9 376677094 377769089 379851379 379884682 381115570 381240044 381103973 382159996 382414780 383232346
1041.6 383232346 381840858 381996803 381451988 381469955 382824745 383042908 383065529 382854767 385656891
1050.2 385656891 386154251 387075844 389480743 391851578 394429741 395188293 398281898 401244965 405240669
1058.9 405240669 408722649 412367592 416946869 420482788 425462837 429041824 432887688 435502777
1066.6 435502777 437405701 438615189 437429352 434819336 430277023 426753502 421183777 416431274
1074.4 416431274 413368301 410801392 409392967 407235184 408148079 407965317 407770271 408596268 409898872
1083 409898872 411333771 412569923 415483627 416554756 419215546 421382561 423518486 426860428 429792938
1091.7 429792938 433350143 434713173 436825981 439579582 442793083 444372597 444761848 445630074 445401039
1100.4 445401039 445902176 445067215 444591408 444549332 446705971 448683472 448663788 450912819 452002296
1109.1 452002296 454369812 455892143 456605873 458512230 460373497 462846909 463833809 465712128 466821632
1117.7 466821632 468744431 470627136 471607399 473787346 474686966 476194496 476472435 477474632 479207077
1126.4 479207077 480625496 482343597 482984467 484834747 486180573 488446121 490421638 492123108
1134.1 492123108 494141922 494498482 494804230 493916283 493171997 491729164 490387154 487939072 483746033
1142.8 483746033 481662064 479014359 476008797 472370377 469809952 467333298 464118042 462520676
1150.5 462520676 460420151 459278908 457643051 456515083 455804482 455503807 455341988 454640503 455944824
1159.2 455944824 456239967 457279587 458252144 459779854 462145348 464134712 467832680 470979652 475351982
1167.9 475351982 479754486 484710159 490185165 495545616 501611176 507014961 513024979 518271065
1175.6 518271065 524254990 529934845 534717789 539828033 544799004 550511436 555647163 560950813
1183.3 560950813 565581245 569946671 574366035 578123055 582294159 585838852 589023476 591640930
1191 591640930 593258934 594253845 595124474 595954018 596745148 597792778 598278809 598810654 599466782 600462036
1200.7 600462036 601568069 602325974 603647346 604375610 604594345 605280685 606444473 607269783 607598495
1209.4 607598495 608245697 609078140 610509300 612495346 614871025 616858749 618291931 619749718 621396141
1218 621396141 623303986 624656372 625652847 625988693 625476875 625127182 625012894 624688339 623646431
1226.7 623646431 622544365 621961060 621792793 621788177 621001892 620211754 620051575 619924240 619437943 618546486
1236.4 618546486 617628860 616592560 615868721 615111427 613661003 612589378 612305489 612314758 612720184
1245 612720184 613421555 614301872 615332947 616216583 617303352 618185844 618714523 619587059 620093994 619778900
1254.7 619778900 619566040 619384193 619356766 620092087 620997810 621717033 622197876 622863655 623859596 624694138
1264.3 624694138 625481758 626211739 626870537 627034760 627222595 628109283 628779449 629065628 629825554 630646515
1274 630646515 631032600 631684113 632357178 633282394 634209404 634353638 634313660 634047203 633525810 632952766
1283.6 632952766 632613754 632146721 631468010 630613747 629890022 630109520 630296631 630252037 630551987 631086197
1293.3 631086197 631208611 630700912 630031433 628960114 627838707 626368141 624939842 623840599 622269211
1301.9 622269211 620703354 619541130 619066811 618974342 618475189 617890892 617356415 616832314 616300812
1310.6 616300812 615659027 614873123 613815193 612454605 611291618 610323486 609231567 608522530 607864990
1319.3 607864990 607342987 607368279 607120171 606912766 606627388 605852852 604897194 603314133 601189232
1328 601189232 599016914 596787720 594278412 591927452 589904671 587913246 586527176 585509529 585295563
1336.7 585295563 584963226 584384155 584098244 583831329 584517326 584845314 585052795 585288734 585299988 584911308
1346.3 584911308 584425964 584403534 584237709 583908234 583518715 583986702 584516335 584556236 584519081 584428406
1355.9 584428406 584720573 584332542 583778191 582934151 581578064 580744209 579960823 578978882 578678207
1364.6 578678207 578997345 578633270 578625259 578957176 579054451 579607811 579776115 580495338 580843391 580971603
1374.3 580971603 580725632 580723267 581451454 581142883 581400719 581794434 582448196 583289986 583812256 584587097
1383.9 584587097 585942383 588291893 589598503 590882034 592656517 594027710 594844475 595542297 596209755
1392.6 596209755 596331520 595907707 594919090 595958862 596440849 596168671 595036049 594499397 595416794
1401.3 595416794 595240440 595259552 594495087 592509537 591554794 590805283 590209541 589058723 588345680
1409.9 588345680 587328568 586511803 586131058 585316658 584748230 584122086 584201469 583915253 583631706 580661659
1419.6 580661659 580440903 581809845 581561279 581316833 579517097 579843979 580447044 580328751 581361122
1428.3 581361122 581354790 581848602 582548218 584157639 584969711 585075798 586462860 587051277 586355438 586247978
1437.9 586247978 588280296 588919067 589449120 590787239 591217003 592081070 592117958 593202782 594020271
1446.6 594020271 594807053 595033836 595128708 596058464 595249023 594916191 594050331 594431686 594570541 593334503
1456.2 593334503 592066536 588659134 591365128 591667442 593654671 594362984 595240784 597517700 596993561
1464.9 596993561 599493713 600996666 603519783 605058212 607497520 610985298 612481842 616663857
1472.6 616663857 618781090 624729309 628153458 631220741 634995193 638264198 641943130 644493103
1480.3 644493103 648339767 650279770 652946701 655340576 657694016 660816116 661765823 664505157
1488.1 664505157 665417480 666547546 667830963 670930328 674512100 676239243 679250565 680582581
1495.8 680582581 679870453 681871643 683201141 683605042 685723343 687686310 687914429 689698944 691021957
1504.5 691021957 691857300 686580429 683803024 690478058 692312851 695455627 697646713 698815002
1512.2 698815002 698673172 700636749 702226868 701897430 701865692 699240799 702607422 704252930 702054901
1520.8 702054901 700432510 701094742 705686951 707514877 708113327 709324722 710555801 710140305 710803604
1529.5 710803604 712683258 712501526 712597809 710495224 708223572 710075836 711173477 712897034 714664917
1538.2 714664917 712076569 703239365 709955444 712362671 712852936 715790176 715156479 713118134 713544922
1546.9 713544922 713964081 714183884 712479935 710100021 711193237 712970276 713887634 712425995 712993698
1555.6 712993698 716046982 717299347 704644852 699196396 704433594 708416748 709298401 708577881
1563.3 708577881 707764053 705362091 704672623 705083160 705422974 705527420 701319656 701803665 702847824
1572 702847824 702521286 702200394 702703018 702766724 695457916 695070038 694941177 693634567 692273254 691025238
1581.6 691025238 690825958 690143738 690108871 690091705 689837265 689633636 688842697 688189774 686659775 685272369
1591.2 685272369 683454285 681549454 679573746 677924881 677276840 676117401 675752487 674952545 674581299
1599.9 674581299 674216156 673303452 672364044 670558319 669220657 667390900 665954437 663640442 661392822
1608.6 661392822 659071198 656857681 656201172 654060211 652782516 651727600 652221680 651577530 644655075
1617.3 644655075 645973663 645530014 644681854 642997437 642516937 641168976 636377258 636461678 636114693
1626 636114693 636035309 633474045 632870522 633587837 633681641 634114990 633835449 635273819 637184143 634374657
1635.6 634374657 630672684 630683937 630639496 631134682 631612816 631286926 632332420 632627678 634113617
1644.3 634113617 635303078 633970070 635421562 635712357 638561478 640805359 643430481 645996628
1652 645996628 640732040 636422081 641821060 645652161 647853622 649779816 651408844 653234177 655022507
1660.7 655022507 657342377 658963699 659308395 662342682 664815063 666563721 668391113 670382614
1668.4 670382614 669609756 670781631 673688660 674712982 677569962 681038742 682550659 682392883 685611572
1677.1 685611572 688619080 690759048 692361450 693090668 696563187 700308685 701152344 697195282 700226364
1685.8 700226364 704199219 706476059 707625504 709386749 711157227 713300629 715540314 717535477
1693.5 717535477 720702972 723047104 719240494 721494446 724857635 729548340 729157333 722900848
1701.2 722900848 727456284 730561218 732170334 731723785 732312088 732014084 733375473 735652390 736559753
1709.9 736559753 736917953 737857361 739183807 740151978 739584122 738530884 741324615 743544617 737580948
1718.5 737580948 738589630 740113449 741208878 741757126 741640091 741803818 742469711 743224945 743687668
1727.2 743687668 744612961 745977020 745593491 744350739 746044464 747950211 745007095 740764313 743136368
1735.9 743136368 745504837 746583710 748363037 748020401 746292572 749388657 751527939 750964890 750599518
1744.6 750599518 752234116 753581696 753745728 753692474 753006058 754702682 754327087 754261475 756992874
1753.3 756992874 758838577 761364059 763540726 762819824 763434372 765148087 766704178 768830948 767664642
1761.9 767664642 766440964 768012161 768795319 769455414 770321350 770758209 769975815 772447128 775779877
1770.6 775779877 776394806 775213776 774149857 776688309 777923584 777266846 778269882 778008270 778081055
1779.3 778081055 777697601 776830978 777348938 778228836 779287567 779260178 780257492 781819077 782389755
1788 782389755 782836075 784156189 784403915 783761902 782006989 780834732 782348328 782004700 781206665
1796.7 781206665 782362747 783665695 783891602 783612671 785220032 785695953 786556473 787851486 788083115
1805.3 788083115 787791367 786984482 786695862 786711349 786719589 785466843 785344009 786145248 786591263 787617722
1815 787617722 788292389 789386597 789708328 790105362 790720749 790343552 790442505 789486923 789435120 789653397
1824.6 789653397 787134018 787099762 788793793 790333633 789918747 787728119 789462280 791865387 792611084
1833.3 792611084 792937164 792932892 792887192 792363205 791182938 791265106 790858231 791048737 790972595 790774460
1842.9 790774460 790219498 787786560 790756302 793019028 793489532 793470840 793706589 794105682 793393707
1851.6 793393707 793181610 792795868 792496490 792159576 791826096 791948318 791746521 792384796 793037491 793825836
1861.3 793825836 794311829 794712982 795052948 794793167 794774094 794107208 794169769 793157349 791438141 791591721
1870.9 791591721 792038345 792712860 792960358 793516083 794086075 794637451 795061188 795471191 795969391 795854645
1880.6 795854645 795544891 794706268 794632874 794593277 794149704 793972855 793950729 794987488 795117493 794391251
1890.2 794391251 795171356 796380997 796788788 797080536 796836243 795510254 795566101 795496826 795402145 795502396
1899.8 795502396 795534668 795658722 795472565 795716171 795367050 795755920 796432571 796531982 796973114 796911545
1909.5 796911545 796555481 796360016 796786423 796224899 795727386 795955353 796101379 796683807 795229416
1918.2 795229416 794737396 795703049 796533661 797096024 796322708 796458893 797149506 797108002 796528397 796425934
1927.8 796425934 796407776 796089630 796134644 796138916 795841064 795439072 795971985 796276398 796309509 796520004
1937.5 796520004 796728668 797312775 797242584 797595825 797055283 795743256 796291199 796595001 796516571 796290283
1947.1 796290283 796388397 796405106 796521912 796841812 797024612 797097778 796709518 796803513 796863632 797088013
1956.7 797088013 797248001 797155685 797426147 797421188 797751617 797649994 797308502 797389374 797562714 797481384
1966.4 797481384 796647491 796454163 796725693 797061005 797224960 797233429 797585907 797944336 798154373 798125916
1976 798125916 798096008 798008423 797817230 797461548 797459488 797549896 797268372 797326813 797404709 797635422 797765350
1986.6 797765350 797670517 797498932 797478333 797978287 798032074 797480392 797148666 797601776 797923431 797500992
1996.3 797500992 797109451 796921158 796854477 796695328 797031631 797390366 797649994 798001480 797923279 797802353
2005.9 797802353 797621994 797592468 797353668 797162094 797126007 796757050 796219559 795595551 795421448 795530701
2015.6 795530701 795734024 795624542 795851364 796379471 796492538 796679535 796368637 796063919 795663376 795359192
2025.2 795359192 795233002 794747772 794281845 793829269 794126587 794071579 793940735 794044952 793857117 794166412
2034.9 794166412 794219437 794355087 794300308 794219437 793983231 793479462 793215103 792476501 792335510 792539902
2044.5 792539902 792840881 792657471 792439270 792864838 792613907 792776794 793109741 793400192 793071518 792376785
2054.1 792376785 792443085 792139359 792014084 791633835 791337128 791551971 791751556 791975708 792060089 792500000
2063.8 792500000 792582779 792670441 792837601 792923508 793105316 793021774 792808533 792096329 791720886 791693649
2073.4 791693649 791502075 791158829 791349640 791948166 791959763 792448959 792909698 793011169 793100357 793214951
2083.1 793214951 793143539 792604294 792441177 792271881 792272110 792031097 791548767 791484985 791726990 792119522
2092.7 792119522 791975632 792462845 793100281 793376694 793739166 793708801 793552628 793074493 792925797 792567673
2102.4 792567673 792232361 792542038 792522964 792561340 792631073 792666016 792779999 793149185 793472519 793574982
2112 793574982 793899918 794117737 793798676 793024445 792930908 792921371 792458267 792535324 792928696 792935791 792671051
2122.6 792671051 792907181 793296661 793478394 793672485 794127502 794287949 793852844 793597641 793161926 792936554
2132.3 792936554 793088226 793096695 792763214 792545242 792948532 793045197 793095398 793305511 793400421 793338776 793337860
2142.9 793337860 793606110 793662720 793599625 793329391 793188248 793012772 792813797 793073196 793491516 793493881
2152.5 793493881 793003235 793322830 793762207 793990479 794516830 794672699 794459610 794029465 793923950 793665619
2162.1 793665619 793302002 793039169 793275528 794027786 794068909 794154129 794218140 794400864 794679871 794945984
2171.8 794945984 795686493 795802689 795578613 795339661 795210800 795128479 795149307 795311890 795275421 795494919
2181.4 795494919 795806503 796388321 796522675 796529922 796978455 797314682 797502747 796984329 796778183 796899414
2191.1 796899414 797045135 797233505 797346497 797714005 797567139 797425919 797398376 797609024 798055801 798107681
2200.7 798107681 797935715 798245773 798892822 798447876 798405609 798784485 798539047 798404617 798442230 798738098
2210.4 798738098 798524628 798599014 798942337 799067612 799635925 800081100 799955597 799452057 799531860 799653625
2220 799653625 799636154 799714661 799777679 799981613 800234756 800868073 800662155 800262604 800450974 800705719
2229.7 800705719 800845413 800454941 800453110 800274124 800133362 800574799 800954819 801055145 800677872 800355377
2239.3 800355377 800525208 801477737 801682205 801127319 801281815 801717148 802044601 801819763 801394653 801177521
2248.9 801177521 801202393 801001587 800811234 800884323 800944519 801203232 801255188 801660614 801801987 801727676
2258.6 801727676 801892319 802070160 802503662 802113647 801763458 801381149 801165390 801258545 800977325 801582870
2268.2 801582870 802220535 802602310 802651978 802602310 802808075 802708969 802441559 802119446 802364273 802289200
2277.9 802289200 802444458 802578888 802106628 802049942 802021179 802223434 801940536 802250366 802839432 802656937
2287.5 802656937 802818756 802718964 802876587 802835083 802773514 802686691 802278519 802176971 801922836 802347183
2297.2 802347183 802648163 802758026 802921677 803276901 803684235 803192902 803327408 803669815 804100800 803989792
2306.8 803989792 803110046 802975311 802878494 802960663 802613678 802541428 803004608 803425446 803995590 803918152
2316.4 803918152 803792572 803293991 803318329 804086533 804057007 803726425 803494415 803458710 803098755 803306656
2326.1 803306656 804279022 804607315 804170837 803571091 803229523 803126297 803292084 804037552 804476776 803777618
2335.7 803777618 803523483 803473969 803549118 803596420 802905273 802595978 802064667 802514801 803270493 803346100
2345.4 803346100 803448639 802629623 802196808 803015366 803978729 803740234 803044281 802007446 801685638
2354.1 801685638 802804413 802764740 802774582 802294540 801625214 801611099 801952591 802697296 803287735 803292389
2363.7 803292389 801448593 801613617 802462769 801747131 800919342 800336075 800885010 800831680 800030899 799467850
2373.3 799467850 799792709 800094299 799529190 799056320 799176865 799660645 799330902 798953629 799053650 799224548
2383 799224548 799286118 799175339 799190216 798846512 798681183 798451767 798143768 798193283 797770004 797432327
2392.6 797432327 797619095 797943878 797745895 797569809 797799377 797608414 797276230 797318268 797606506 797460937
2402.3 797460937 797178879 796773300 796500549 796371460 795732956 795648041 795934601 796006012 795820999 795872116
2411.9 795872116 796168671 796209335 796447220 796262436 795830536 795342789 795165634 795157394 794581299 794202881
2421.6 794202881 793867340 793725052 793482437 793145828 793389435 793951492 793996353 793167419 792982178 793301697
2431.2 793301697 793383560 792823334 791967545 791742935 791480865 791159515 790946426 791002350 790998917 791123047
2440.8 791123047 791127396 790790787 791233673 791324997 790967255 790682678 790427017 790058594 789567184 789398422
2450.5 789398422 788644409 788121338 787954178 787608948 787608032 787731323 787649307 787636261 788096542 787766113
2460.1 787766113 787561722 787872620 787619247 787176666 786442642 786140137 785652847 785156555 785101013 784965820
2469.8 784965820 785124969 785091934 785269318 785451584 785504456 785638199 785494919 785287018 785150452 785028381
2479.4 785028381 784359741 783660583 783000870 782511520 782585220 782469482 782295609 782381363 782640762 782670975
2489.1 782670975 782777481 782733612 782454834 782798538 783096390 782661514 781667252 781072922 780784912 780419006
2498.7 780419006 780378876 780488358 780598068 780611038 780842743 781081543 781326218 781460724 781394958 781244812
2508.3 781244812 780616074 780092926 779710999 779539719 779191437 778751831 778546066 778172913 778591919 779255905
2518 779255905 779629898 779734879 779714127 779528122 779009247 778994675 778656769 778274918 777885742 777185287
2527.6 777185287 776764526 776452255 776516266 776366348 776346817 776504440 776755371 777219772 777411118 777668610
2537.3 777668610 777330704 776687317 775975037 775468597 775153580 774183578 773550949 773484573 773586731 773467407
2546.9 773467407 773519516 773799744 773718109 773939819 774381027 774794464 774635620 773784409 772890244 772261047
2556.6 772261047 771783905 771177063 770696182 770163651 769928894 770261993 770403595 770328522 770853500 771250305
2566.2 771250305 771077652 771324997 771129684 770549316 769868164 768966064 768449783 768138123 768157272 767949905
2575.9 767949905 767499008 767257004 767522812 767927551 767913666 768095322 768076019 768183517 767876053 766744690
2585.5 766744690 766118393 765865326 765550156 764893188 764553299 764665909 764849777 765081406 765071640 765189362
2595.1 765189362 765302277 765586624 766060715 766060791 765541382 765014801 764386749 763439255 762562408 761927185
2604.8 761927185 762128601 762459641 762397003 762446518 762290573 762094879 762294159 762934265 763089523 762687302
2614.4 762687302 762040253 761276321 760539474 759587021 758975830 758306732 757873077 757725220 757668304 758193588
2624.1 758193588 758474045 758607483 758331375 757873917 757493820 756891098 756451340 755692291 754974213 754403305
2633.7 754403305 753985825 753658218 753191071 753049088 753069687 753101120 753018417 752882996 752163010 751516113
2643.4 751516113 751557007 751206436 750855942 750415421 749501343 748471909 747925568 747809219 747421875 746986694
2653 746986694 746690674 746792068 746750870 746351471 746145172 746027679 745966339 745697327 745248184 744705353
2662.6 744705353 743979263 743415222 743403397 742959595 741830368 741461792 741548996 741379700 741148529 741177444
2672.3 741177444 741058121 740681152 740402222 739712448 739363937 739658661 739740753 739207458 738233032 737389755
2681.9 737389755 736890106 736774216 736642609 736534271 736227951 735821152 735706406 735381012 735188141 735085220
2691.6 735085220 734952621 734673233 733902969 733310547 733058624 732814484 732482147 731939087 731427002 731260834
2701.2 731260834 730879898 730306549 730125504 730357819 730416489 729972382 729797516 729529877 729190750 728733749
2710.9 728733749 727910843 727530975 727148972 727024002 726687469 725792923 725201797 724896927 725139923 725407257
2720.5 725407257 725383682 724770813 724287491 724440384 724324799 724357224 723771286 722792664 722194595 721432114
2730.2 721432114 721054001 721116333 721023026 720559311 720438461 720757523 720918579 720942841 720993805 720979233
2739.8 720979233 720659180 720300751 719584656 718819351 718480148 717967453 717292862 716870651 717049789 717270050
2749.4 717270050 717321320 717559204 717700653 717676926 717555618 717323456 716684494 715948105 715651169 715323181
2759.1 715323181 714749527 714333801 713885269 713375397 713300629 713376160 713583832 714085999 714359589 714248810
2768.7 714248810 714149551 713951797 713428802 713050995 712709351 712218781 711471405 710493317 709790878 709518814
2778.4 709518814 709757919 710017853 710091705 710012207 709829636 709948578 709920502 709386826 708638000 708150558
2788 708150558 707618103 706526108 705417862 704929962 704611588 704018173 703882141 703801346 703480148 703486023
2797.7 703486023 703455658 702950439 701820221 700909882 700543518 700165405 699454193 698325958 697158813
2806.3 697158813 696108093 695577393 695338440 694817047 694178696 693864288 693874130 693500671 693130341 692707825
2816 692707825 691576843 690239792 688968964 687926788 687121506 686240082 685346985 684466553 683550873
2824.7 683550873 683123627 683324051 683315964 682699356 681627731 680644150 680038681 678960800 677404327
2833.3 677404327 676362457 675319366 673695602 672230606 671145935 670024796 668799896 667905197
2841.1 667905197 667324448 666603699 665729294 664555817 663021698 661451340 659692535 657834320 656294708
2849.7 656294708 654608002 652946167 651757584 650711365 649751663 648816986 648127747 647712784 647594757
2858.4 647594757 647322388 646152649 644864731 643742981 642460403 640863190 639340858 637906685
2866.1 637906685 635992584 634567375 633311577 631400375 629616776 628394814 627157669 625380707
2873.8 625380707 623697052 622072983 620299110 618177948 615845184 614176483 612775459 611368446
2881.6 611368446 609571495 607803993 607046661 606332092 605424690 604943352 604916191 604688988 604090767
2890.2 604090767 603628273 602920151 602238846 602100029 602301712 602285614 601508865 600640259 600274887 600318527
2899.9 600318527 600351715 599895821 599500237 599315224 598932037 598413544 597997818 597852478 597242622 596271439
2909.5 596271439 595244942 594263916 593808899 592539330 590712509 589264030 587986946 586704597 584918900
2918.2 584918900 583926620 582988014 581390457 580366516 579051285 577804565 576923714 576050911 575433006
2926.9 575433006 574898148 574921188 575205269 574894409 574634323 574993820 575291138 575823822 576863213 578215904
2936.5 578215904 579790611 581284485 583157921 585068092 586915131 588818855 590436668 591964989
2944.2 591964989 593886337 596334229 598351097 600252151 602202682 604174843 606523705 608727837
2952 608727837 610975609 612838783 614666405 616855240 618715973 620299492 622075233 624214668 626081161
2960.6 626081161 627750778 629516220 631427193 633121910 634845314 636683540 637991142 639413795
2968.3 639413795 640652466 642222061 644213867 645311661 646306305 647713623 648809738 649618530 650739517
2977 650739517 651809845 653204041 654705887 655385208 655829239 656598740 658230972 659722366 660444946
2985.7 660444946 660923843 661770782 662924500 663326187 663905640 664626617 664888763 664908752 665035706 665660782
2995.3 665660782 666419907 667218704 667738037 668535767 668820190 668213730 667962799 667501907 666958542 666935959
3005 666935959 667066650 666409149 665872498 665912094 665635910 665494919 665282288 665270920 665382233 665783005
3014.6 665783005 665776672 664333878 663105850 662545776 662224731 661510086 660828476 660082016 659009323
3023.3 659009323 658500519 657904129 657551041 656951294 656159058 655950241 655432358 654758453 654150696 653431931
3033 653431931 652111282 650851212 649896011 648701096 647723846 646806107 646283188 645784912 644686508
3041.6 644686508 643727341 643313751 642441483 640982208 640142212 639452133 638402939 637260323 636243973
3050.3 636243973 635164986 634044151 633019447 632041512 631375008 630302696 629221687 628682518 627911263
3059 627911263 626717300 625877571 625435104 624431763 623437233 622243004 620992508 619684525 617903633
3067.7 617903633 616851730 615954208 615436668 615082664 614082565 613213844 612464027 611636162 610492439
3076.4 610492439 609269981 607915382 606639900 605655098 604800568 603733940 602080383 601124954 600428162
3085 600428162 599536667 598748016 597733345 596984787 596278381 595261650 593867912 592738037 591558838
3093.7 591558838 590376282 590068092 589342194 587658310 585727539 584451714 583707962 582949028 582102585
3102.4 582102585 581177979 580608330 579888458 579083099 578081398 576671143 575452194 574783669 574105759
3111.1 574105759 572744141 571389618 570152397 569282684 568262711 567193794 566767159 565886116 564955254
3119.8 564955254 564077263 563106766 561747169 560384293 559583473 558501663 557790909 556712952 555306435
3128.4 555306435 554269180 553307076 552601814 551435356 550405731 549591217 548914642 548310165 547250748
3137.1 547250748 546444969 545640373 544498749 543172112 541901894 540658836 539766312 539162331 538272705
3145.8 538272705 537350311 536213913 535275230 534499855 533805771 533090477 532077255 531271858 529962730
3154.5 529962730 528927917 528617744 527666092 526575279 525756989 524861069 524025459 523059158 522108994
3163.1 522108994 521352539 520068932 519108200 519007835 518289337 516774902 515647583 515075684 514316101
3171.8 514316101 513433723 512479668 511804504 511342163 510870285 509937592 508327217 507859573 507180252
3180.5 507180252 506299782 506079254 504929543 504038887 503403702 502666130 501532784 500456161 500127182
3189.2 500127182 499103355 498261681 497560616 496969719 496522255 495474243 494687386 494192429 494089394
3197.9 494089394 493561211 492465477 491535683 490703506 490120773 489411392 488504944 487558479 486632423
3206.5 486632423 485846062 485565147 484840431 483662453 483355141 483194618 482767258 481658401 480765572
3215.2 480765572 480518761 480007973 479600105 478684044 477557259 476825256 476223831 475459137 474483032
3223.9 474483032 474204597 474349327 473850060 472740135 472064285 471866913 471981277 471897697 470823288
3232.6 470823288 469653854 468743935 468123932 467710495 466993332 466303978 465883522 465348740 464601784
3241.3 464601784 464074059 463987885 464192085 463557091 462600746 462377052 461709709 460704956 460107613 459948082
3250.9 459948082 459895325 459401550 458456421 457736244 457727432 457636414 457002983 456651726 456639442 455961685
3260.5 455961685 455123558 454498329 454187698 454168739 453506050 453048172 452775307 452362137 451985435 451420250
3270.2 451420250 451027451 450681190 450476837 449861145 449614906 449649582 448901062 448335152 447661285 447286148
3279.8 447286148 446950951 446636620 446892776 446456718 445627022 444999809 444956055 444988365 444500160 444016838
3289.5 444016838 443663406 443406372 443029366 442928734 442748642 442118340 441582947 441172028 440585747 440011330
3299.1 440011330 439743080 439321480 439012566 438870201 438670044 438446159 437940483 437584267 437445335 436679039
3308.8 436679039 435790253 436000557 436102943 435494118 434428291 433452415 433250999 432798424 432801819 432835312
3318.4 432835312 432294121 432091522 431512680 430796318 430387878 430364532 429984016 429193420 428503952 427852631
3328.1 427852631 427578392 426897926 426271362 426109505 426041679 425720215 425272179 425109406 424411850 423854332
3337.7 423854332 423291397 422501335 422022400 421722603 421526642 421091385 420966606 420379829 419489479 418923798
3347.3 418923798 418232002 417877464 417352257 416856003 416719170 416637764 416356621 415946007 415502319 414783211
3357 414783211 413976250 413239403 413033943 412555771 412206993 412318497 411925316 411897049 411422195 410459480
3366.6 410459480 409910164 409359131 409171715 408998947 408262634 407639885 407210960 406593323 406568871 406283417
3376.3 406283417 405302277 404850540 405165024 405409317 404593277 404152756 404309921 404049606 403270531 402481995
3385.9 402481995 402513504 402688866 402789459 402153549 401464958 401224823 400687714 400803833 400908432 401016998
3395.6 401016998 400893135 400111084 399660378 399317284 399015350 398768845 398651886 398698654 398943367 398897171
3405.2 398897171 398478546 398340302 398215294 397794304 397239113 397286758 397457314 397594414 397872047 397688866
3414.8 397688866 397431259 397187233 397273941 397554512 397531052 396975555 396444740 396462288 396686592 397272720
3424.5 397272720 397162933 396752090 396858406 396926041 397220039 397454033 397582283 397505989 397215500 397358475
3434.1 397358475 397858734 397987900 397896843 398089905 398707695 399285278 399419250 399580650 398811035 398630753
3443.8 398630753 399370575 399971008 400982704 400085449 400138130 401462212 401540413 401794167 401957054 402591858
3453.4 402591858 403254814 403514328 403632660 403564682 404053955 404541893 404671364 404411507 405196571 406172447
3463.1 406172447 406582870 407026100 406659279 406706200 407286110 408315964 409002419 409163399 409542084 409705391
3472.7 409705391 410818748 411874428 412210426 412329941 412294388 412775078 413312683 413672600 414317703
3481.4 414317703 415118179 415616760 416803932 417350731 417162514 418091965 418504066 418499641 418929176 419719582
3491 419719582 420584793 421341095 421754646 421595421 422214394 423024559 423788643 424731331 425335159 425783424
3500.7 425783424 426326370 426829147 427085152 427660103 428066826 428613968 429221687 430435371 431463127
3509.4 431463127 431047974 432220497 433291016 433809204 434897003 435522461 435919495 436223221 437114372
3518 437114372 437765541 438141327 438910408 440570831 442008553 441169815 441312180 442672958 443789406
3526.7 443789406 444346046 444848862 445504303 446235771 446866264 447074318 448166084 449258080 450606918
3535.4 450606918 451235580 451233940 452520599 452801247 453042831 453778496 455318146 456981621 457884140
3544.1 457884140 458193130 458255653 460067978 460418320 461683006 463032722 463907013 465625916 464810066
3552.7 464810066 466381912 467579155 467882271 469374580 470146027 471900177 473210373 474198189 474693871
3561.4 474693871 476683388 477490311 477570267 481988716 481909637 481461830 481892853 481586113 485235443
3570.1 485235443 486889267 488614845 490615807 491883545 492412758 493932648 496343727 496910553 499435196
3578.8 499435196 500870743 500890617 502321701 504321976 506253929 507602425 511887627 513770714 512839355
3587.5 512839355 514053726 512628441 515013275 518134537 521681747 523256874 524084740 527234344
3595.2 527234344 525915337 528285217 531338577 531825371 535158043 536136894 536460342 538157921 539887161
3603.9 539887161 542351189 546014366 548953552 548081932 550576172 548879242 549536667 558087273 558745041
3612.5 558745041 556415062 560054436 558909912 563510742 568547020 567944260 568226166 566404533 568694305
3621.2 568694305 573278847 575693436 577019653 579371376 582250328 584621048 590549736 590441437
3628.9 590441437 580673637 584978638 589515076 594670105 595578537 593435249 595832062 598938713
3636.6 598938713 601019745 601335640 602633514 604795647 607000504 607820702 608140678 610665092 614439125
3645.3 614439125 619762688 617926216 615585289 621495209 620386314 615623856 615248909 621695595
3653 621695595 626249428 629950333 633921242 626148033 628340111 633348160 634167137 634555054 635492744
3661.7 635492744 638181000 638861809 639571953 640707550 642375717 647347336 649651260 649268341 647919159
3670.4 647919159 641239853 644941101 653617706 662518845 659376755 640717010 645498123 653445511
3678.1 653445511 658244019 655711288 655432205 658588715 660776443 662460709 662987061 663955536 668497620
3686.8 668497620 673291092 662472763 661001205 669789810 663946228 664221573 669301910 670185928
3694.5 670185928 672096786 672056503 672118073 674056473 674454956 676791992 679455948 674128571 673027649
3703.2 673027649 677977219 678906174 679303131 680366669 682995300 686365051 679524307 683418579 685031357
3711.9 685031357 671782150 677565536 682686691 684153824 685362091 687582321 687662582 683833694
3719.6 683833694 686118393 692310333 688996353 684559021 688961487 688890381 688633575 686852188 687201385
3728.3 687201385 692182159 694431534 698732681 694391785 689565048 698467407 696546631 686501617
3736 686501617 686727371 689790344 691443939 694757767 697744370 694867630 699676056 710873032 698663559
3744.7 698663559 684547958 694611282 700721130 707401733 702984467 693286438 705301743 698502884
3752.4 698502884 692386856 698072815 702024918 704676285 698980942 701568527 705987396 698017731
3760.1 698017731 698267899 702931900 704820938 705621796 708250656 704827347 700809708 705105209 711109695
3768.8 711109695 710702515 700695953 702273636 705132065 706254959 707659225 707566528 708423386 708724289
3777.4 708724289 711648254 711291428 704123688 706696167 708944244 710326691 712396927 709956055
3785.2 709956055 709177704 710035934 710423355 711254425 711488113 711606903 711969528 713076859 713435516
3793.8 713435516 714681091 717654648 713448486 708792343 712090759 717284546 721782074 712635269
3801.5 712635269 702554245 707901611 712934418 718435898 722891769 711975327 709255905 714992371
3809.3 714992371 716821060 717153244 717623291 717867737 719408493 723268280 718879089 708194656 715475082
3817.9 715475082 720850372 723468857 722956696 706724167 711008453 717622604 720151978 722205124
3825.7 722205124 720984192 716805344 717649536 720017395 723495789 724369965 716692429 720396271 726751175
3834.3 726751175 720731506 720634613 727457581 718493958 715724716 723559113 717880859 718289490 724637909
3843 724637909 721074677 717821503 720768509 721993179 722712784 725501556 725056534 727157974 732430496
3851.7 732430496 725219269 725344620 710657043 713469391 723424454 723071365 723027115 724836197 726693954
3860.4 726693954 729041595 723103256 723825302 730451584 722813950 718371124 723871613 729224777
3868.1 729224777 733386383 723915939 718633423 723644562 729185333 731065674 720696793 722520828
3875.8 722520828 726423416 726510773 729329605 733123474 726905594 721095963 726536865 727431183 729736862
3884.5 729736862 733021011 720796127 723690872 727645340 729147491 733636703 730923309 723218994
3892.2 723218994 726512680 729066391 727261276 728991013 730226059 732796402 734265823 725608292
3899.9 725608292 730480728 732039108 728187027 731754608 726551971 725049438 726790771 727971649
3907.6 727971649 729514389 729092331 729043732 729163055 729693451 730122910 730432053 731962051 733431549
3916.3 733431549 729343414 727159729 732305527 731508484 727435303 729789505 731755753 732838058
3924 732838058 729603882 726771088 729332809 731279221 732091522 730253296 730210342 732888031 730786591
3932.7 730786591 729585114 731283951 732295685 732557755 732312622 731711197 731082153 730712738 731854172
3941.4 731854172 733032608 729751892 729566422 731456070 732374573 733398361 731502686 732755585 732926712
3950.1 732926712 730602798 732817688 733045502 732095261 731951828 732143631 732687988 732160645 732248306
3958.7 732248306 732169876 733145065 733532257 732275925 732969360 734083023 734160385 733458557 732646255 732904587
3968.4 732904587 733651733 733507385 733919144 733879776 733261795 733872147 733507309 733020248 733174438 733675842
3978 733675842 733943558 733438950 733651047 733965836 733956146 733866425 734341660 734060287 733352966 733880386
3987.7 733880386 734098434 733975830 733701172 734186249 734692993 735221176 735956116 735385895 734933090 734272308
3997.3 734272308 734453278 735168610 734730072
4000.2 734730072
##END=$$ End of the data block
