##TITLE=$$ Begin of the data block
##JCAMP-DX=5.00 $$ ACD/SpecManager v 10.08
##SPECTROMETER/DATA SYSTEM=Varian
##DATE=20 Nov 2012 15:13:52
##DATA TYPE=INFRARED SPECTRUM
##DATA CLASS=XYDATA
##ORIGIN=
##OWNER=
##NPOINTS=3735
##FIRSTX=399.26403809
##LASTX=4000.35498047
##MAXX=4000.35498047
##MINX=399.26403809
##MAXY=80.59371185
##MINY=35.72092438
##XFACTOR=1.0000000000
##YFACTOR=0.000000100000000
##FIRSTY=61.00227737
##DELTAX=0.96440572
##XUNITS=1/CM
##YUNITS=TRANSMITTANCE
##XYDATA=(X++(Y..Y))
$$ plain form
399.3 610022774 604055328 599633560 596936684 611354942 611284447 605026627 605867958 597839661 598288536
407.9 598288536 598029671 596161690 599307327 596318588 591867981 594466934 599553490 598149376 598598289
416.6 598598289 598591156 587047729 584724960 598721352 602368088 595333023 595216599 602543373 607673874
425.3 607673874 606836128 599521179 593851814 593895111 598996353 595972672 588638496 587208481 587614021
434 587614021 593292007 597569084 589901009 585193176 589282265 593201218 596693840 595332222 594529076
442.7 594529076 598633080 599134865 600999832 599257126 597679062 599410286 602566528 605770874 603532791
451.3 603532791 603683548 602166100 602721481 608068886 607825661 601464577 597968330 605391998 609872665
460 609872665 611380043 606373482 602772102 603919067 602664337 604198685 602965508 599886551 599499969
$$ packed form
399.3F10022774n967446m421768k696876J4418258p0495o257820Q41331q028297M48875
407.9E98288536k58865j867981L145637k988739m450607K598953N086556j404114M48913
416.6E98598289p133j1543427k322769J3996392L646736p035065j16424P326774N130501
425.3F07673874q37746p314949n669365M3297N101242l023681p334176j430015M05540
434E87614021N677986M277077p668075m707833M089089L918953L492622j361618q03146
442.7E94529076M104004N01785J864967j742706j578064J731224L156242L204346k238083
451.3F03532791J50757j517448N55381N347405k43225o361084l496247P423668M480667
460F09872665J507378n006561l601380J146965j254730J534348j233177l078957l86582
$$ plain form
468.7 599499969 596132164 590783463 589208832 590618134 583429756 581446686 584296761 586018906
476.4 586018906 585498772 587689209 590431595 588590469 587449760 584727936 583030701 578301353 573566742
485.1 573566742 575473061 578306465 581170692 578116951 577091064 580412025 583871078 586404991
492.8 586404991 583884697 582917061 584344940 585617142 583735809 580647392 578013649 576778488 577389679
501.5 577389679 570903130 566641617 567198334 568744850 567979431 566509209 567805252 568171272 568622589
510.2 568622589 564354858 560890656 560096321 558611908 558197556 556720886 555210152 551859627 550667686
518.9 550667686 549355049 548840561 550148201 549208260 550353127 551764870 549997063 546077271 546080360
527.5 546080360 545580406 542842598 541876564 540680275 541013107 541159973 544206009 548607597 548685188
$$ packed form
468.7E99499969l367805n348701j574631J409302p188378j983070K850075J722145
476.4E86018906n20134K190437K742386j841126j140709k721824j697235m729348m734611
485.1E73566742J906319K833404K864227l053741j025887L320961L459053K533913
492.8E86404991k520294r67636J427879J272202j881333l088417k633743j235161O11191
501.5E77389679o486549m261513N56717J546516p65419j470222J296043L66020M51317
510.2E68622589m267731l464202p94335j484413m14352j476670j510734l350525j191941
518.9E50667686j312637n14488J307640r39941J144867J411743j767807l919792L089
527.5E46080360m99954k737808r66034j196289L32832J46866L046036M401588P7591
$$ plain form
536.2 548685188 547922630 549414825 552659569 555064354 558657951 560442429 557906456 557114754 561355209
544.9 561355209 564984207 563241959 563145370 563676186 563095589 562562981 561832542 562309875 561324043 561688957
554.5 561688957 562193184 560312843 557432098 554632416 553795319 550421028 546905060 547211494 547281418
563.2 547281418 544483337 542512741 540615044 537271080 536212807 535406570 534415970 531612549 529433022
571.9 529433022 528801651 526949844 525556564 524483299 525339928 525862770 527515678 529430580 532675247
580.6 532675247 536775169 537367554 539577255 541926689 544437714 546988754 549475098 552329216 554244194
589.3 554244194 555712204 554591942 555195885 556265068 556801300 558491325 558853607 559563103 558821640
597.9 558821640 558530922 558511925 557852325 558683586 559324875 559744301 559350090 558992043 557997856 557644997
$$ packed form
536.2E48685188p62558J492195L244744K404785L593597J784478k535973p91702M240455
544.9E61355209L628998j742248r6589N30816n80597n32608p30439M77333r85832L64914
554.5E61688957N04227j880341k880745k799682q37097l374291l515968L06434O9924
563.2E47281418k798081j970596j897697l343964j058273q06237r90600k803421k179527
571.9E29433022o31371j851807j393280j073265Q56629N22842J652908J914902L244667
580.6E32675247M099922N92385K209701K349434K511025K551040K486344K854118J914978
589.3E54244194J468010j120262O03943J069183N36232J690025L62282P09496p41463
597.9E58821640k90718j8997o59600Q31261O41289M19426l94211l58047r94187l52859
$$ plain form
607.6 557644997 558003426 557718010 558333244 558673401 559604034 559724693 559966202 561538963 562701607
616.3 562701607 563843269 564546585 566212921 567905884 568612061 569032364 570075188 572024422 573486366
624.9 573486366 574294777 575207672 576271172 576453552 578284264 581375427 582572708 583281059 584441261
633.6 584441261 585888214 586298714 586146469 586301804 585788841 585307846 585808678 586974411 587983894
642.3 587983894 589331436 590134697 590379066 590592842 591840744 594597855 595863724 596225739 596073112
651 596073112 595650368 596403770 597121544 597485123 597799149 597963257 597311974 597207069 598164711 599268990
660.6 599268990 600826225 601810760 602031288 601472931 601864052 603483009 601429939 593564377 599725761
669.3 599725761 602140579 601759033 602520905 603704948 604239311 605006218 606571045 609221268 610601616
$$ packed form
607.6E57644997L58429k85416O15234L40157R30633J20659K41509J572761J162644
616.3E62701607J141662P03316J666336J692963P06177M20303J042824J949234J461944
624.9E73486366Q08411R12895J063500J82380J830712L091163J197281P08351J160202
633.6E84441261J446953M10500j52245J55335n12963m80995N00832J165733J009483
642.3E87983894J347542Q03261K44369K13776J247902K757111J265869L62015j52627
651E96073112m22744P53402P17774L63579L14026J64108o51283j04905R57642J104279
660.6E99268990J557235R84535K20528n58357L91121J618957k053070p865562O161384
669.3E99725761K414818l81546P61872J184043N34363P66907J564827K650223J380348
$$ plain form
678 610601616 610959358 612114754 612714424 612540016 612228355 611730423 611744041 612314339 612204971 612269020
687.6 612269020 613585701 614391289 614586678 615119133 614779968 614641457 615415039 615263901 614209290
696.3 614209290 612300262 610501976 609699211 608972588 607419434 605247002 604234848 603639069 603853416
705 603853416 605193100 605485878 605275345 605419312 605473213 604526062 604990578 605785789 604765472 605085831
714.6 605085831 606538239 609557381 613018417 615328293 617189560 619261856 622633362 624899635
722.3 624899635 626664925 629651222 632261810 632999077 633662491 635546417 636880722 638795967 639928169
731 639928169 640734253 643520889 645871964 647588120 647404480 647423019 649749756 651598206 653480225
739.7 653480225 654018936 653116608 651409760 649734497 650309372 650839691 650800629 649873123 648726959
$$ packed form
678F10601616L57742J155396N99670j74408l11661m97932J3618N70298j09368O4049
687.6F12269020J316681Q05588J95389N32455l39165j38511P73582j51138j054611
696.3F14209290j909028j798286q02765p26623j553154k172432j012154n95779K14347
705F03853416J339684K92778k10533J43967N3901r47151M64516P95211j020317L20359
714.6F05085831J452408L019142L461036K309876J861267K072296L371506K266273
722.3F24899635J765290K986297K610588P37267O63414J883926J334305J915245J132202
731F39928169Q06084K786636K351075J716156j83640J8539K326737J848450J882019
739.7F53480225N38711r02328j706848j675263N74875N30319l9062r27506j146164
$$ plain form
748.4 648726959 648926010 649083862 648471909 646511002 644480362 642830658 640872498 639045067 636926041
757.1 636926041 633832359 631287231 630868874 629935036 627890091 627012482 626691818 626609039 627011414
765.7 627011414 627278748 628253288 629284477 629809532 631315804 633056221 634514389 636521416 639452744
774.4 639452744 642629471 645249023 648865356 652154007 654258423 657823105 660953751 663301239
782.1 663301239 665480804 666973801 668991776 671262817 673576965 674783173 676463623 679284973
789.9 679284973 680937729 682453537 684107513 685602646 686971054 687883835 688526535 689165649 690098343
798.5 690098343 692172318 694204636 695126266 695813980 696721649 699203262 700895996 701243896 701744614
807.2 701744614 701708908 702382584 702851639 702742767 702005768 701382141 701260376 701316757 701925507 701777878
$$ packed form
748.4F48726959J99051J57852o11953j960907k030640j649704j958160j827431k119026
757.1F36926041l093682k545128m18357r33838k044945q77609l20664q2779M02375
765.7F27011414K67334R74540J031189N25055J506272J740417J458168K007027K931328
774.4F39452744L176727K619552L616333L288651K104416L564682L130646K347488
782.1F63301239K179565J492997K017975K271041K314148J206208J680450K821350
789.9F79284973J652756J515808J653976J495133J368408R12781O42700O39114R32694
798.5F90098343K073975K032318R21630O87714R07669K481613J692734L47900N00718
807.2G01744614l5706O73676M69055j08872p36999o23627j21765N6381O08750j47629
$$ plain form
816.9 701777878 701789169 701783218 702371597 703162537 703096161 703228226 702765961 701953354 699720688 697709427
826.5 697709427 697082748 696808090 696634293 695578613 695003128 693770218 691613998 689978561 688929367
835.2 688929367 687351456 684754868 682686920 680942078 679645309 677814789 675769653 674552689
842.9 674552689 674231339 674201355 672525406 671564407 671535110 671219406 670012741 667290192 665921249
851.6 665921249 665245209 663717270 661326675 659210281 657785034 655262680 653262482 652167206 651152496
860.3 651152496 651017838 651588898 653358307 656417160 659890442 662422943 665052795 668818207 672209930
868.9 672209930 675035095 678171005 681956253 685897827 689732056 692850113 695120239 697541199
876.7 697541199 700253143 701516953 702182770 702804184 701828537 700126114 697885208 695763779 693280487
$$ packed form
816.9G01777878J1291n951N88379P90940o6376J32065m62265q12607k232666k011261
826.5F97709427o26679k74658j73797j055680n75485j232910k156220j635437j049194
835.2F88929367j577911k596588k067948j744842j296769j830520k045136j216964
842.9F74552689l21350k9984j675949r60999k9297l15704j206665k722549j368943
851.6F65921249o76040j527939k390595k116394j425247k522354k000198j095276j014710
860.3F51152496j34658N71060J769409L058853L473282K532501K629852L765412L391723
868.9F72209930K825165L135910L785248L941574L834229L118057K270126K420960
876.7F97541199K711944J263810O65817O21414r75647j702423k240906k121429k483292
$$ plain form
885.3 693280487 691009903 689675980 687509689 685102844 682518463 679904175 678597336 677564392
893 677564392 675356598 672916489 670546951 668325882 666264801 663662491 662037125 660960464 659219589
901.7 659219589 657891464 656731186 654523010 652111816 650305481 648033752 645618744 643139420
909.4 643139420 640060654 636313553 632073326 628185959 624703484 620466919 615949440 613098602
917.2 613098602 610176010 607165260 605720291 604337616 602368660 600703506 599385300 598032455
924.9 598032455 597501411 597549477 596823196 595744209 595855675 596813087 597727013 598446007 599426651 601086998
934.5 601086998 601964874 603013687 604589348 605607796 607095718 608621635 610220032 611964798 613232994
943.2 613232994 614487991 615296631 615904236 616238632 614359627 610772133 607201881 603692665 599780350
$$ packed form
885.3F93280487k270584j333923k166291k406845k584381k614288j306839j032944
893F77564392k207794k440109k369538k221069k061081k602310j625366j076661j740875
901.7F59219589j328125j160278k208176k411194j806335k271729k415008k479324
909.4F43139420l078766l747101m240227l887367l482475m236565m517479k850838
917.2F13098602k922592l010750j444969j382675j968956j665154j318206j352845
924.9E98032455n31044M8066p26281j078987J11466R57412R13926P18994R80644J660347
934.5F01086998Q77876J048813J575661J018448J487922J525917J598397J744766J268196
943.2F13232994J254997Q08640O07605L34396j879005l587494l570252l509216l912315
$$ plain form
951.9 599780350 595431557 590887566 585511627 579008560 573110428 567631416 562229538 556415100
959.6 556415100 549611511 542904930 536027946 529474945 522052383 515033188 509050865 501979713
967.3 501979713 494296608 486250381 478982124 470845032 462944336 455193863 446767349 438696098
975 438696098 430532341 423837051 415332909 407525597 401582718 395580101 389488449 382809334 378480072
983.7 378480072 374471474 371472740 368591652 366444778 364548225 362276649 361788712 359708519 358852348
992.4 358852348 358226089 358152466 358412971 358088150 358727646 358198242 359208527 359637909 359929237 359926682
1002 359926682 359979553 361041832 361230316 362103920 361304054 361472702 360745888 359381676 359084358 358114662
1011.7 358114662 358184357 357209244 358054314 357958031 357633553 358489723 358523445 359295807 359516220 361681747
$$ packed form
951.9E99780350m348793m543991n375939o503067n898132n479012n401878n814438
959.6E56415100o803589o706581o876984o553001p422562p019195n982323p071152
967.3E01979713p683105q046227p268257q137092p900696p750473q426514q071251
975D38696098q163757o695290q504142p807312n942879o002617o091652o679115m329262
983.7C78480072m008598k998734k881088k146874j896553k271576m87937k080193q56171
992.4C58852348o26259p3623K60505l24821O39496n29404J010285M29382K91328k555
1002C59926682N2871J062279J88484Q73604p99866J68648p26814j364212k97318r69696
1011.7C58114662O9695r75113Q45070r6283l24478Q56170L3722P72362K20413K165527
$$ plain form
1021.3 361681747 362596016 363308029 364181366 365219193 367282562 367561951 369229698 370206909 372251511
1030 372251511 374075241 375333862 376960564 377442741 379555740 380030785 381299019 382128639 381940422
1038.7 381940422 382020035 381804085 382345238 381214142 381536140 382007561 383337135 383606987 383081398
1047.4 383081398 384132843 384141998 385951767 386105843 387285118 389284821 391498680 394309959 395618362
1056 395618362 399175262 401628876 405022507 408143539 411524353 416114388 420411682 425764503 428565445
1064.7 428565445 431732101 434248390 436675224 437961655 437351570 435477562 430191650 426551285
1072.4 426551285 421317749 416617508 413812637 411348534 410018501 408476334 409295502 408297653 408820801
1081.1 408820801 409498253 409848061 411306152 412227364 415043716 416177597 419226990 421327171 423453178
$$ packed form
1021.3C61681747R14269P12013Q73337J037827K063369K79389J667747R77211K044602
1030C72251511J823730J258621J626702M82177K112999M75045J268234Q29620j88217
1038.7C81940422P9613k15950N41153j131096L21998M71421J329574K69852n25589
1047.4C83081398J051445R155J809769J54076J179275J999703K213859K811279J308403
1056C95618362L556900K453614L393631L121032L380814M590035M297294N352821K800942
1064.7D28565445L166656K516289K426834J286431o10085j874008n285912l640365
1072.4D26551285n233536m700241k804871k464103j330033j542167Q19168r97849N23148
1081.1D08820801O77452L49808J458091R21212K816352J133881L049393K100181K126007
$$ plain form
1089.8 423453178 427076263 429181824 432948227 435563278 438091278 439664001 442042198 443866158
1097.5 443866158 443823814 444458427 444069519 445259514 446062851 446175308 444512825 444846497 448000183
1106.2 448000183 448887558 450369759 451018028 453219261 455481339 456928368 458816757 460505943 462573929
1114.9 462573929 463380966 465962067 467637787 469066582 470076027 470871964 473586693 474483147 475810051
1123.5 475810051 476260948 477488861 479358521 480619431 482138634 482471542 484424515 486459007 489517937
1132.2 489517937 491709824 492488289 493153572 492804184 493754501 493875618 493756332 492037544 489410286
1140.9 489410286 486914291 484086456 482021523 478025017 475082092 472111816 469084206 466218605
1148.6 466218605 463235970 461927147 460252991 459630775 457349434 456066475 456459961 456315269 456125984
$$ packed form
1089.8D23453178L623085K105561L766403K615051K528000J572723K378197J823960
1097.5D43866158m2344O34613l88908J189995Q03337J12457j662483L33672L153686
1106.2D48000183Q87375J482201O48269K201233K262078J447029J888389J689186K067986
1114.9D62573929Q07037K581101J675720J428795J009445P95937K714729Q96454J326904
1123.5D75810051M50897J227913J869660J260910J519203L32908J952973K034492L058930
1132.2D89517937K191887P78465O65283l49388R50317J21117j19286j718788k627258
1140.9D89410286k495995k827835k064933l996506k942925k970276l027610k865601
1148.6D66218605k982635j308823j674156o22216k281341j282959L93486j44692j89285
$$ plain form
1157.3 456125984 455154190 455692406 455525055 456407585 457789879 459655876 462019958 463830605 467423363
1166 467423363 470938187 475940018 480271416 484643478 489909554 494982491 501312714 507437401 513570213
1174.6 513570213 518082962 523078995 529006042 534618301 540087547 545166283 550886383 555693130
1182.4 555693130 560647507 565661545 570333824 574664955 578169479 581914177 585078773 587670364
1190.1 587670364 590116272 592576904 594365883 595497932 596325798 596798401 597911568 598451347 598727493
1198.8 598727493 599549294 600354118 601373405 602174225 602741394 603176231 604088783 605071487 605654793
1207.4 605654793 606159782 606750565 608118095 609714432 611358223 613185921 615052376 616750412 618174515
1216.1 618174515 619968529 622036400 623488541 624437523 625523491 626017380 625234604 624635201 624758835
$$ packed form
1157.3D56125984r71794N38216j67351Q82530J382294J865997K364082J810647L592758
1166D67423363L514824N001831M331398M372062N266076N072937O330223O124687O132812
1174.6E13570213M512749M996033N927047N612259N469246N078736N720100M806747
1182.4E55693130M954377N014038M672279M331131L504524L744698L164596K591591
1190.1E87670364K445908K460632J788979J132049Q27866M72603J113167N39779K76146
1198.8E98727493Q21801Q04824J019287Q00820N67169M34837R12552R82704N83306
1207.4F05654793N04989N90783J367530J596337J643791J827698J866455J698036J424103
1216.1F18174515J794014K067871J452141R48982J085968M93889p82776n99403J23634
$$ plain form
1224.8 624758835 624056053 623041725 622374802 621616364 621417503 621218834 620610695 620309563 619801674
1233.5 619801674 619396248 619241257 618295135 616749611 615845032 615588074 614843407 613821144 612924042
1242.2 612924042 612430038 612609787 613321304 614201965 614982224 615895042 616367760 616858711 617898369
1250.8 617898369 618602219 618944740 619293289 619344826 619182243 619338150 619673958 620101128 620781593 621544189
1260.5 621544189 622175407 622826653 623600998 624460526 625722466 626718979 627057762 627557449 628281174
1269.2 628281174 628864517 629262199 629352455 629764366 630379601 630812912 631568336 632062416 632807617 633989716
1278.8 633989716 634606323 634935722 634715996 633976364 633099251 632294006 631747017 631197433 630495605 630269318
1288.4 630269318 630453529 630702095 630918961 630949097 631517715 631726189 630968895 630000877 628940201 628199654
$$ packed form
1224.8F24758835p02782j014328o66923p58438j98861j98669o08139l01132n07889
1233.5F19801674m05426j54991r46122j545524r04579k56958p44667j022263q97102
1242.2F12924042m94004J79749P11517Q80661P80259R12818M72718M90951J039658
1250.8F17898369P03850L42521L48549N1537j62583J55907L35808M27170O80465P62596
1260.5F21544189O31218O51246P74345Q59528J261940R96513L38783M99687P23725
1269.2F28281174N83343L97682R0256M11911O15235M33311P55424M94080P45201J182099
1278.8F33989716O16607L29399k19726p39632q77113q05245n46989n49584p01828k26287
1288.4F30269318J84211K48566K16866L0136N68618K08474p57294r68018j060676p40547
$$ plain form
1298.1 628199654 627007103 625670929 624522324 623003502 621367874 619911232 619228897 619012222 618673668
1306.8 618673668 618090897 617327385 616845436 616242676 615300980 614312630 613356094 612345200 611406975
1315.4 611406975 610708923 609812393 608766785 608013535 607783699 607791977 607342529 607068176 607098961 606441078
1325.1 606441078 605068016 603301430 601620483 599856110 597363815 594536247 592070580 590119019
1332.8 590119019 588696899 587438889 585872421 585333672 584993935 584625015 584617538 584430199 585324097
1341.5 585324097 585653381 585480194 585342903 585340576 585221939 584753380 584570465 584396019 584336739 584196281
1351.1 584196281 584451408 584745026 584763145 584835434 584873962 585264091 585029449 584249039 583277321 582159843
1360.8 582159843 581204033 580269012 579364510 578985023 579362183 579395065 579416618 579092865 579052925 580027084
$$ packed form
1298.1F28199654j192551j336174j148605j518822j635628j456642o82335k16675l38554
1306.8F18673668n82771p63512m81949o02760r41696r88350r56536j010894r38225
1315.4F11406975o98052q96530j045608p53250k29836Q278m49448k74353L0785o57883
1325.1F06441078j373062j766586j680947j764373k492295k827568k465667j951561
1332.8E90119019j422120j258010j566468n38749l39737l68920p477j87339Q93898
1341.5E85324097L29284j73187j37291k327j18637m68559j82915j74446n9280j40458
1351.1E84196281K55127K93618J8119P2289L8528L90129k34642p80410r71718j117478
1360.8E82159843r55810r35021r04502l79487L77160L2882K1553l23753l9940R74159
$$ plain form
1370.4 580027084 580515480 581333046 581166534 580705872 580997658 581232224 581572113 581257057 581841583 582490082
1380.1 582490082 583317299 583930779 584486580 585560570 586597099 588466949 589918938 591407280 592583084
1388.7 592583084 593796806 594765167 595347672 596064224 596069603 595377502 594345894 595399246 596087875
1397.4 596087875 595726089 594606133 594288826 595426216 595380974 595109901 594335747 592631531 591840820
1406.1 591840820 591029434 590086594 588968620 588572693 587567787 586481056 585931587 585299263 585185776
1414.8 585185776 584704781 584302063 583820000 583698044 579988785 579729958 581635780 581689873 581610565 580164032
1424.4 580164032 580382957 580774727 580524750 581548309 581891899 582480736 582979393 584648132 585210609
1433.1 585210609 585153580 586833458 587258568 585826645 585813980 588037910 589157486 589925537 590852394
$$ packed form
1370.4E80027084M88396Q17566j66512m60662K91786K34566L39889l15056N84526O48499
1380.1E82490082Q27217O13480N55801J073990J036529J869850J451989J488342J175804
1388.7E92583084J213722R68361N82505P16552N379o92101j031608J053352O88629
1397.4E96087875l61786j119956l17307J137390m5242k71073p74154j704216p90711
1406.1E91840820q11386r42840j117974l95927j004906j086731n49469o32324j13487
1414.8E85185776m80995m02718m82063j21956l709259k58827J905822N4093p9308j446533
1424.4E80164032K18925L91770k49977J023559L43590N88837M98657J668739N62477
1433.1E85210609n7029J679878M25110j431923j2665K223930J119576P68051R26857
$$ plain form
1441.8 590852394 591032028 592377167 592790642 593957329 595254898 596431198 595925827 595288696 596340065
1450.5 596340065 595885811 595518723 594611092 594829674 595191307 594308624 591770287 588809814 592065735
1459.1 592065735 592293625 594369392 595460587 596239357 597849693 596800842 599254265 601147194 604204063
1467.8 604204063 605903168 608154869 611288719 612863579 617573433 619360275 624977455 628282166
1475.5 628282166 631582489 635403633 638808479 642856293 645291138 648702545 650505066 653229294
1483.2 653229294 655717621 657864075 660653915 661501083 664389496 665471344 666102982 667462006 670986099
1491.9 670986099 674480820 676337204 679437332 680613632 680007782 682254105 684299088 684552307 686066208
1500.6 686066208 687826080 688108521 689916534 691001434 692060852 690015335 688345413 691885300
$$ packed form
1441.8E90852394J79634J345139M13475J166687J297569J176300n05371o37131J051369
1450.5E96340065m54254l67088r07631K18582L61633q82683k538337k960473L255921
1459.1E92065735K27890K075767J091195P78770J610336j048851K453423J892929L056869
1467.8F04204063J699105K251701L133850J574860M709854J786842N617180L304711
1475.5F28282166L300323L821144L404846M047814K434845L411407J802521K724228
1483.2F53229294K488327K146454K789840Q47168K888413J081848O31638J359024L524093
1491.9F70986099L494721J856384L100128J176300o05850K246323K044983K53219J513901
1500.6F86066208J759872K82441J808013J084900J059418k045517j669922L539887
$$ plain form
1508.3 691885300 692206497 695805969 698319702 699787216 700054092 701484680 702241745 701574707 701740265
1517 701740265 699317169 702751617 704828796 703528900 702261581 703345642 707779236 708984909 708664017
1525.7 708664017 709374313 710531540 710390625 710955276 712823868 712834854 712765350 710522537 708807220
1534.3 708807220 710666962 711676865 713530045 715068665 711576462 703763351 710466537 712911453
1542.1 712911453 713138885 716602783 716381912 713496933 714162216 714724960 714507751 712410126 710275879
1550.7 710275879 711666107 713441238 714531021 713246918 713936920 717725143 721245041 715241241
1558.5 715241241 706870346 705554581 709130020 709860382 708880844 707438736 704670258 704488831 705349808
1567.1 705349808 706097260 706600571 702382889 702621307 703818665 703721008 703372116 703767166 703160858
$$ packed form
1508.3F91885300L21197L599472K513733J467514K66876J430588P57065o67038J65558
1517G01740265k423096L434448K077179j299896j267319J084061M433594J205673l20892
1525.7G08664017P10296J157227j40915N64651J868592J0986o9504k242813j715317
1534.3G08807220J859742J009903J853180J538620l492203p813111O703186K444916
1542.1G12911453K27432L463898k20871k884979O65283N62744k17209k097625k134247
1550.7G10275879J390228J775131J089783j284103O90002L788223L519898o003800
1558.5G15241241q370895j315765L575439P30362r79538j442108k768478j81427Q60977
1567.1G05349808P47452N03311m217682K38418J197358r7657l48892L95050o06308
$$ plain form
1575.8 703160858 695241470 695485992 695328217 693964920 692953720 691967163 691656418 690948563 691168289
1584.5 691168289 691173477 690379791 689584579 688674469 687981339 686620941 685577469 683631439 682235947
1593.2 682235947 681102905 679101791 677807617 676399536 676086349 675414581 675284424 675056610 674128876
1601.9 674128876 673460617 671571121 670127182 668283386 666483154 664002457 661825867 659488297
1609.6 659488297 656929932 656292648 654616165 653617554 652474213 652361679 651062622 644378738 646363602
1618.2 646363602 646548996 645748062 643802185 642970963 641380692 636698952 636535950 636193314 636364784
1626.9 636364784 634008636 633686867 634745522 634889526 635059090 634715271 636054955 637155991 631328506
1635.6 631328506 629588089 631745415 631868362 632035065 632340126 632216187 633718414 634003220 635494919
$$ packed form
1575.8G03160858p919388K44522j57775j363297j011200r86557l10745p07855K19726
1584.5F91168289N188p93686p95212r10110o93130j360398j043472j946030j395492
1593.2F82235947j133042k001114j294174j408081l13187o71768j30157k27814r27734
1601.9F74128876o68259j889496j443939j843796j800232k480697k176590k337570
1609.6F59488297k558365o37284j676483r98611j143341j12534j299057o683884J984864
1618.2F46363602J85394q00934j945877q31222j590271m681740j63002l42636J71470
1626.9F36364784k356148l21769J058655J44004J69564l43819J339684J101036n827485
1635.6F31328506j740417K157326J22947J66703L05061j23939J502227K84806J491699
$$ plain form
1644.3 635494919 637039185 636048775 637426872 637358742 639552307 641790466 645095215 648439484 645332336
1653 645332336 638860397 642979813 647142181 649586945 651607895 653390198 655297699 657045364 659335175
1661.6 659335175 661013489 660911560 663582535 666063843 668086090 670247803 672442322 671538010 672270889
1670.3 672270889 675284348 676939774 679803925 682849808 683727875 683350754 686647263 690017624 692844315
1679 692844315 695293274 695672531 698177032 701761475 702176132 696285172 700421982 705025635 707733459
1687.7 707733459 708990097 710665894 712130280 714328918 717231903 719489975 722141113 723134842
1695.4 723134842 718885803 722127609 725979309 731195755 730144882 723249283 728395767 731412735
1703.1 731412735 732717743 732441254 733214798 733188171 734945221 737153778 737743912 738011475 738871613
$$ packed form
1644.3F35494919J544266r90410J378097o8130K193565K238159L304749L344269l107148
1653F45332336o471939M119416M162368K444764K020950J782303J907501J747665K289811
1661.6F59335175J678314j01929K670975K481308K022247K161713K194519r04312P32879
1670.3F72270889L013459J655426K864151L045883Q78067l77121L296509L370361K826691
1679F92844315K448959L79257K504501L584443M14657n890960M136810M603653K707824
1687.7G07733459J256638J675797J464386K198638K902985K258072K651138R93729
1695.4G23134842m249039L241806L851700N216446j050873o895599N146484L016968
1703.1G31412735J305008k76489P73544k6627J757050K208557N90134K67563Q60138
$$ plain form
1711.8 738871613 740015869 741108093 740844040 739188232 740904007 742099991 737540970 739477386
1719.5 739477386 741199722 742277985 742703857 742741928 743239059 744045105 744822693 745183258 745968552
1728.2 745968552 747180023 746274414 744880600 746645584 748031616 744054718 740826111 743874435
1735.9 743874435 746192398 746990128 748479156 748470764 747382812 750156097 751996155 751458969 751609192
1744.6 751609192 753379364 754808807 755304413 754203568 753224030 755609360 755642319 755879898 758489990
1753.3 758489990 760058136 761899948 763774567 763375168 764254532 766388626 767673492 769359589 768453445
1761.9 768453445 767556992 769173965 769776306 770369492 771433411 771974258 770773926 773137283 776601028
1770.6 776601028 776879349 775013504 774657288 777779617 778815765 777632523 778651810 778819580 779079666
$$ packed form
1711.8G38871613J144256J092224k64053j655808J715775J195984m559021J936416
1719.5G39477386J722336J078263M25872L8071M97131Q06046P77588L60565P85294
1728.2G45968552J211471r05609j393814J764984J386032l976898l228607L048324
1735.9G43874435K317963P97730J489028q392j087952K773285J840058n37186J50223
1744.6G51609192J770172J429443M95606j100845r79538K385330L2959K37579K610092
1753.3G58489990J568146J841812J874619l99399Q79364K134094J284866J686097r06144
1761.9G68453445q96453J616973O02341N93186J063919N40847j200332K363357L463745
1770.6G76601028K78321j865845l56216L122329J036148j183242J019287J67770K60086
$$ plain form
1779.3 779079666 778588943 777558594 777859192 778994064 780324554 780357056 781105423 782391510 783308487
1788 783308487 783800583 784685440 784875717 784624710 782925720 781557846 783124466 782822800 782254639
1796.7 782254639 783489532 784709015 784881210 784645996 786320953 786427765 787069626 788219528 788385925
1805.3 788385925 788506775 788014221 787615585 787399063 787497711 786455994 786322708 786951675 787323990 788734436
1815 788734436 789434586 790028229 790177078 790862656 791832809 791368256 791230545 790584717 790642319 790452728
1824.6 790452728 787732849 787760849 789682312 791328125 790699463 788569870 790251770 792886353 793765945
1833.3 793765945 793833313 793892365 793758469 793133545 792172318 792276535 791749802 791668396 791491470 791749954
1842.9 791749954 791920471 789289017 791696854 793818893 794385071 794588623 794919128 795217056 794177246
$$ packed form
1779.3G79079666m90723j030349L00598J134872J330490L2502P48367J286087R16977
1788G83308487M92096Q84857J90277k51007j698990j367874J566620l01666n68161
1796.7G82254639J234893J219483J72195k35214J674957J06812O41861J149902J66397
1805.3G88385925J20850m92554l98636k16522R8648j041717j33286O28967L72315J410446
1815G88734436P00150N93643J48849O85578R70153m64553j37711o45828N7602j89591
1824.6G90452728k719879K8000J921463J645813o28662k129593J681900K634583Q79592
1833.3G93765945O7368N9052j33896o24924r61227J04217n26733q1406j76926K58484
1842.9G91749954J70517k631454K407837K122039N66178K03552L30505K97928j039810
$$ plain form
1851.6 794177246 793738632 793631363 793680801 793403091 792909698 792984238 792749939 792947159 793646622 794856873
1861.3 794856873 795159454 795203323 795386505 795376968 795697250 795143280 795313644 793854141 791587448 791940384
1870.9 791940384 792917633 793753967 793613129 794245834 795360794 796131897 796455841 796532364 796618271 796411514
1880.6 796411514 796291122 795840988 795925217 795451584 794910278 795005264 794902191 795962753 796109314 794856873
1890.2 794856873 795521469 796968002 797598267 798046875 797722931 796235504 796208115 796216965 796426163 796543503
1899.8 796543503 796253815 796268845 796178131 796576538 796697845 797210083 797693329 797839355 797958603 797645035
1909.5 797645035 797214279 796898117 797517548 797382202 797196503 796880798 796596527 797505264 796030426
1918.2 796030426 795410843 796497879 797379150 798013153 797272415 796976624 797633591 798093185 797850113
$$ packed form
1851.6G94177246m38614j07269M9438k77710m93393P4540k34299J97220O99463J210251
1861.3G94856873L02581M3869J83182r537L20282n53970J70364j459503k266693L52936
1870.9G91940384R77249Q36334j40838O32705J114960P71103L23944P6523Q5907k06757
1880.6G96411514j20392m50134Q4229m73633n41306R4986j03073J060562J46561j252441
1890.2G94856873O64596J446533O30265M48608l23944j487427k7389Q850K09198J17340
1899.8G96543503k89688J5030r0714L98407J21307N12238M83246J46026J19248l13568
1909.5G97645035m30756l16162O19431j35346j85699l15705k84271R08737j474838
1918.2G96030426o19583J087036Q81271O34003p40738k95791O56967M59594k43072
$$ plain form
1926.8 797850113 797818069 797531586 797299118 797241364 796763916 796917648 796942978 797321320 797511063 797533798
1936.5 797533798 797577667 797335663 797666473 797771301 798331299 797531662 796416245 797251968 797483215 797663269
1946.1 797663269 797611084 798029556 798038025 797570114 797776947 797942276 798026962 797753448 797726746 797506561
1955.8 797506561 797654572 798173141 798286209 798551025 798278580 798176346 798231277 798094101 798175278 798310089
1965.4 798310089 798078995 797472305 797529526 797906570 798271255 798362122 798557205 798836060 798797989 798740387
1975.1 798740387 798842773 799186478 799069519 798833389 798572464 798340988 798011627 797605591 797649689 797499619
1984.7 797499619 798155899 799113693 799220200 798980942 799003983 799650726 799716568 798713074 798291168 798824005
1994.3 798824005 798858643 798513260 798108063 797622223 797743301 797675705 797956619 798466187 798796310 798737564
$$ packed form
1926.8G97850113l2044k86483k32468n7754m77448J53732K5330L78342J89743K2735
1936.5G97533798M3869k42004L30810J04828N59998p99637j115417Q35723K31247J80054
1946.1G97663269n2185M18472Q469m67911K06833J65329Q4686k73514k6702k20185
1955.8G97506561J48011N18569J13068K64816k72445j02234N4931j37176Q1177J34811
1965.4G98310089k31094o06690N7221L77044L64685R0867J95083K78855l8071n7602
1975.1G98740387J02386L43705j16959k36130k60925k31476l29361m06036M4098j50070
1984.7G97499619O56280R57794J06507k39258K3041O46743O5842j003494m21906N32837
1994.3G98824005L4638l45383m05197m85840J21078o7596K80914N09568L30123n8746
$$ plain form
2004 798737564 798353043 798644943 798703766 798665466 798397217 798071899 798017807 797757721 797410202 796886749
2013.6 796886749 797039032 797277298 796839294 796487122 797264023 797789688 797447205 797408295 796872940 796842880
2023.3 796842880 796699219 796271973 796114426 795297241 795039749 795035019 795184174 795006104 795002289 795188370
2032.9 795188370 794620285 794913330 795291901 795441360 795139236 794687653 794742203 794345779 793887253 793550262
2042.6 793550262 793515549 793468246 793805008 794021454 793739548 793798981 793784637 794215698 794473724 794526215
2052.2 794526215 794306335 793887024 793919907 793606339 793351440 792950363 792520828 792383194 792701416 793033447
2061.9 793033447 793268661 793782654 793568726 793804169 794190140 794219131 794266357 794058685 794160156 793904877
2071.5 793904877 793489914 792891388 792348633 792198181 792630844 793539581 793625565 793704529 793886261 794040909
$$ packed form
2004G98737564l84521K91900N8823l8300k68249l25318n4092k60086l47519n23453
2013.6G96886749J52283K38266m38004l52172P76901N25665l42483l8910n35355l0060
2023.3G96842880j43661m27246j57547q17185k57492m730J49155j78070l815J86081
2032.9G95188370n68085K93045L78571J49459l02124m51583N4550l96424m58526l36991
2042.6G93550262l4713m7303L36762K16446k81906N9433j4344M31061K58026N2491
2052.2G94526215k19880m19311L2883l13568k54899m01077m29535j37634L18222L32031
2061.9G93033447K35214N13993k13928K35443L85971K8991M7226k07672J01471k55279
2071.5G93904877m14963n98526n42755j50452M32663R08737Q5984P8964J81732J54648
$$ plain form
2081.1 794040909 794278717 794444504 794463959 794143753 793983612 793337936 792747879 792732315 792875519 792889404
2090.8 792889404 793215179 793878632 793755951 794186783 794760056 794754639 795022583 795054779 794582062 794003906
2100.4 794003906 793975677 793697281 793552628 793862534 793901978 793884964 793708038 793766327 794153519 794590454
2110.1 794590454 794458923 794447784 794914780 794975586 794871826 794461136 794318314 794477005 794450607 794150925
2119.7 794150925 794008789 794272385 794419785 794697952 794522095 794562454 795066605 795091858 795029678 794963150
2129.4 794963150 794912491 794664154 794521332 794409332 794167633 793786621 793409653 793612595 794095764 794692459
2139 794692459 794851532 795064774 795281601 795072479 794850693 794557419 794912186 794828720 794264679 794132614
2148.6 794132614 793938599 794177628 794717484 794772949 794513550 794776306 795021667 795168762 795552597 795833969
$$ packed form
2081.1G94040909K37808J65787J9455l20206j60141o45676n90057j5564J43204J3885
2090.8G92889404L25775O63453j22681M30832N73273n417K67944L2196m72717n78156
2100.4G94003906k8229k78396j44653L09906L9444j7014j76926N8289L87192M36935
2110.1G94590454j31531j1139M66996O0806j03760m10690j42822J58691k6398k99682
2119.7G94150925j42136K63596J47400K78167j75857M0359N04151K5253o2180o6528
2129.4G94963150n0659k48337j42822j12000k41699l81012l76968K02942M83169N96695
2139G94692459J59073K13242K16827k09122k21786k93274L54767q3466n64041j32065
2148.6G94132614j94015K39029N39856N5465k59399K62756K45361J47095L83835K81372
$$ plain form
2158.3 795833969 795896988 795465164 795204010 795035095 794926224 794818573 794731522 794970245 795047455 795195999
2167.9 795195999 795529099 796366501 796835785 796934433 797280045 797166824 797133179 797045517 796886902 796496735
2177.6 796496735 796248627 796407242 796515732 796804657 796994781 797561340 797851334 797876740 798079758 798480835
2187.2 798480835 798928833 798463364 798447800 798496552 798137741 798160324 798496628 798889999 798886261 799056244
2196.9 799056244 799154510 799672241 800037155 799702835 799638214 799941635 800482635 800149612 800049744 800298691
2206.5 800298691 800119171 800028763 799947052 800389633 800619049 800656967 800796204 801001892 801096497 801026001
2216.1 801026001 801244965 801200180 801297073 801328735 801136169 800937958 801127014 801637192 801806335 801744385
2225.8 801744385 801147308 801308441 801876144 802170639 802327423 802084961 802311707 802285690 802133408 801841812
$$ packed form
2158.3G95833969O3019m31824k61154j68915j08871j07651q7051K38723P7210J48544
2167.9G95195999L33100Q37402M69284R8648L45612j13221l3645q7662j58615l90167
2177.6G96496735k48108J58615J08490K88925J90124N66559K89994K5406K03018M01077
2187.2G98480835M47998m65469j5564M8752l58811K2583L36304L93371l738J69983
2196.9G99056244R8266N17731L64914l34320o4621L03421N41000l33023r9868K48947
2206.5H00298691j79520r0408q1711M42581K29416L7918J39237K05688R4605p0496
2216.1H01026001K18964m4785R6893L1662j92566j98211J89056N10178J69143o1950
2225.8H01744385n97077J61133N67703K94495J56784k42462K26746k6017j52282k91596
$$ plain form
2235.4 801841812 801732941 801909714 801873322 802138672 802355576 803012924 802984772 802648010 803003540 803349915
2245.1 803349915 803595581 803070908 802749252 802637177 802498398 802241745 802117767 802118683 801812897 802326889
2254.7 802326889 802750168 803387680 803704376 803409271 803499451 803446579 803932190 803735809 803130264 802871323
2264.4 802871323 802805176 802691650 802336731 802917480 803349991 803646545 803786392 803838654 804144363 804166260
2274 804166260 804155121 803738098 803678360 803714066 803815765 803601913 803337097 803637085 803408203 803630295
2283.7 803630295 803728333 804026260 804306335 804163208 804628372 804330826 804298859 804722443 804831696 804333801
2293.3 804333801 803768311 803781738 803425140 803604355 804024658 804474716 804500351 804497681 804962311 804806137
2302.9 804806137 804888153 805039902 805467529 805298843 804875107 804880829 804047775 803873444 803883362 804149475
$$ packed form
2235.4H01841812j08871J76773l6392K65350K16904O57348k8152l36762L55530L46375
2245.1H03349915K45666n24673l21656j12075j38779k56653j23978R16l05786N13992
2254.7H02326889M23279O37512L16696k95105R0180n2872M85611j96381o05545k58941
2264.4H02871323o6147j13526l54919N80749M32511K96554J39847N2262L05709K1897
2274H04166260j1139m17023n9738L5706J01699k13852k64816K99988k28882K22092
2283.7H03630295R8038K97927K80075j43127M65164k97546l1967M23584J09253m97895
2293.3H04333801n65490J3427l56598J79215M20303M50058K5635k670M64630j56174
2302.9H04806137Q2016J51749M27627j68686m23736N722q33054j74331R918K66113
$$ plain form
2312.6 804149475 804445801 804392548 804913864 805192795 805345383 805364990 805721970 805911560 805309982 804680710
2322.2 804680710 804500198 804240952 803753662 804227905 804680481 805340042 805512009 804847183 804198608 803610229
2331.9 803610229 803894958 804443207 805442276 805382996 804512482 803812408 803724899 804363098 803701172 803349838
2341.5 803349838 803477631 804153900 804241714 803598175 803641129 802970657 802847214 803707123 804823685 804756927
2351.2 804756927 804517670 805245132 805056076 804374008 803145142 802689667 802490158 802756958 803219452
2359.8 803219452 803199463 804156265 804813309 805937119 805479050 804184494 803567276 803312225 803389206 802432632
2369.5 802432632 801857758 802186584 802221527 801318359 800948792 800846024 800902557 801231766 800905380 800952072
2379.1 800952072 800645065 800434494 800638657 800615768 800522537 800295944 800685577 800747910 800493317 800163651
$$ packed form
2312.6H04149475K96326n3253N21316K78931J52588J9607L56980J89590o01578o29272
2322.2H04680710j80512k59246m87290M74243M52576O59561J71967o64826o48575n88379
2331.9H03610229K84729N48249R99069n9280q70514p00074q7509O38199o61926l51334
2341.5H03349838J27793O76269Q7814o43539M2954o70472j23443Q59909J116562o6758
2351.2H04756927k39257P27462j89056o82068j228866m55475j99509K66800M62494
2359.8H03219452j9989R56802O57044J123810m58069j294556o17218k55051P6981r56574
2369.5H02432632n74874L28826L4943r03168l69567j02768N6533L29209l26386M6692
2379.1H00952072l07007k10571K04163k2889r3231k26593L89633O2333k54593l29666
$$ plain form
2388.8 800163651 799767227 799838028 799632950 799564819 799164429 798846207 799202042 799475327 799559250 799161072
2398.4 799161072 799104156 799366760 799184341 798697586 798607407 798703461 798545456 798433456 798032990 797730789
2408.1 797730789 797521591 797465897 797506409 797496185 797589722 797406235 797526474 797590866 797219620 796759567
2417.7 796759567 796680222 796487961 795737686 795506668 795435181 795552750 795517044 795297623 795365982 795354309
2427.3 795354309 795450211 795113449 795249100 795555344 795106354 794668427 794133072 793688431 793334351 793105240
2437 793105240 792727661 792556610 792871552 792899017 792775421 792636032 792679672 792726974 792542572 792028351
2446.6 792028351 791673660 791580048 791113663 790696945 790320663 790111771 789765396 789440308 789643250 789551239
2456.3 789551239 789319992 789420242 789652939 789737473 789998398 789930878 789393387 788837509 787991562 787558823
$$ packed form
2388.8H00163651l96424P0801k05078o8131m00390l18222L55835K73285Q3923l98178
2398.4G99161072n6916K62604j82419m86755r0179R6054j58005j12000m00466l02201
2408.1G97730789k09198n5694M0512j0224R3537j83487J20239O4392l71246m60053
2417.7G96759567p9345j92261p50275k31018p1487J17569l5706k19421O8359j1673
2427.3G95354309R5902l36762J35651L06244m48990m37927n35355m44641l54080k29111
2437G93105240l77579j71051L14942K7465j23596j39389M3640M7302j84402n14221
2446.6G92028351l54691r3612m66385m16718l76282k08892l46375l25088K02942r2011
2456.3G89551239k31247J00250K32697Q4534K60925o7520n37491n55878q45947m32739
$$ plain form
2465.9 787558823 787237854 787047119 786807022 786098709 786217422 786946945 787383041 787385025 787502365 787549057
2475.6 787549057 787132339 786904373 786928329 786731949 786060791 785497284 784982376 784397354 784189224 784236908
2485.2 784236908 784235611 784331360 784661179 784637222 784737396 785068970 785121002 784935532 784727249 784486160
2494.8 784486160 783575287 782784653 782347946 782210083 782499924 782591476 782544632 782271500 782425232 783074951
2504.5 783074951 783568420 783382339 782854385 782899933 782615967 782022629 781646729 781173782 780475845 780067062
2514.1 780067062 780171509 780317535 780694504 781074600 781371307 781494370 781550980 781434860 781112137 781201172
2523.8 781201172 780856552 780134201 779645462 779214172 778470917 777916641 778092346 778251648 778376617 778143234
2533.4 778143234 778229218 778774109 778960419 779062119 778748550 778364334 777784042 777176743 776751480 776126328
$$ packed form
2465.9G87558823l20969j90735k40097p08313J18713P29523M36096J984J17340M6692
2475.6G87549057m16718k27966K3956j96380o71158n63507n14908n85022k08130M7684
2485.2G84236908j297R5749L29819k3957J00174L31574N2032j85470k08283k41089
2494.8G84486160r10873p90634m36707j37863K89841R1552m6844k73132J53732O49719
2504.5G83074951M93469j86081n27954M5548k83966n93338l75900m72947o97937m08783
2514.1G80067062J04447J46026L76969L80096K96707J23063N6610j16120l22723Q9035
2523.8G81201172l44620p22351m88739m31290p43255n54276J75705J59302J24969k33383
2533.4G78143234Q5984N44891J86310J01700l13569l84216n80292o07299m25263o25152
$$ plain form
2543.1 776126328 775478821 775115814 775365067 775246048 775232086 775595627 775700607 776001129 776285858 776453476
2552.7 776453476 776140060 775608368 775023422 774378510 773950424 773502274 772939606 772290802 772406693 772803497
2562.4 772803497 772746887 772707825 773186417 773658295 773381119 773286743 772927322 772344818 771763153 770717239
2572 770717239 770102081 769786758 769595718 769444885 769255295 769113922 769325943 769766617 769903336 770123520
2581.6 770123520 770113754 770179825 769971848 769158249 768595047 768148422 767670517 766833344 766403961 766348343
2591.3 766348343 766095352 766384048 766685638 766961212 767559433 767844849 767709122 767594986 767279510 766770935
2600.9 766770935 766229248 765321350 764484711 764223557 764446030 764384842 764222260 764400024 764347610 764349442
2610.6 764349442 764697342 765035324 764759369 764430847 764338760 763583679 762574921 761652451 760918198 760541077
$$ packed form
2543.1G76126328o47507l63007K49253j19019j3962L63541J04980L00522K84729J67618
2552.7G76453476l13416n31692n84946o44912m28086m48150n62668o48804J15891L96804
2562.4G72803497n6610l9062M78592M71878k77176r4376l59421n82504n81665j045914
2572G70717239o15158l15323j91040j50833j89590j41373K12021M40674J36719K20184
2581.6G70123520r766O6071k07977q13599n63202m46625m77905q37173m29383n5618
2591.3G66348343k52991K88696L01590K75574N98221K85416j35727j14136l15476n08575
2600.9G66770935n41687r07898q36639k61154K22473o1188j62582J77764n2414J832
2610.6G64349442L47900L37982k75955l28522r2087p55081j008758r22470p34253l77121
$$ plain form
2620.2 760541077 760244827 759974442 759827042 759989319 760258179 760228577 760120239 759857178 759253006 758996201
2629.9 758996201 758572845 757649994 757034760 756811371 756708984 756136703 755505371 755273666 755150528 755074234
2639.5 755074234 755141373 755008926 754253922 753928833 753792114 753091736 752406693 751961670 751265335 750137634
2649.1 750137634 749780884 749779587 749341812 748938293 748860321 748949814 748691406 748605194 748610535 748304138 747648697
2659.8 747648697 747113571 747080841 746858749 746232986 745440826 745109100 744528046 743998184 744109192 743824234
2669.4 743824234 743702621 743499908 743369827 743528900 743480453 743308640 742589111 741968613 741655884 741408310
2679 741408310 740971222 740215912 739564514 739325104 739264832 738962555 739064178 738944550 738401489 738038788
2688.7 738038788 737977066 738081970 737629089 737240219 736856995 736722336 736546555 735721970 735400314 735054779
$$ packed form
2620.2G60541077k96250k70385j47400J62277K68860k9602j08338k63061o04172k56805
2629.9G58996201m23356r22851o15234k23389j02387n72281o31332k31705j23138p6294
2639.5G55074234O7139j32447p55004l25089j36719p00378o85043m45023o96335j127701
2649.1G50137634l56750j297m37775m03519p7972Q9493k58408q6212N341l06397o55441
2659.8G47648697n35126l2730k22092o25763p92160l31726n81054n29862J11008k84958
2669.4G43824234j21613k02713j30081J59073m8447j71813p19529o20498l12729k47574
2679G41408310m37088p55310o51398k39410o0272l02277J01623j19628n43061l62701
2688.7G38038788o1722J04904m52881l88870l83224j34659j75781q24585l21656l45535
$$ plain form
2698.3 735054779 734483261 734049835 733954163 733876801 733192596 732702866 732658081 732560196 732265854 732399139
2708 732399139 732285690 731552353 730997696 730443726 729909744 729406433 729197922 728779602 728189392 727993622
2717.6 727993622 727812195 727675171 727515182 727535629 727360611 727572174 727899704 727149124 726489334 725891876
2727.3 725891876 725359573 724751129 723792419 723495255 723571625 723383484 722998047 723074265 723538284 723710709
2736.9 723710709 723359680 722998276 723001175 722923965 722612457 721812897 721186676 720893326 720461044 720109329
2746.5 720109329 719788132 719739075 719557037 719454880 719998474 720559082 720598373 720351105 720154572 719430008
2756.2 719430008 718685608 718404846 717988892 717328873 716467361 716030807 716075439 716211166 716257858 716047058
2765.8 716047058 716248322 716774139 717001114 716903458 716487045 716127930 715668182 715038757 714448929 713446732
$$ packed form
2698.3G35054779n71518m33426r5672p7362o84205m89730m4785r7885k94342J33285
2708G32399139j13449p33337n54657n53970n33982n03311k08511m18320n90210j95770
2717.6G27993622j81427j37024j59989K0447j75018K11563L27530p50580o59790n97458
2727.3G25891876n32303o08444r58710k97164P6370j88141l85437P6218M64019J72425
2736.9G23710709l51029l61404K899p7210l11508p99560o26221k93350m32282l51715
2746.5G20109329l21197m9057j82038j02157N43594N60608L9291k47268j96533p24564
2756.2G19430008p44400k80762m15954o60019q61512m36554M4632J35727M6692k10800
2765.8G16047058K01264N25817K26975r7656m16413l59115m59748o29425n89828j002197
$$ plain form
2775.5 713446732 712546005 712218552 712354355 712418365 712312622 712732773 712686081 712260818 712339783 712269897
2785.1 712269897 711638870 710917816 710749283 710300980 709246368 708280182 707859955 707470016 706634598
2793.8 706634598 706401138 706241302 705846024 706006317 706305542 705839615 704751511 704154434 703566895
2802.5 703566895 702602234 701486359 700453796 699641342 698884201 698633194 698293076 697731247 697271957
2811.2 697271957 697017670 697065811 696473160 695677032 695264435 694381790 693207321 692424622 691199951
2819.8 691199951 689625854 688727036 688144531 687506104 686641312 686287003 686199799 685421600 684903641 684432449
2829.5 684432449 683585968 682705612 681526108 680305099 679074631 677619781 676423645 675352631 674120178
2838.2 674120178 673063278 672063370 671308899 670546799 669439240 668519745 667386093 665781097 664312744
$$ packed form
2775.5G13446732r00727l27453J35803O4010j05743M20151m6692m25263P8965o9886
2785.1G12269897o31027p21054j68533m48303j054612r66186m20227l89939q35418
2793.8G06634598k33460j59836l95278J60293K99225m65927j088104n97077n87539
2802.5G03566895r64661j115875j032563q12454p57141k51007l40118n61829m59290
2811.2F97271957k54287M8141n92651p96128m12597q82645j174469p82699j224671
2819.8F91199951j574097q98818n82505o38427q64792l54309q7204p78199n17959m71192
2829.5F84432449q46481q80356j179504j221009j230468j454850j196136j071014j232453
2838.2F74120178j056900r99908p54471p62100j107559r19495j133652j604996j468353
$$ plain form
2846.8 664312744 662804413 660804062 658824539 656963882 655502930 654435425 653061676 652390823
2854.6 652390823 651996155 650978546 650167160 649856567 649658813 648897934 647777939 646307983 644689102
2863.2 644689102 643280258 641926193 640591049 638786964 636917610 635155754 633339806 631747055
2870.9 631747055 630378685 629032898 627527580 626006165 624150429 622320137 620383492 618373032
2878.7 618373032 616817627 614748764 612901382 611516762 609902191 608955193 608416710 607648926 606813507
2887.3 606813507 606221199 605890617 605501556 605155983 605032768 604698753 604341393 604416199 604233665 603582573
2897 603582573 602794113 602308426 602116013 601867180 601733742 601668549 601531258 601148605 600764923 600043678
2906.6 600043678 599066315 598646355 598147774 597373466 596638451 595685883 593817940 591895943 591055641
$$ packed form
2846.8F64312744j508331k000351j979523j860657j460952j067505j373749o70853
2854.6F52390823l94668j017609q11386l10593j97754p60879j119995j469956j618881
2863.2F44689102j408844j354065j335144j804085j869354j761856j815948j592751
2870.9F31747055j368370j345787j505318j521415j855736j830292j936645k010460
2878.7F18373032j555405k068863j847382j384620j614571r46998n38483p67784q35419
2887.3F06813507n92308l30582l89061l45573j23215l34015l57360P4806j82534o51092
2897F03582573p88460m85687j92413k48833j33438o5193j37291l82653l83682p21245
2906.6F00043678r77363m19960m98581p74308p35015r52568j867943j921997q40302
$$ plain form
2915.3 591055641 590231934 589021645 587406845 585818939 584559898 583297997 582201538 580858917
2923 580858917 579769783 579161301 578386726 577392273 576475487 576135063 575822525 575356674 575659790 576500511
2932.7 576500511 577154922 578110428 579542770 580841331 581975250 583463554 585246658 586684799 588247871
2941.3 588247871 590382423 592521782 594194031 596040230 598231697 600336037 602605438 604240608
2949.1 604240608 606027069 608402596 610413933 612626991 614772415 617014580 619076729 620573959
2956.8 620573959 621991272 623639030 625710030 627743645 629862289 631828880 633660431 635255585
2964.5 635255585 636827316 638611221 640124969 641711349 643051834 645000687 646945419 647663422
2972.2 647663422 648659134 650025711 650926743 651584396 653041153 654765244 656261902 657767563 658619690
$$ packed form
2915.3E91055641q23707j210289j614800j587906j259041j261901j096459j342621
2923E80858917j089134o08482p74575r94453r16786l40424l12538m65851L03116Q40721
2932.7E76500511O54411R55506J432342J298561J133919J488304J783104J438141J563072
2941.3E88247871K134552K139359J672249J846199K191467K104340K269401J635170
2949.1F04240608J786461K375527K011337K213058K145424K242165K062149J497230
2956.8F20573959J417313J647758K071000K033615K118644J966591J831551J595154
2964.5F35255585J571731J783905J513748J586380J340485J948853J944732P18003
2972.2F47663422R95712J366577R01032O57653J456757J724091J496658J505661Q52127
$$ plain form
2980.9 658619690 659071579 659867554 661295166 662609787 663619843 664145660 664826965 666093750 666524048
2989.6 666524048 666845779 667274551 667533264 667873154 668239288 668744049 669355774 670276489 670734863 671062546
2999.2 671062546 671334076 671282730 671324768 671049118 670441132 670056839 670296402 669871292 669251022 669139404
3008.8 669139404 669074783 669496994 669554825 669316559 669069290 669329071 669117508 667817078 667035294 666188431
3018.5 666188431 665840988 665401688 664361191 663670273 662991486 662724380 662067490 661190491 660886765
3027.2 660886765 660565491 659768295 658921661 658402481 657747116 657277145 656138382 654626770 653851318
3035.9 653851318 652774429 651456375 650537262 649850464 649221878 648474274 647461090 646949692 646757812
3044.5 646757812 645928726 644801407 643811569 642782288 641456604 640386124 639210434 637868881 636592560
$$ packed form
2980.9F58619690M51889P95975J427612J314621J010056N25817O81305J266785M30298
2989.6F66524048L21731M28772K58713L39890L66134N04761O11725R20715M58374L27683
2999.2F71062546K71530n1346M2038k75650o07986l84293K39563m25110o20270j11618
3008.8F69139404o4621M22211N7831k38266k47269K59781k11563j300430p81784q46863
3018.5F66188431l47443m39300j040497o90918o78787k67106o56890q76999l03726
3027.2F60886765l21274p97196q46634n19180o55365m69971j138763j511612p75452
3035.9F53851318j076889j318054r19113o86798o28586p47604j013184n11398j91880
3044.5F46757812q29086j127319r89838j029281j325684j070480j175690j341553j276321
$$ plain form
3053.2 636592560 635506172 635255394 634444008 633239594 632571144 631862183 631231346 630646019 629861565
3061.9 629861565 628793755 627673988 626170578 625148277 624175835 622082176 620645218 619967690 619367332
3070.6 619367332 618571815 617704582 617125664 616411629 615521431 614677048 613890190 612196198 610571861
3079.2 610571861 610049286 609345932 608081322 606862984 605983734 604733124 603564835 602741547 601731262
3087.9 601731262 600825043 600400429 599949532 598569679 597179794 595853081 594818954 594141121 592702026
3096.6 592702026 591021881 589534454 588925629 588314667 587042656 586130409 585523567 584797134 583703346
3105.3 583703346 583178291 582468605 580759087 579124260 578195000 577377472 575991135 575071144 573986664
3114 573986664 572686882 571918182 571099968 570356102 569388275 568484001 567788391 566821899 565600662 564661674
$$ packed form
3053.2F36592560j086388k50778q11386j204414o68450p08961o30837n85327p84454
3061.9F29861565j067810j119767j503410j022301r72442k093659j436958o77528o00358
3070.6F19367332p95517q67233n78918p14035q90198q44383p86858j693992j624337
3079.2F10571861n22575p03354j264610j218338q79250j250610j168289q23288j010285
3087.9F01731262r06219m24614m50897j379853j389885j326713j034127o77833j439095
3096.6E92702026j680145j487427o08825o10962j272011r12247o06842p26433j093788
3105.3E83703346n25055p09686j709518j634827r29260q17528j386337r19991j084480
3114E73986664j299782p68700q18214p43866r67827r04274o95610r66492j221237r38988
$$ plain form
3123.6 564661674 563650742 562427101 561399117 560175705 559355927 558054962 556731110 556170540 555355759
3132.3 555355759 554665108 553487167 552935600 552391815 550886726 550135841 549158630 548078537 547163811
3141 547163811 545824852 544494934 543571739 542936478 541914139 540784645 539598999 538524513 537947807
3149.6 537947807 537543297 536686859 535869255 535379562 534408226 533380928 532105675 530888214 530011520
3158.3 530011520 528956757 528156433 527517090 527000351 526016197 524701805 523706284 522838402 522146225
3167 522146225 521099052 519804077 518919678 518320045 517659912 516806870 515379448 513979034 513450165
3175.7 513450165 513108978 512254829 511384735 511402206 510619125 509108200 508596611 508079453 507284470 506249237
3185.3 506249237 505594788 504898567 503581200 502987289 502551727 501818542 500966072 500210457 499460411
$$ packed form
3123.6E64661674j010932j223641j027984j223412q19778j300965j323852n60570q14781
3132.3E55355759o90651j177941n51567n43785j505089p50885r77211j080093r14726
3141E47163811j338959j329918r23195o35261j022339j129494j185646j074486n76706
3149.6E37947807m04510q56438q17604m89693r71336j027298j275253j217461q76694
3158.3E30011520j054763q00324o39343n16739r84154j314392r95521q67882o92177
3167E22146225j047173j294975q84399n99633o60133q53042j427422j400414n28869
3175.7E13450165l41187q54149q70094J7471p83081j510925n11589n17158p94983j035233
3185.3E06249237o54449o96221j317367n93911m35562p33185q52470p55615p50046
$$ plain form
3194 499460411 498546028 497698669 496767921 496217461 495546684 494716873 493861008 493111420 492912292 492279701
3203.6 492279701 491484337 490699692 489775848 489023705 488176994 487535896 487070389 486394615 485546188 484820213
3213.3 484820213 484197426 483785095 483525810 482961617 482401810 481571236 480313187 479613152 479196892
3222 479196892 478646507 478147354 477098999 476059418 475612106 475335121 475341110 474955750 474439545 474105797
3231.6 474105797 472865715 471434097 471186905 471310043 470725441 469904861 468822060 467587090 466985474
3240.3 466985474 466767616 466322479 466030426 466238670 465872269 465174980 464793777 464010353 462702179
3249 462702179 461850395 462007866 461858864 461265793 460685158 460087357 459666176 459170380 458644753 458061409
3258.6 458061409 457915802 457789879 457119598 456388474 456121216 456192780 455568237 454825363 454085083 453379288
$$ packed form
3194D99460411r14383q47359r30748n50460o70777q29811q55865p49588j99128o32591
3203.6D92279701p95364p84645r23844p52143q46711o41098m65507o75774q48427p25975
3213.3D84820213o22787m12331k59285n64193n59807q30574j258049p00035m16260
3222D79196892n50385m99153j048355j039581m47312k76985N989l85360n16205l33748
3231.6D74105797j240082j431618k47192J23138n84602q20580j082801j234970o01616
3240.3D66985474k17858m45137k92053K08244l66401o97289l81203p83424j308174
3249D62702179q51784J57471j49002n93071n80635n97801m21181m95796n25627n83344
3258.6D58061409j45607j25923o70281p31124k67258P1564o24543p42874p40280p05795
$$ plain form
3268.3 453379288 452823410 452253494 452501144 452693634 452457275 452132759 452138138 451802979 450304337 449489021
3277.9 449489021 449356346 449075775 448730507 448668900 448457222 447731361 447342873 447114639 447029152 446708984
3287.5 446708984 446251984 445873260 445597534 445575752 444959488 444458046 443955612 443176193 442698898 442376480
3297.2 442376480 441946869 441205788 440945663 440587578 440202866 440098305 439718666 439805565 439384804 438530273
3306.8 438530273 438441353 438359871 437993774 437557564 436904716 436005630 435064812 434693527 434898071 434538269
3316.5 434538269 433898087 433679085 433137741 432502174 432294235 431831474 431235847 431271591 431262741 430541039
3326.1 430541039 429263878 428610039 428792534 428380318 427779770 427483788 427283936 426756973 426235657
3334.8 426235657 426254158 425501022 424471741 423803329 423320045 423232956 422800293 422369576 422065010 421327820
$$ packed form
3268.3D53379288n55878n69916K47650J92490k36359l24516N379l35159j498642q15316
3277.9D49489021j32675k80571l45268o1607k11678p25861l88488k28234q5487l20168
3287.5D46708984m57000l78724k75726k1782o16264n01442n02434p79419m77295l22418
3297.2D42376480m29611p41081k60125l58085l84712j04561l79639Q6899m20761q54531
3306.8D38530273q8920q1482l66097m36210o52848q99086r40818l71285K04544l59802
3316.5D34538269o40182k19002n41344o35567k07939m62761n95627L5744q850p21702
3326.1D30541039j277161o53839J82495m12216o00548k95982j99852n26963n21316
3334.8D26235657J8501p53136j029281o68412m83284q7089m32663m30717l04566p37190
$$ plain form
3344.4 421327820 420726318 420485229 419882317 419314957 419249725 418938675 418553925 418281441 417647095 417097816
3354.1 417097816 416818962 416099663 415536766 415095825 414257698 413875618 413449440 412774086 412457924 412583809
3363.7 412583809 412400055 411337547 410561752 410313263 410134048 409506836 409102173 409183464 408602409 407893410
3373.4 407893410 407251892 406926460 406932449 406512527 405676880 405088539 405198364 405152512 404895630 404539566
3383 404539566 404222488 404139099 403883858 403470688 403068810 403075066 402855530 402314186 401753082 401249771
3392.7 401249771 401318130 401408806 401273308 401033897 401078606 400965500 400457420 399743042 398962936 398853951
3402.3 398853951 398561401 398640213 399259529 398769989 398035240 397882423 397746353 397750664 398465767 398915863
3412 398915863 398571625 398177490 397890205 397882156 397735367 397293053 397284241 397604446 397614784 397432098 397328072
$$ packed form
3344.4D21327820o01502k41089o02912n67360o5232l11050l84750k72484o34346n49279
3354.1D17097816k78854p19299n62897m40941q38127l82080m26178o75354l16162J25885
3363.7D12583809j83754j062508p75795k48489j79215o27212m04663Q1291n81055p08999
3373.4D07893410o41518l25432N989m19922q35647n88341J09825m5852k56882l56064
3383D04539566l17078q3389k55241m13170m01878O256k19536n41344n61104n03311
3392.7D01249771O8359R0676j35498k39411M4709j13106n08080p14378p80106j08985
3402.3C98853951k92550P8812O19316m89540p34749j52817j36070M311P15103M50096
3412C98915863l44238l94135k87285q049j46789m42314q812L20205J0338j82686j04026
$$ plain form
3422.6 397328072 397679634 397877121 397428589 397441940 397516632 397467232 397519150 397536621 397608414 397475739 397625198
3433.2 397625198 397903366 398023987 397919922 398288345 398824310 398699722 398860626 399297371 399911957 399778099
3442.8 399778099 399475250 399796295 400472794 401151810 400142784 400360146 401556816 402198830 402726021
3451.5 402726021 402832603 403210068 402719574 402544022 403136177 403846130 404851036 404920311 405062027 405415688
3461.1 405415688 405984383 406230888 406693649 407692070 407776451 408005180 408252831 408717270 408982048 409209175
3470.8 409209175 410124321 410797310 411659088 411869812 411729393 411898270 412344742 413041115 413799477 414669456
3480.4 414669456 414732704 414851685 415377274 416469040 416994324 417026405 418113594 418545609 419144630 419728050
3490.1 419728050 419997177 420754776 421122932 421770020 422829628 423726349 423666420 423998299 425243721
$$ packed form
3422.6C97328072L51562J97487m48532J3351P4692m9400N1918J7471P1793j32675J49459
3433.2C97625198K78168J20621j04065L68423N35965j24588J60904M36745O14586j33858
3442.8C99778099l02849L21045O76499O79016j009026K17362J196670O42014N27191
3451.5D02726021J06582L77465m90494j75552N92155P09953J004906O9275J41716L53661
3461.1D05415688N68695K46505M62761R98421Q4381K28729K47651M64439K64778K27127
3470.8D09209175R15146O72989Q61778K10724j40419J68877M46472O96373P58362Q69979
3480.4D14669456O3248J18981N25589J091766N25284L2081J087189M32015N99021N83420
3490.1D19728050K69127P57599L68156O47088J059608Q96721n9929L31879J245422
$$ plain form
3498.7 425243721 425671959 425937233 426622887 426871719 426848526 427636261 428876305 430083427 430712357
3507.4 430712357 431365700 431515007 430886230 432125511 433358574 434025116 434734192 435319481 436183891
3516.1 436183891 436496277 437238846 438023300 438565178 439373589 440691986 442086563 441944733 442153778
3524.8 442153778 442714767 443608551 444893341 445866318 446659431 446896172 447364845 448117638 449272499
3533.5 449272499 450771484 452268181 452221298 451856270 453156319 453911858 454820557 455838432 456800613
3542.1 456800613 457685394 458630142 459642792 460209694 461293526 460678291 461876755 463650055 465178909
3550.8 465178909 467662849 466621246 467069893 468556213 469868126 471229668 471476898 473428268 474506302
3559.5 474506302 475137253 476155586 478808975 480674477 480604172 484439468 484540825 483114815 483443794
$$ packed form
3498.7D25243721M28238K65274O85654K48832k3193P87735J240044J207122O28930
3507.4D30712357O53343J49307o28777J239281J233063O66542P09076N85289Q64410
3516.1D36183891L12386P42569P84454N41878Q08411J318397J394577j41830K09045
3524.8D42153778N60989Q93784J284790R72977P93113K36741M68673P52793J154861
3533.5D49272499J498985J496697m6883l65028J300049P55539R08699J017875R62181
3542.1D56800613Q84781R44748J012650N66902J083832o15235J198464J773300J528854
3550.8D65178909K483940j041603M48647J486320J311913J361542K47230J951370J078034
3559.5D74506302O30951J018333K653389J865502p0305L835296J01357j426010L28979
$$ plain form
3568.2 483443794 482993431 486771851 488985214 490453033 492077904 493282394 494212952 495755539 497936592
3576.9 497936592 498390350 500700340 502427711 503005905 505089760 506879692 508043480 509638710 514027710
3585.5 514027710 515294380 513882256 515240364 514522591 517318344 520203934 523788528 525805473
3593.2 525805473 526189003 529186363 528421555 530886993 533570518 533815193 537149010 537740135 538259697
3601.9 538259697 540456963 542236519 544356308 547675209 550471420 549778099 553471107 552572708 552322121
3610.6 552322121 560213661 561246452 559456940 562154541 560664673 565157738 569426384 569667168
3618.3 569667168 572155876 571223679 572043152 574882965 577233353 580047760 583015213 585343475 587887993
3627 587887993 594196129 592708130 581360550 586670151 592494850 597803040 597836952 595622406 598123131
$$ packed form
3568.2D83443794m50363L778420K213363J467819J624871J204490R30558J542587K181053
3576.9D97936592M53758K309990J727371N78194K083855J789932J163788J595230M389000
3585.5E14027710J266670j412124J358108p17773K795753K885590L584594K016945
3593.2E25805473L83530K997360p64808K465438K683525K44675L333817N91125N19562
3601.9E38259697K197266J779556K119789L318901K796211o93321L693008q98399k50587
3610.6E52322121P891540J032791j789512K697601j489868M493065M268646K40784
3618.3E69667168K488708r32197Q19473K839813K350388K814407K967453K328262K544518
3627E87887993O308136j487999j1347580N309601N824699N308190L3912k214546K500725
$$ plain form
3635.7 598123131 600913086 602946815 603740005 605770226 608208504 610355988 611169586 611423645 614284935
3644.4 614284935 618053741 623272324 621906090 618701439 623465919 619780197 615127182 617188721
3652.1 617188721 624249611 629007721 632793579 636806183 628638763 630550804 635376472 636425705
3659.8 636425705 638052216 638891411 640720596 641605301 642600327 643817062 645149078 649679108 651963577
3668.5 651963577 652421341 651763916 643413925 647153702 656852341 665442200 660178833 643206482
3676.2 643206482 648298416 655922012 660352020 658224869 658929520 661903000 663805161 665058746
3683.9 665058746 664955215 665959091 670304794 675315552 665738602 663376083 670528412 665405960
3691.6 665405960 667261124 672146759 672586365 674235840 674524918 674769745 676457138 677204971 679774780
$$ packed form
3635.7E98123131K789955K033729P93190K030221K438278K147484Q13598K54059K861290
3644.4F14284935L768806N218583j366234l204651M764480l685722m653015K061539
3652.1F17188721P060890M758110L785858M012604q167420J912041M825668J049233
3659.8F36425705J626511Q39195J829185Q84705R95026J216735J332016M530030K284469
3668.5F51963577M57764o57425q349991L739777R698639Q589859n263367j6972351
3676.2F43206482N091934P623596M430008k127151P04651K973480J902161J253585
3683.9F65058746j03531J003876M345703N010758r576950k362519P152329n122452
3691.6F65405960J855164M885635M39606J649475K89078K44827J687393P47833K569809
$$ plain form
3700.3 679774780 682664871 676903992 675249252 680704956 682312851 682522202 683018112 686489944 690466995
3709 690466995 682635117 687517471 690911484 676793747 681336212 685577774 686383514 687427750 689647522
3717.7 689647522 690204544 686912689 688714066 694858932 692032166 687625198 692323303 692533798 691812515
3726.3 691812515 689647903 690601120 695374222 696581650 700827637 696932602 692348938 701546478
3734 701546478 697457962 686316605 689214096 692213974 693773956 697424164 700097809 697607574
3741.8 697607574 701823349 711576233 700119858 687076340 696795654 702449570 708604355 704389496
3749.5 704389496 694666672 705573730 699352036 695001526 700889282 704979095 707565308 702101212
3757.2 702101212 704925079 709569244 701758041 701187820 705421143 706986237 707841263 711111908 707614822
$$ packed form
3700.3F79774780K890091n760879j654740N455704J607895K09351M95910L471832L977051
3709F90466995p831878M882354L394013j4117737M542465M241562Q05740J044236K219772
3717.7F89647522N57022l291855J801377O144866k826766m406968M698105K10495p21283
3726.3F91812515k164612R53217M773102J207428M245987l895035m583664R197540
3734G01546478m088516j1141357K897491K999878J559982L650208K673645k490235
3741.8F97607574M215775R752884j1456375j3043518R719314N653916O154785m214859
3749.5G04389496r722824J0907058o221694m350510N887756M089813K586213n464096
3757.2G02101212K823867M644165p811203n70221M233323J565094Q55026L270645l497086
$$ plain form
3765.9 707614822 703155518 706905060 712251358 712507782 703753662 705179596 707797470 708847504
3773.6 708847504 710199585 710222321 711212692 711568069 714553604 713616180 706395035 709808960 712385254
3782.3 712385254 713780746 715132523 711748505 711663055 712965240 713264847 714038620 714263153 714606781
3790.9 714606781 714869690 715633698 715484161 716754303 720381317 716850357 713162460 716116104 720887833
3799.6 720887833 726221313 716397400 705377350 710779037 715294495 720378418 725000381 714472809
3807.3 714472809 710437546 715750275 717998505 719061813 720428085 720493240 721918945 727154846 723427277
3816 723427277 710326080 717370605 723426590 726659775 725710373 708209381 713479004 720519638
3823.7 720519638 722632675 724680328 724259033 720488205 720871277 722803192 726142426 727052536 719104080
$$ packed form
3765.9G07614822m459304L749542N346298K56424q754120J425934K617874J050034
3773.6G08847504J352081K2736R90371L55377K985535r37424p221145L413925K576294
3782.3G12385254J395492J351777l384018q5450J302185K99607P73773K24533L43628
3790.9G14606781K62909P64008j49537J270142L627014l530960l687897K953644M771729
3799.6G20887833N333480r823913j1020050N401687M515458N083923M621963j0527572
3807.3G14472809m035263N312729K248230J063308J366272O5155J425705N235901l727569
3816G23427277j3101197P044525O055985L233185r49402j7500992N269623P040634
3823.7G20519638K113037K047653m21295l770828L83072J931915L339234R10110p948456
$$ plain form
3832.4 719104080 722717285 729031219 722377701 722384644 729285583 720677948 719457474 727531281 721551590
3841.1 721551590 721715088 727983246 725036850 721423645 723533401 724896088 725769272 727799759 726524506
3849.8 726524506 728412781 733851776 727259293 727210007 712540131 716375122 726572495 725248947
3857.5 725248947 724658127 726962280 728980637 731082230 725362778 726229782 732794647 725882492 721396027
3866.2 721396027 726066132 731419449 736981964 727580338 720203629 725506363 731616898 733816986
3873.9 733816986 723702850 725775375 729719315 729040756 730924911 734556122 728789597 723849335
3881.6 723849335 730406418 730788116 731634521 735031433 723371201 726841660 731199417 732327728
3889.3 732327728 736574402 734634247 726673355 728471832 730818176 729434052 731375885 732928848
$$ packed form
3832.4G19104080L613205O313934o653518O943O900939q607635j220474Q073807n979691
3841.1G21551590J63498O268158k946396l613205K109756J362687Q73184K030487j275253
3849.8G26524506J888275N438995o592483m9286j4669876L834991J0197373j323548
3857.5G25248947n90820K304153K018357K101593n719452Q67004O564865o912155m486465
3866.2G21396027M670105N353317N562515r401626p376709N302734O110535K200088
3873.9G33816986j0114136K072525L943940o78559J884155L631211n766525m940262
3881.6G23849335O557083L81698Q46405L396912j1660232L470459M357757J128311
3889.3G32327728M246674j940155p960892J798477K346344j384124J941833J552963
$$ plain form
3897 732928848 736041641 737111130 727074738 732944717 734498444 729820480 734105301 729365616
3904.7 729365616 728401031 730077362 731628647 733076859 731636963 731500397 731611710 732311249 733210831
3913.4 733210831 733770828 735675583 737465820 732674179 729679108 734953232 733692322 729718475
3921.1 729718475 732721634 734747696 736100845 732742462 729185257 731504440 733873215 735360641
3928.8 735360641 733915100 733920670 736398087 733957520 732148972 733172836 734113922 734888763 734639053
3937.5 734639053 734311523 734366150 734212189 735856476 736656952 732731781 732743530 734316025 735031128
3946.2 735031128 735810318 734156799 735491257 735479889 733956070 736435623 736215057 734874573 735105057
3954.9 735105057 735643005 735437317 734084091 734458389 735408707 736457672 736444626 735413437 735917511
$$ packed form
3897G32928848L112793J069489j0036392N869979J553727m677964M284821m739685
3904.7G29365616r64585J676331J551285J448212j439896j36566J11313O99539Q99582
3913.4G33210831N59997J904755J790237m791641k995071N274124j260910l973847
3921.1G29718475L003159K026062J353149l358383l557205K319183K368775J487426
3928.8G35360641j445541N570K477417k440567j808548J023864R41086P74841k49710
3937.5G34639053l27530N4627j53961J644287Q00476l925171J1749J572495P15103
3946.2G35031128P79190j653519J334458j1368j523819K479553k20566j340484K30484
3954.9G35105057N37948k05688j353226L74298R50318J048965j3046j031189N04074
$$ plain form
3963.6 735917511 737065659 737532501 736302872 735561447 736440430 736743546 736660614 736992187 736146927
3972.2 736146927 735160370 735394211 735610657 735743332 735218964 735395279 735894623 735645981 736354294 737424088
3981.9 737424088 737661667 737198486 737222290 736695251 736162109 736598282 736687927 736823807 736227341 736393585
3991.5 736393585 736982727 737295837 738180161 737907028 737869568 737932587 737473755 737334595 737738037
4000.2 737738037
$$ packed form
3963.6G35917511J148148M66842j229629p41425Q78983L03116q2932L31573q45260
3972.2G36146927r86557K33841K16446J32675n24368J76315M99344k48642P08313J069794
3981.9G37424088K37579m63181K3804n27039n33142M36173Q9645J35880n96466J66244
3991.5G36393585N89142L13110Q84324k73133l7460O3019m58832j39160M03442
4000.2G37738037
##END=$$ End of the data block
