##TITLE=Nykon lote 15414 $$ Begin of the data block
##JCAMP-DX=5.00 $$ ACD/SpecManager v 10.08
##SPECTROMETER/DATA SYSTEM=Alpha
##DATE=04 Dec 2015 11:34:10
##DATA TYPE=INFRARED SPECTRUM
##DATA CLASS=XYDATA
##ORIGIN=
##OWNER=
##NPOINTS=1667
##FIRSTX=599.64648438
##LASTX=3997.64306641
##MAXX=3997.64306641
##MINX=599.64648438
##MAXY=1.08849764
##MINY=0.15724781
##XFACTOR=1.0000000000
##YFACTOR=0.000000010000000
##FIRSTY=0.98116517
##DELTAX=2.03961372
##XUNITS=1/CM
##YUNITS=ARBITRARY UNITS
##XYDATA=(X++(Y..Y))
599.6I8116517K96128K13295K19292K67231K46847J92338J78325J72764J59192J31238
$$ 98116517 98412645 98625940 98845232 99112463 99359310 99551648 99729973 99902737 100061929 100193167
620A00193167P2813J8561j3578n8472q7488r8705j47129k13652k83689l50374l89051
$$ 100193167 100265980 100284541 100270963 100212491 100125003 100026298 99879169 99665517 99381828 99031454 98642403
642.5I8642403m21548m48221m32610l84707l16757k34598k08974k24214j08058K02722
$$ 98642403 98220855 97772634 97340024 96955317 96638560 96403962 96194988 95970774 95862716 96065438
662.9I6065438M90844P50488R19938O28740M97156N26649M95922M20368L26026K17878
$$ 96065438 96556282 97306770 98226708 98855448 99352604 99879253 100375175 100795543 101121569 101339447
683.3A01339447R0135k5106o9296j5104J00803J81246J28710K8837J6904O8343J05858
$$ 101339447 101429582 101404476 101335180 101320076 101420879 101602125 101730835 101759672 101776576 101844919 101950777
705.7A01950777P9667j6677q7214m9591O0833J72043K05373J57142J19126J21295J14584
$$ 101950777 102030444 102013767 101926553 101876962 101937795 102109838 102315211 102472353 102591479 102712774 102827358
728.1A02827358P4303K5964n328l8422q0967j09100j27387j42693j46747j65284k27225
$$ 102827358 102901661 102927625 102922297 102883875 102802908 102693808 102566421 102423728 102276981 102111697 101884472
750.6A01884472k87091k95246k80726k91324l20053l43847l43341k52616k8116K36243
$$ 101884472 101597381 101302135 101021409 100730085 100410032 100066185 99722844 99470228 99442112 99678355
771I9678355L76994L54695K60949J79804J41978J23382O5803m8876j99187l57103m71449
$$ 99678355 100055349 100410044 100670993 100850797 100992775 101116157 101181960 101133084 100933897 100576794 100105345
793.4A00105345n39452o03234o65814p59113r89801j434165k043026k602149k695447
$$ 100105345 99565893 98962659 98296845 97537732 96547931 95113766 93070740 90468591 87773144
811.8H7773144j969570o50197N55283J151544J183325R56791O96153M73100K98524
$$ 87773144 85803574 85153377 85708660 86860204 88043529 89000320 89696473 90169573 90468097
830.1I0468097J83755J32012J32823J55896J60688J12343J8710q3691j92070l07119
$$ 90468097 90651852 90783864 90916687 91072583 91233271 91345614 91364324 91280633 91088563 90781444
850.5I0781444l88962m11468m04650l82352l44283l01605k37954j17379J17147M76622
$$ 90781444 90392482 89981014 89576364 89194012 88849729 88548124 88310170 88192791 88309938 88786560
870.9H8786560Q63159J153070J252186J145357R25672O75648M29094J97333o0069l82197
$$ 88786560 89649719 90802789 92054975 93200332 94126004 94801652 95230746 95428079 95368010 94985813
891.3I4985813p66415j199316j643712k016061k207566k109480j693224j111442o24460
$$ 94985813 94219398 93020082 91376370 89360309 87152743 85043263 83350039 82238597 81614137
909.7H1614137m21769n30219q33350j158500j360965j366585j204491r97227q62503
$$ 81614137 81192368 80662149 79828799 78670299 77309334 75942749 74738258 73741031 72878528
928G2878528q32665q46452p76493n00262L4910P83545J597035K267700K618671K575654
$$ 72878528 72045863 71199411 70422918 69922656 69957566 70741111 72338146 74605846 77224517 79800171
948.4G9800171K206397J706207J257795R51224Q16447Q12560Q53241Q56912P88730
$$ 79800171 82006568 83712775 84970570 85921794 86738241 87550801 88404042 89260954 90049684
966.8I0049684O69009N15472L18861P4774j87534m39566o59186q22431r28986j005995
$$ 90049684 90718693 91234165 91553026 91627800 91440266 91000700 90341514 89519083 88590097 87584102
987.2H7584102j101875j243401j431560j640588j801926j873535j909697k013624k201795
$$ 87584102 86482227 85238826 83807266 82166678 80364752 78491217 76581520 74567896 72366101
1005.5G2366101k325207k155543j598817q03697j7417O42789J207679J684636J989359
$$ 72366101 70040894 67885351 66286534 65482837 65465420 66108209 67315888 69000524 70989883
1023.9G0989883K053428J846403J341849O29097j10751p78055j358837j845384k220672
$$ 70989883 73043311 74889714 76231563 76860660 76749909 75971854 74613017 72767633 70546961
1042.2G0546961k457208k547466k533579k461881k355039k232444k132642k082116
$$ 70546961 68089753 65542287 63008708 60546827 58191788 55959344 53826702 51744586
1058.6E1744586k066281k048278k006337j954943j928818j952374k022055k109891
$$ 51744586 49678305 47630027 45623690 43668747 41739929 39787555 37765500 35655609
1074.9C5655609k166128k147323k048701j892394j705051j525493j370634j238571
$$ 35655609 33489481 31342158 29293457 27401063 25696012 24170519 22799885 21561314
1091.2B1561314j132813j033942r25292q11451o87411n47457m03048k41998n3121J51245
$$ 21561314 20428501 19394559 18469267 17657816 16970405 16422948 16019900 15777902 15724781 15876026
1111.6A5876026L56175N52991P34659Q92104J026857J111153J109581J031378R28862
$$ 15876026 16232201 16785192 17519851 18411955 19438812 20549965 21659546 22690924 23619786
1129.9B3619786Q59712Q38627Q30698P91716P11340O12462N14835M27171L73206L64521
$$ 23619786 24479498 25318125 26148823 26940539 27651879 28264341 28779176 29206347 29579553 29944074
1150.3B9944074L82102L88813L62575L10644K46731K00444K22993L53849N87717Q95634
$$ 29944074 30326176 30714989 31077564 31388208 31634939 31835383 32058376 32412225 32999942 33895576
1170.7C3895576J236501J574129J887858K162346K394539K598468K812946L056100
$$ 33895576 35132077 36706206 38594064 40756410 43150949 45749417 48562363 51618463
1187.1E1618463L249073L253686L006548K563673K076507J713329J556075J559752
$$ 51618463 54867536 58121222 61127770 63691443 65767950 67481279 69037354 70597106
1203.4G0597106J570785J422578J042742M58181k49100r79751j620579k007055j992613
$$ 70597106 72167891 73590469 74633211 75091392 74842292 73862541 72241962 70234907 68242294
1221.7F8242294j579470r21631k28715L30127O94984R09298J035786J115775J161146
$$ 68242294 66662824 65741193 65512478 65842605 66537589 67446887 68482673 69598448 70759594
1240.1G0759594J146538J047319Q63355O27101L97735K27845J44088J41615J93274
$$ 70759594 71906132 72953451 73816806 74443907 74841642 75069487 75213575 75355190 75548464
1258.4G5548464K69431L33798L50541L06588K03008N3686j17720k95388m59403n83470
$$ 75548464 75817895 76151693 76502234 76808822 77011830 77065516 76947796 76652408 76193005 75609535
1278.8G5609535p06553j000613j695610k841353m038531m591745m041910k384400r2131
$$ 75609535 74902982 73902369 72206759 69365406 65326875 60735130 56693220 54308820 54216689
1297.2E4216689J951027K994096K975750K343351J531410P39455K8992n67311r37140
$$ 54216689 56167716 59161812 62137562 64480913 66012323 66751778 66780770 66213459 65276319
1315.6F5276319q97819k99799O46048J381535J599031J352716Q58265L46196n0038
$$ 65276319 64378500 64078701 64724749 66106284 67705315 69058031 69916296 70262492 70212454
1333.9G0212454l83771p41100q93003n45686N6588O46025J190013J606297J808143
$$ 70212454 69828683 69087583 68194580 67648894 67705482 68351507 69541520 71147817 72955960
1352.3G2955960J739705J279026L34114j141936l172850m985977o037694o590128n798968
$$ 72955960 74695665 75974691 76308805 75166869 71994019 67008042 60970348 54380220 48581252
1370.6D8581252l700647r28745J977623M019594M833343M518664L700501L025478K490991
$$ 48581252 44880605 43951860 45929483 49949077 54782420 59301084 63001585 66027063 68518054
1389F8518054J941807J496243J031584N03856J13701J07062L96615P99555J172018
$$ 68518054 70459861 71956104 72987688 73491544 73605245 73712307 74108922 74908477 76080495
1407.3G6080495J359576J413566J413596J418244J479936J536477J170617O14297J13702
$$ 76080495 77440071 78853637 80267233 81685477 83165413 84701890 85872507 86486804 86600506
1425.7H6600506l92145j001733j475990j792520k654106l358364k992898k964294l125519
$$ 86600506 86208361 85206628 83730638 81938118 79284012 75925648 72932750 69968456 66842937
1444.1F6842937l034055k800053j994091r48817j37341N84567J456618J805347J824927
$$ 66842937 63808882 61008829 59014738 58065921 57928580 58513147 59969765 61775112 63600039
1462.4F3600039K073861K285546K064264J713365J392519J190985J476669K149808
$$ 63600039 65673900 67959446 70023710 71737075 73129594 74320579 75797248 77947056
1478.7G7947056K807182K983052K505845J869142J387417J059997P50816M47184K14910
$$ 77947056 80754238 83737290 86243135 88112277 89499694 90559691 91310507 91757691 91972601
1497.1I1972601J10054J15502R5094p9614k68627o9737k9230k11299m64922o95377
$$ 91972601 92082655 92198157 92293251 92213637 91945010 91875273 91846043 91634744 91169822 90474445
1517.5I0474445q94672j313883j398510j339739j410717j087499o88654k07937M55886
$$ 90474445 89579773 88265890 86867380 85527641 84116924 83029425 82340771 82132834 82588720
1535.8H2588720Q44878J191974J481473J445371J379955J273769J255632J242327J161266
$$ 82588720 83433598 84625572 86107045 87552416 88932371 90206140 91461772 92704099 93865365
1554.2I3865365R97311J065194J362098R86135O87748N46831M09954L55798K61927
$$ 93865365 94862676 95927870 97289968 98276103 98963851 99510682 99920636 100276434 100538361
1572.6A00538361N7459j02627r7120j59419l63129n89287p93958r83292j145220j228058
$$ 100538361 100595820 100493193 100396073 100236654 99873525 99284238 98490280 97506988 96361768 95133710
1593I5133710j147235q88049n45442j65212K49427O12134Q61764R27573O81699K03120
$$ 95133710 93986475 93098426 92552984 92387772 92637199 93249333 94111097 95038670 95720369 95923489
1613.4I5923489m03404q77458p17020m88162l86911k52957l80122p05415r53788j475108
$$ 95923489 95520085 94642627 93925607 93437445 93050534 92797577 92417455 91712040 90758252 89283144
1633.7H9283144k202588j094174J176375K695507L080827K747780J956075R69559M74853
$$ 89283144 87080556 85986382 87162757 89858264 92939091 95686871 97642946 98612505 99087358
1652.1I9087358M56786M31019K71576J07539L946K825m2772k12693l07823k67577l89099
$$ 99087358 99544144 99975163 100246739 100354278 100358224 100361049 100318277 100105584 99797761 99530184 99141085
1674.5I9141085m75162m23628m51136p00283j048398r06360r41348j282883j501912
$$ 99141085 98665923 98242295 97791159 97090876 96042478 95136118 94194770 92911887 91409975
1692.9I1409975k147382k710998k988416l797925l397113l684401m790253n072760
$$ 91409975 89262593 86551595 83563179 79765254 76368141 72683740 67893487 62820727
1709.2F2820727n305976n524260n651784n376845l294838p66048Q83204K242413L377751
$$ 62820727 57514751 51990491 46338707 40961862 37667024 36900976 37784180 40026593 43404344
1727.6D3404344M159897M535529N349750N513912M465807M542356M722899M342258
$$ 43404344 47564241 52099770 57449520 62963432 67429239 71971595 76694494 81036752
1743.9H1036752L984631L588807L284741K765214J971746J444280J145059Q51440P00068
$$ 81036752 85021383 88610190 91894931 94660145 96631891 98076171 99221230 100072670 100772738
1762.2A00772738N74923M12071L03674K42912K67005L22712K87628K12586J84595J85931
$$ 100772738 101347661 101759732 102063406 102306318 102573323 102896035 103183663 103396249 103580844 103766775
1782.6A03766775J81687J66929J25706P7891J11842J67025J44767J11950J12355J41191
$$ 103766775 103948462 104115391 104241097 104318988 104430830 104597855 104742622 104854572 104966927 105108118
1803A05108118J38128J01507P4994R2876J17588J06013Q6629Q2505O9237L8671M3691
$$ 105108118 105246246 105347753 105422747 105515623 105633211 105739224 105825853 105908358 105977595 106016266 106059957
1825.5A06059957N0103M5383Q6391R8646N5563L9387M4119P272k6011J9133N8722M0436
$$ 106059957 106110060 106155443 106241834 106340480 106396043 106435430 106479549 106486821 106460810 106479943 106538665 106579101
1850A06579101J3399l028k050k515j2196k1326l5381p0417r4128m0328R810p367l5476
$$ 106579101 106592500 106589472 106587422 106584907 106572711 106551385 106516004 106445587 106351459 106311131 106320941 106313574 106278098
1876.5A06278098m1223l7193l1758k0694j8823k8003M53K4939K599L087J5986M768
$$ 106278098 106236875 106199682 106167924 106147230 106128407 106100404 106100857 106125796 106128395 106131482 106147468 106152236
1900.9A06152236m971o914k1243k9397q821R346J108j7166r155O91M173L2830N1677
$$ 106152236 106147265 106140351 106119108 106089711 106080890 106090236 106091344 106074178 106065023 106065714 106069887 106102717 106154394
1927.5A06154394M6885M1545L5739L1030L1507J5878j0204O867L6394K0909l612n972
$$ 106154394 106201279 106242824 106278563 106309593 106341100 106356978 106346774 106353641 106390035 106410944 106407332 106401360
1951.9A06401360K003l422j7809k0385j1921p498j5164j4090l183o80n007j4448k2483
$$ 106401360 106403363 106399941 106382132 106361747 106349826 106342328 106327164 106313074 106309891 106309211 106304204 106289756 106267273
1978.5A06267273k1648j3602q106j9824l5310m2928l4534j1588j3578k5904k0194j9848
$$ 106267273 106245625 106232023 106223917 106204093 106168783 106125855 106091321 106079733 106066155 106040251 106020057 106000209
2002.9A06000209l1662l1412j7488q321j764L22P27J4055K3591K1017K6512M0674N0414
$$ 106000209 105968547 105937135 105919647 105911326 105909562 105909884 105910611 105924666 105948257 105969274 105995786 106036460 106086874
2029.4A06086874M8149M2438M7255N4419N2094N0485N6351N5766M9185M1724L3652
$$ 106086874 106135023 106177461 106224716 106279135 106331229 106381714 106438065 106493831 106543016 106584740 106618392
2051.9A06618392L2092L3736L0315K2006J0609J610N650J6415K2018K0981J4591J0372
$$ 106618392 106650484 106684220 106714535 106736541 106747150 106748760 106754410 106770825 106792843 106813824 106828415 106838787
2076.4A06838787P629K217j239k254Q83J2588K2733K0039J8454K6011K2626J0431J0348
$$ 106838787 106846416 106848633 106847394 106845140 106846023 106858611 106881344 106901383 106919837 106945848 106968474 106978905 106989253
2102.9A06989253J6522J7750J4425N805j454k051j07J812K813N13m125j1742j8096
$$ 106989253 107005775 107023525 107037950 107043755 107042301 107040250 107040143 107041955 107044768 107045281 107041156 107029414 107011318
2129.4A07011318j4066j0813j3792j3578j1194j4758k2566k0731j3184j5760k1911
$$ 107011318 106997252 106986439 106972647 106959069 106947875 106933117 106910551 106889820 106876636 106860876 106838965
2151.8A06838965j5294n591r704j8429j6046j0169r918j0001j0884p963j312J788K659
$$ 106838965 106823671 106818080 106808376 106789947 106773901 106763732 106753814 106743813 106732929 106724966 106723654 106725442 106728101
2178.3A06728101K694M709L242l946m589k074l183l064p057j1254k968M208r65o855
$$ 106728101 106730795 106735504 106738746 106734800 106730211 106728137 106724954 106721890 106714833 106703579 106700611 106704819 106703854 106696999
2206.9A06696999j0824j1373p188j216P904O270r048j5056n615k265q964l791R024
$$ 106696999 106686175 106674802 106667614 106666398 106674302 106680572 106671524 106656468 106650853 106648588 106639624 106635833 106644857
2233.4A06644857P248q58K670Q690J1480J2147Q488Q035N078l457n770l886m637n341
$$ 106644857 106652105 106651247 106653917 106662607 106674087 106686234 106694722 106702757 106707835 106704378 106698608 106694722 106690085 106684744
2262A06684744n006p213m112N150N364m8L350P653K086K027J6117K7788K7656K5142
$$ 106684744 106679738 106672525 106668413 106673563 106678927 106678879 106682229 106689882 106691968 106693995 106710112 106737900 106765556 106790698
2290.5A06790698K9218L2496K3258J6689L7253N9593N8055O3145Q0836Q0418O5029
$$ 106790698 106819916 106852412 106875670 106892359 106929612 106989205 107047260 107110405 107191241 107271659 107336688
2312.9A07336688N6613O7067R6488J16038J11258J08612J06716Q2898M9221L1984L4750
$$ 107336688 107393301 107460368 107556856 107672894 107784152 107892764 107999480 108082378 108131599 108163583 108198333
2335.4A08198333M4513M4393J1444p1072j57476j26028J9193J74677K59996K38108
$$ 108198333 108242846 108287239 108298683 108227611 108070135 107944107 107963300 108137977 108397973 108636081
2355.8A08636081J51766O1917m3607j63686k09057k21932k26450j92190j64890j45554
$$ 108636081 108787847 108849764 108806157 108642471 108433414 108211482 107985032 107792842 107627952 107482398
2376.2A07482398j20366r6214o4289l3439k2149k0385r787N424J4925J7536J4734J0431
$$ 107482398 107362032 107265818 107201529 107168090 107145941 107125556 107115769 107121193 107136118 107153654 107168388 107178819
2400.6A07178819O497j204n054K741N377m840j5843j6487p939k277J729K193r632j6964
$$ 107178819 107185316 107184112 107179058 107181799 107187176 107182336 107166493 107150006 107142067 107139790 107141519 107143712 107134080 107117116
2429.2A07117116q535j001n603j3149j3053j0908j4472j2815o723j2815k1720j8716
$$ 107117116 107108581 107107580 107101977 107088828 107075775 107064867 107050395 107037580 107030857 107018042 106996322 106977606
2453.7A06977606p761k277r453j8108j8430j2731r585n209M840O330l374o365N030
$$ 106977606 106969845 106967568 106958115 106940007 106921577 106908846 106899261 106894052 106898892 106905222 106901848 106895483 106900513
2480.2A06900513J3340J0097R381J3304J5414J3566J0300J5187K2757K2244K0576K2554
$$ 106900513 106913853 106923950 106933331 106946635 106962049 106975615 106985915 107001102 107023859 107046103 107066679 107089233
2504.7A07089233K3759J9407J2565R572R430R846M363k372K504R596M947n937j1408
$$ 107089233 107112992 107132399 107144964 107154536 107163966 107173812 107178175 107175803 107178307 107187903 107192850 107186913 107175505
2531.2A07175505j3053j3876j2398j0133j0216j5843j8346j3685j7024k4819k7203
$$ 107175505 107162452 107148576 107136178 107126045 107115829 107099986 107081640 107067955 107050931 107026112 106998909
2553.6A06998909l3319m1867n1987o3443o9487p5639r1147j16050j30141j20831j03902
$$ 106998909 106965590 106923723 106871736 106808293 106738806 106663167 106572020 106455970 106325829 106204998 106101096
2576A06101096r1505p9263o2537m1246k3723j2934n102k957j716n305j3352j4817j1444
$$ 106101096 106009591 105930328 105867791 105826545 105802822 105789888 105784786 105781829 105780113 105774808 105761456 105746639 105735195
2602.6A05735195l136J526p724j8669k0957k1469k9838m9401p1513r1744j09732j13678
$$ 105735195 105732059 105733585 105725861 105707192 105686235 105664766 105634928 105585527 105514014 105422270 105312538 105198860
2627A05198860j05071j03056j04785r0015p0632n6410l6192k1934k1124j6045p904
$$ 105198860 105093789 104990733 104885948 104795933 104725301 104668891 104632699 104610765 104589641 104573596 104565692
2649.5A04565692j4746l2389n3049o9391p6175q4829r5260r4307p8320o2013n5850
$$ 104565692 104550946 104518557 104465508 104396117 104319942 104235113 104139853 104045546 103967226 103905213 103849363
2671.9A03849363m9710l7849k0528J1468M3452L4606r346m6420o6185q0764j01566
$$ 103849363 103799653 103761804 103741276 103752744 103796196 103830802 103821456 103775036 103708851 103628087 103526521
2694.3A03526521j24169j26981j11556r3365p9131q2600r9707j17111j46950j87587
$$ 103526521 103402352 103275371 103163815 103070450 102991319 102908719 102809012 102691901 102544951 102357364
2714.7A02357364k19095k44486k63882k68519k56169k09844j59562j55651j70779j76323
$$ 102357364 102138269 101893783 101629901 101361382 101105213 100895369 100735807 100580156 100409377 100233054
2735.1A00233054j63960j42712j53005j89382k38669k82657k71165k34562k52307l08549
$$ 100233054 100069094 99926382 99773377 99583995 99345326 99062669 98791504 98556942 98304635 97996086
2755.5I7996086l37201l34287l27504l31282l37100l30323l22897l38715l51948l08299
$$ 97996086 97658885 97324598 96997094 96665812 96328712 95998389 95675492 95336777 94984829 94676530
2775.9I4676530k56961k63113k83986k86603k94864k99550k54374j83577j62297j76948
$$ 94676530 94419569 94156456 93872470 93585867 93291003 92991453 92737079 92553502 92391205 92214257
2796.3I2214257j46956q3685p4356j14763j53601j92368k31141k91240l94643n04154
$$ 92214257 92067301 91983616 91909260 91794497 91640896 91448528 91217387 90926147 90531504 90027350
2816.7I0027350o09779p25132q52013j018399j245171j522368j821750k123368k423185
$$ 90027350 89417571 88692439 87840426 86822027 85576856 84054488 82232738 80109370 77686185
2835.1G7686185k690494k905769l087741l216660l257483l210032l096986k924329
$$ 77686185 74995691 72089922 69002181 65785521 62528038 59318006 56221020 53296691
2851.4E3296691k675956k373222k056619j762724j504356j243055r65121o90142l94856
$$ 53296691 50620735 48247513 46190894 44428170 42923814 41680759 40715638 40025496 39630640
2869.7C9630640p4700J99097L92020N34955O03473N52264M08983K32872O3703o9290
$$ 39630640 39555940 39755037 40147057 40682012 41285485 41837749 42246732 42479604 42543307 42474017
2890.1D2474017j35971j26141m4051R7090K70129M43008N93907O98828P29517O89461
$$ 42474017 42338046 42211905 42167854 42264944 42535073 42978081 43571988 44270816 45000333 45689794
2910.5D5689794N90349M23592J82116j21504m60106p86814j020307j066494q63057
$$ 45689794 46280143 46703735 46885851 46764347 46304241 45517427 44497120 43430626 42567569
2928.9D2567569l94216L33038J241147K134016K787361L072423K984947K607095K048755
$$ 42567569 42173353 42506391 43747538 45881554 48668915 51741338 54726285 57333380 59382135
2947.2E9382135J391005O73682q3620r17148j887363k965618m000330m690331m678100
$$ 59382135 60773140 61446822 61363202 60446054 58558691 55593073 51592743 46902412 42224312
2965.6D2224312l822720k380303q04999N23633J436957K051053K525022K922222L350756
$$ 42224312 38401592 36021289 35216290 35739923 37176880 39227933 41752955 44675177 48025933
2984D8025933L851369M325032M686588M879046M894966M740935M405880L938168L384602
$$ 48025933 51877302 56202334 60888922 65767968 70662934 75403869 79809749 83747917 87132519
3002.3H7132519K803129K260471J766288J339460J034784Q47554P17437O14995N40805
$$ 87132519 89935648 92196119 93962407 95301867 96336651 97184205 97901642 98516637 99057442
3020.7I9057442M91655M57054M15743L36742K39813J75619J68860J71936J10090M8887
$$ 99057442 99549097 100006151 100421894 100758636 100998449 101174068 101342928 101514864 101624954 101673841
3041.1A01673841P9179J51182J75535J38295J12367J23691J19257J06680R7585N8246
$$ 101673841 101753020 101904202 102079737 102218032 102330399 102454090 102573347 102680027 102777612 102835858
3061.5A02835858J478l6454p355O9475Q6593K5845n2166p4005o473N1606L6168J3828
$$ 102835858 102837336 102800882 102793527 102863002 102949595 102975440 102923274 102849269 102842796 102894402 102930570 102944398
3085.9A02944398J43j2612m185k6011r4020j43314j30653o6364j0169J5045O5410J43909
$$ 102944398 102944541 102931929 102927744 102901733 102807713 102664399 102533746 102467382 102457213 102472258 102537668 102681577
3110.4A02681577J38402M7827J1134L9172O6889Q0788O1881R036k6095j2862R143n591
$$ 102681577 102819979 102867806 102878940 102918112 102985001 103065789 103127670 103136706 103110611 103097749 103106892 103101301
3134.9A03101301l8171l3164J2136L5822J6475o759k4641l8540j5772K4999K6083n365
$$ 103101301 103063130 103029966 103042102 103077924 103094399 103087640 103062999 103024459 103008687 103033686 103059769 103054404
3159.4A03054404k8002k9147k7501l7670m9961o0499o4003n0485l9840m9269o2812
$$ 103054404 103026402 102997255 102969754 102932084 102882123 102821624 102757621 102707136 102667296 102618027 102555215
3181.8A02555215o3467n7745n8090n1439l9303l3963l2115l1972k7394k0481k1255
$$ 102555215 102491748 102434003 102375913 102324474 102285171 102251208 102219093 102187121 102159727 102139246 102117991
3204.2A02117991k6702j8418j4103m1604o0808n2166n1547n6087n7602p3505r5379
$$ 102117991 102091289 102072871 102058768 102017164 101956356 101904190 101852643 101796556 101738954 101665449 101570070
3226.7A01570070j19353j41990j30427p9643n3430q9729j27184j43731j66392j57249
$$ 101570070 101450717 101308727 101178300 101098657 101045227 100955498 100828314 100684583 100518191 100360942
3247.1A00360942j14477j11961j58888j74523j38247j20604j35052j41919j41745j68968
$$ 100360942 100246465 100134504 99975616 99801093 99662846 99542242 99407190 99265271 99123526 98954558
3267.5I8954558k03973j65373q7619o9087r3425j14363j26535j30629j28883j37580
$$ 98954558 98750585 98585212 98497593 98428506 98335081 98220718 98094183 97963554 97834671 97697091
3287.8I7697091j62429j56301j08003o9815n4026o1339r8419j15329q5247l8415P856
$$ 97697091 97534662 97378361 97270358 97200543 97146517 97085178 96986759 96871430 96786183 96747768 96755624
3310.3I6755624K0289j0043k9332k0676q929j8049l8689k9600j1920k1810l3778m7552
$$ 96755624 96775913 96765870 96736538 96715862 96706933 96688884 96650195 96620595 96608675 96586865 96553087 96505535
3334.8I6505535o1858l6764j544O414J4632J3459o592Q255M7356N2631K9492J1999
$$ 96505535 96443677 96406913 96405369 96411783 96426415 96439874 96433282 96441537 96488893 96541524 96571016 96583015
3359.2I6583015K0379L1787J6629N097L5143P8958P3409L2401J4299J4746J3668K431
$$ 96583015 96603394 96635181 96651810 96656907 96692050 96771008 96844417 96876818 96891117 96905863 96919531 96921962
3383.7I6921962k3907o5786j10584r3073k5743l1990j22922j60045o9022J4180m8268
$$ 96921962 96898055 96832269 96721685 96628612 96602869 96570879 96447957 96287912 96218890 96233070 96184802
3406.1I6184802j49769j65784j31935p9679n6511j06788j41251j12522j00517j49143
$$ 96184802 96035033 95869249 95737314 95657635 95601124 95494336 95353085 95240563 95140046 94990903
3426.5I4990903j97726j79226j69700j90717q3572Q8442R1457l9118j51050j82510
$$ 94990903 94793177 94613951 94444251 94253534 94169962 94258404 94349861 94310743 94159693 93977183
3446.9I3977183j22493p4000r1439j10984j43075j65874r4372l4606j06293j44422
$$ 93977183 93854690 93780690 93689251 93578267 93435192 93269318 93174946 93140340 93034047 92889625
3467.3I2889625m029J38133R6661k1773p7457o4641K140L1072q065j0144K0533J7125
$$ 92889625 92885596 93023729 93120390 93098617 93021160 92956519 92958659 92989731 92981666 92971522 92992055 93009180
3491.8I3009180p701j0651L3754O5750M3529P7760J54287J33246Q8644J22219J70475
$$ 93009180 93001479 92990828 93024582 93090332 93133861 93211621 93365908 93499154 93587798 93710017 93880492
3514.2I3880492J89007J99002J86562J53315J76108K28948K37488K56807K72393K38216
$$ 93880492 94069499 94268501 94455063 94608378 94784486 95013434 95250922 95507729 95780122 96018338
3534.6I6018338K27791K60574K49588J91766J68759K26611K90835K58589K18975K32494
$$ 96018338 96246129 96506703 96756291 96948057 97116816 97343427 97634262 97892851 98111826 98344320
3555I8344320K19345J86515J82426J80614J05810N0807J73843K67714K23905J81931
$$ 98344320 98563665 98750180 98932606 99113220 99219030 99269837 99443680 99711394 99935299 100117230
3575.4A00117230J61076J32549J34587J36078R0670R9754K20192K49302J94466J93596
$$ 100117230 100278306 100410855 100545442 100681520 100772190 100871944 101092136 101341438 101535904 101729500
3595.8A01729500K14827K17176K33519K23231J64628J43159J76489J72782J64521J78373
$$ 101729500 101944327 102161503 102395022 102618253 102782881 102926040 103102529 103275311 103439832 103618205
3616.2A03618205J50632J65904K41864K43807J35982K7632J34385K41423K03776J66261
$$ 103618205 103768837 103934741 104176605 104420412 104556394 104584026 104718411 104959834 105163610 105329871
3636.6A05329871J44839J27876J35935J08552j6117j05560R7847K92956K05672P3147
$$ 105329871 105474710 105602586 105738521 105847073 105830956 105725396 105823243 106116199 106321871 106395018
3657A06395018Q5652J32239J38283J15299M3535l4571J6284N0378q881P4005J59347
$$ 106395018 106480670 106612909 106751192 106866491 106910026 106875455 106891739 106942117 106933236 107007241 107166588
3679.4A07166588J36435J04380L5942p1609j6714J96064K27702J45924J07395O3742
$$ 107166588 107303023 107407403 107443345 107371736 107355022 107551086 107778788 107924712 108032107 108095849
3699.8A08095849J0752L3117N1271j0418q6451o1381N1236R2757N9891j145m3439k4689
$$ 108095849 108106601 108139718 108190989 108180571 108094120 108032739 108083975 108176732 108236623 108235478 108192039 108167350
3724.3A08167350K4140M8649k253j21533j80138m5406J18279J16634l779p0095L553
$$ 108167350 108191490 108240139 108237886 108116353 107936215 107890809 108009088 108125722 108121943 108051848 108055401
3746.7A08055401k5904j03128r489P1358K4951j1969K9838K9147k4545m1974m7123
$$ 108055401 108029497 107926369 107916880 107988238 108013189 108001220 108031058 108060205 108035660 107993686 107946563
3769.2A07946563k3175K6167R370o5768q2660N198L5524r262k3961j6690K885L314
$$ 107946563 107923388 107949555 107958925 107893157 107810497 107815695 107851219 107841957 107817996 107801306 107804191 107807505
3793.7A07807505l2151m5597p3588p2503K1410K6595P832O2001O1822j7059p4339p1537
$$ 107807505 107775354 107729757 107656169 107583666 107605076 107631671 107639503 107701504 107763326 107746267 107671928 107600391
3818.1A07600391r0790j7094Q5437N1653J3888M733j6117n0533r8026p6747K0778N4002
$$ 107600391 107509601 107492507 107577944 107629597 107643485 107648218 107632101 107581568 107483542 107406795 107427573 107481575
3842.6A07481575L5453N0878O2490j9062j46663p1442P4673P1752J7190j7870N341
$$ 107481575 107517028 107567906 107630396 107611334 107464671 107393229 107467902 107539654 107556844 107538974 107544315
3865A07544315J2481m1294n5754p487N4050N6529l1340n8234l3438k5582L5178K4820
$$ 107544315 107556796 107515502 107459748 107452261 107506311 107562840 107531500 107473266 107439828 107414246 107449424 107474244
3889.5A07474244j4758M2033N3549j9944p4828q0144l8481N1880Q5175L9339n913l9530
$$ 107474244 107459486 107501519 107555068 107535124 107460296 107380152 107341671 107393551 107478726 107518065 107512152 107472622
3914A07472622o7734m9103o997k0933n4658m0388k8562n6911n7793j3661N281j8835
$$ 107472622 107404888 107355785 107348788 107327855 107273197 107232809 107204247 107147336 107089543 107075882 107081163 107062328
3938.5A07062328n5885o2919m5025m8650m8685k5773j7536l4523o2573q1145o0571
$$ 107062328 107006443 106943524 106898499 106849849 106801164 106775391 106757855 106723332 106660759 106579614 106519043
3960.9A06519043k7847l1483m3428l6240l0827m0472n2726n0974l8683m2284n3704
$$ 106519043 106491196 106459713 106416285 106380045 106349218 106308746 106256020 106205046 106166363 106124079 106070375
3983.3A06070375m0662k9778m5991m3667r012N269n007
$$ 106070375 106029713 105999935 105953944 105910277 105901265 105906534 105901527
3997.6A05901527
$$ 105901527
##END=$$ End of the data block
